Place,Name,Division,BodyweightKg,Squat1Kg,Squat2Kg,Squat3Kg,Best3SquatKg,Bench1Kg,Bench2Kg,Bench3Kg,Best3BenchKg,Bench4Kg,Deadlift1Kg,Deadlift2Kg,Deadlift3Kg,Best3DeadliftKg,Deadlift4Kg,TotalKg,WeightClassKg,Sex,CyrillicName,BirthYear,Tested,Equipment,Event
1,Oksana Rumyantseva,Amateur Open,54,90,100,-110,100,45,-50,-50,45,,100,110,117.5,117.5,120,262.5,56,F,Оксана Румянцева,1978,Yes,Raw,SBD
2,Yuliya Tarasova,Amateur Open,55.8,55,-65,65,65,65,70,-72.5,70,,90,100,105,105,,240,56,F,Юлия Тарасова,1973,Yes,Raw,SBD
1,Galina Kalinina,Amateur Open,59.4,-87.5,90,-95,90,-50,52.5,-55,52.5,,107.5,112.5,117.5,117.5,,260,60,F,Галина Калинина,1981,Yes,Raw,SBD
1,Natalya Petukhova,Amateur Open,62,80,85,87.5,87.5,45,47.5,-50,47.5,,95,100,-105,100,,235,67.5,F,Наталья Петухова,1975,Yes,Raw,SBD
1,Aleksandr Rogatkin,Amateur Teen 13-15,58.1,95,100,105,105,60,65,,65,,120,125,130,130,,300,60,M,Александр Рогаткин,1995,Yes,Raw,SBD
DQ,Oleg Gandzyura,Amateur Juniors 20-23,60,-130,-130,-130,,-90,,,,,-160,,,,,,60,M,Олег Гандзюра,1989,Yes,Raw,SBD
1,Vladimir Bakaysa,Amateur Open,66.9,145,155,157.5,157.5,115,-122.5,-122.5,115,,-220,-220,220,220,,492.5,67.5,M,Владимир Бакайса,1985,Yes,Raw,SBD
1,Aleksandr Vanyushkin,Amateur Teen 16-17,74.8,160,165,170,170,90,95,-100,95,,180,190,-200,190,,455,75,M,Александр Ванюшкин,1992,Yes,Raw,SBD
1,Stanislav Repinskas,Amateur Teen 18-19,72.3,145,150,-155,150,100,105,107.5,107.5,,175,185,,185,,442.5,75,M,Станислав Репинскас,1990,Yes,Raw,SBD
2,Andrey Glavatskiy,Amateur Teen 18-19,73.8,125,-135,135,135,80,85,-90,85,,160,-170,-170,160,,380,75,M,Андрей Главацкий,1990,Yes,Raw,SBD
1,Nikolay Balugin,Amateur Juniors 20-23,73.8,170,177.5,-182.5,177.5,120,125,127.5,127.5,,180,185,-190,185,,490,75,M,Николай Балугин,1987,Yes,Raw,SBD
2,Sergey Alekhin,Amateur Juniors 20-23,71,-140,145,-155,145,110,120,-122.5,120,,175,190,202.5,202.5,,467.5,75,M,Сергей Алехин,1989,Yes,Raw,SBD
3,Artem Smirnov,Amateur Juniors 20-23,73.5,90,100,110,110,-75,75,-80,75,,120,140,150,150,,335,75,M,Артем Смирнов,1988,Yes,Raw,SBD
1,Andrey Konovalenko,Amateur Open,73.3,185,192.5,-195,192.5,122.5,127.5,132.5,132.5,,185,192.5,195,195,,520,75,M,Андрей Коноваленко,1982,Yes,Raw,SBD
3,Semen Vasyukov,Amateur Open,73.9,145,-155,157.5,157.5,100,105,107.5,107.5,,175,185,-195,185,,450,75,M,Семен Васюков,1986,Yes,Raw,SBD
4,Vladimir Kudinov,Amateur Open,71.8,-120,125,-130,125,100,-110,-110,100,,165,175,185,185,,410,75,M,Владимир Кудинов,1970,Yes,Raw,SBD
1,Pavel Danilov,Amateur Juniors 20-23,82.5,-185,190,-205,190,165,-172.5,172.5,172.5,,225,235,-242.5,235,,597.5,82.5,M,Павел Данилов,1988,Yes,Raw,SBD
2,Aleksandr Shustov,Amateur Juniors 20-23,81.9,185,-200,200,200,117.5,122.5,-127.5,122.5,,205,215,-222.5,215,,537.5,82.5,M,Александр Шустов,1987,Yes,Raw,SBD
DD,Denis Akimov,Amateur Juniors 20-23,81.8,190,-200,200,200,115,120,125,125,,200,220,230,230,,,82.5,M,Денис Акимов,1988,Yes,Raw,SBD
1,Andrey Omelchenko,Amateur Open,81.3,210,-217.5,-217.5,210,160,-165,-165,160,,215,222.5,232.5,232.5,,602.5,82.5,M,Андрей Омельченко,1981,Yes,Raw,SBD
2,Andrey Venglovskiy,Amateur Open,80.8,200,205,210,210,-145,150,-152.5,150,,-232.5,232.5,-240,232.5,,592.5,82.5,M,Андрей Венгловский,1974,Yes,Raw,SBD
3,Aleksandr Leonidov,Amateur Open,81.9,-170,175,-185,175,130,135,-140,135,,190,,,190,,500,82.5,M,Александр Леонидов,1981,Yes,Raw,SBD
4,Andrey Pankov #2,Amateur Open,80.9,125,130,135,135,-105,-105,107.5,107.5,,150,165,170,170,,412.5,82.5,M,Андрей Паньков,1982,Yes,Raw,SBD
1,Sergey Subbotin,Amateur Masters 50-54,77.7,-120,120,-130,120,-100,100,-105,100,,160,170,175,175,,395,82.5,M,Сергей Субботин,1956,Yes,Raw,SBD
1,Dmitriy Pavlovskiy,Amateur Juniors 20-23,89.3,165,175,185,185,120,127.5,135,135,,200,215,227.5,227.5,,547.5,90,M,Дмитрий Павловский,1988,Yes,Raw,SBD
1,Sergey Kolotvin,Amateur Open,89.4,210,220,-227.5,220,167.5,175,-180,175,,245,260,-270,260,,655,90,M,Сергей Колотвин,1985,Yes,Raw,SBD
2,Vladimir Orlov,Amateur Open,88.8,180,187.5,192.5,192.5,120,125,130,130,,235,245,252.5,252.5,,575,90,M,Владимир Орлов,1977,Yes,Raw,SBD
3,Timur Mamedov,Amateur Open,88.2,-180,180,195,195,125,132.5,137.5,137.5,,200,215,220,220,,552.5,90,M,Тимур Мамедов,1983,Yes,Raw,SBD
4,Aleksandr Shuralev,Amateur Open,89.5,-190,190,-200,190,145,150,-155,150,,190,200,207.5,207.5,,547.5,90,M,Александр Шуралев,1975,Yes,Raw,SBD
5,Nikolay Dobrokhotov,Amateur Open,86,165,170,,170,125,130,132.5,132.5,,200,210,-217.5,210,,512.5,90,M,Николай Доброхотов,1957,Yes,Raw,SBD
6,Mikhail Savushkin,Amateur Open,88.5,155,165,170,170,125,132.5,135,135,,180,195,202.5,202.5,,507.5,90,M,Михаил Савушкин,1977,Yes,Raw,SBD
7,Andrei Zhilin,Amateur Open,89,150,160,170,170,125,130,-132.5,130,,-200,200,-210,200,,500,90,M,Андрей Жилин,1980,Yes,Raw,SBD
8,Valeriy Sytnikov,Amateur Open,86.9,160,,,160,125,,,125,,210,,,210,,495,90,M,Валерий Сытников,1970,Yes,Raw,SBD
9,Aleksandr Gubanov,Amateur Open,86.3,-140,145,155,155,105,115,120,120,,185,200,210,210,,485,90,M,Александр Губанов,1982,Yes,Raw,SBD
10,Maksim Shokhalevich,Amateur Open,83.6,150,165,170,170,100,-105,-105,100,,170,180,-190,180,,450,90,M,Максим Шохалевич,1979,Yes,Raw,SBD
11,Yuriy Babintsev,Amateur Open,86.1,145,155,-160,155,100,-107.5,107.5,107.5,,170,180,-190,180,,442.5,90,M,Юрий Бабинцев,1979,Yes,Raw,SBD
DQ,Pavel Bychkov,Amateur Open,88.2,182.5,185,187.5,187.5,-142.5,-142.5,-142.5,,,-220,,,,,,90,M,Павел Бычков,1975,Yes,Raw,SBD
DQ,Roman Golichenkov,Amateur Open,84.2,-140,140,-150,140,-100,-100,-100,,,-170,,,,,,90,M,Роман Голиченков,1982,Yes,Raw,SBD
1,Valeriy Sytnikov,Amateur Masters 40-44,86.9,-150,150,160,160,110,120,125,125,,-210,210,-220,210,,495,90,M,Валерий Сытников,1970,Yes,Raw,SBD
1,Eduard Tarasov,Amateur Masters 45-49,89,100,115,125,125,100,110,115,115,,150,165,175,175,,415,90,M,Эдуард Тарасов,1962,Yes,Raw,SBD
1,Kirill Lomanov,Amateur Juniors 20-23,99.9,-150,-160,160,160,112.5,117.5,122.5,122.5,,210,-225,-225,210,,492.5,100,M,Кирилл Ломанов,1987,Yes,Raw,SBD
1,Kirill Valeev,Amateur Open,95.5,250,270,-280,270,160,170,-180,170,,250,262.5,-267.5,262.5,,702.5,100,M,Кирилл Валеев,1982,Yes,Raw,SBD
2,Konstantin Morozov #1,Amateur Open,97.3,202.5,207.5,,207.5,165,170,-175,170,,280,-295,,280,,657.5,100,M,Константин Морозов,1984,Yes,Raw,SBD
3,Aleksey Belanchik,Amateur Open,96.9,185,195,-200,195,125,135,-145,135,,215,225,-245,225,,555,100,M,Алексей Беланчик,1974,Yes,Raw,SBD
DQ,Bogdan Boyko,Amateur Teen 16-17,107.5,-100,-120,-120,,-100,,,,,-130,,,,,,110,M,Богдан Бойко,1992,Yes,Raw,SBD
1,Stanislav Ivanov,Amateur Juniors 20-23,102.7,180,-190,190,190,140,150,160,160,,230,240,250,250,,600,110,M,Станислав Иванов,1989,Yes,Raw,SBD
1,Igor Golovanov,Amateur Open,105,-180,180,190,190,145,150,-155,150,,215,230,240,240,,580,110,M,Игорь Голованов,1983,Yes,Raw,SBD
1,Igor Ziganchin,Amateur Open,121.9,250,260,265,265,185,192.5,197.5,197.5,,255,270,282.5,282.5,,745,125,M,Игорь Зиганчин,1960,Yes,Raw,SBD
2,Dmitriy Krikov,Amateur Open,121.4,230,-250,-250,230,165,170,-175,170,,240,250,260,260,,660,125,M,Дмитрий Криков,1980,Yes,Raw,SBD
1,Aleksandr Scherbak,Amateur Masters 40-44,115.5,195,205,210,210,155,160,162.5,162.5,,230,237.5,-242.5,237.5,,610,125,M,Александр Щербак,1966,Yes,Raw,SBD
1,Andrey Baydalov,Pro Teen 18-19,80.1,167.5,-175,175,175,145,152.5,155,155,,220,230,235,235,,565,82.5,M,Андрей Байдалов,1991,No,Raw,SBD
1,Aleksey Kolenkin,Pro Open,79,170,180,190,190,130,137.5,142.5,142.5,,210,220,230,230,,562.5,82.5,M,Алексей Коленкин,1983,No,Raw,SBD
2,Anton Anikanov,Pro Open,79,160,-170,,160,-140,-145,150,150,,200,-215,-215,200,,510,82.5,M,Антон Аниканов,1985,No,Raw,SBD
DQ,Aleksandr Neustroev,Pro Open,81.2,120,130,-135,130,-105,-105,-105,,,-145,,,,,,82.5,M,Александр Неустроев,1982,No,Raw,SBD
1,Denis Lobanov,Pro Juniors 20-23,89.2,-130,130,140,140,125,135,-140,135,,160,180,200,200,,475,90,M,Денис Лобанов,1986,No,Raw,SBD
1,Valeriy Beloglazov,Pro Open,86.9,200,210,220,220,145,-155,-155,145,,230,245,-255,245,,610,90,M,Валерий Белоглазов,1981,No,Raw,SBD
DQ,Igor Paramonov,Pro Open,83.3,190,-205,-205,190,-150,-155,-155,,,-200,,,,,,90,M,Игорь Парамонов,1983,No,Raw,SBD
1,Andrey Zakhartsev,Pro Masters 40-44,85.3,170,190,200,200,140,150,155,155,,180,195,205,205,,560,90,M,Андрей Захарцев,1966,No,Raw,SBD
1,Pavel Sudakov,Pro Teen 18-19,97.2,200,-215,220,220,140,150,155,155,,230,245,-255,245,,620,100,M,Павел Судаков,1991,No,Raw,SBD
1,Artem Petukhov,Pro Open,99.2,240,-250,250,250,150,-160,160,160,,270,280,300,300,,710,100,M,Артем Петухов,1979,No,Raw,SBD
2,Pavel Sudakov,Pro Open,97.2,220,,,220,155,,,155,,245,,,245,,620,100,M,Павел Судаков,1991,No,Raw,SBD
3,Dmitriy Melikhov,Pro Open,95.4,190,200,205,205,145,-150,-155,145,,205,215,220,220,,570,100,M,Дмитрий Мелихов,1979,No,Raw,SBD
DQ,Denis Matyushin,Pro Open,96.1,-210,-215,-215,,-170,,,,,-240,,,,,,100,M,Денис Матюшин,1984,No,Raw,SBD
1,Kirill Bakarinov,Pro Juniors 20-23,114.5,200,215,225,225,130,137.5,145,145,,230,-240,240,240,,610,125,M,Кирилл Бакаринов,1987,No,Raw,SBD
2,Roman Isaev,Pro Juniors 20-23,120.7,150,160,165,165,105,110,115,115,,210,220,-230,220,,500,125,M,Роман Исаев,1987,No,Raw,SBD
1,Mikhail Ivankov,Pro Open,125,220,-230,,220,170,180,-187.5,180,,240,-250,,240,,640,125,M,Михаил Иванков,1983,No,Raw,SBD
1,Aleksey Zhiburkin,Amateur Open,75,220,-235,-235,220,130,-140,-140,130,,200,215,-220,215,,565,75,M,Алексей Жибуркин,1985,Yes,Multi-ply,SBD
2,Igor Filippov,Amateur Open,73.7,185,-200,200,200,110,120,125,125,,200,212.5,225,225,,550,75,M,Игорь Филиппов,1984,Yes,Multi-ply,SBD
1,Aleksey Samburov,Amateur Open,99.1,240,260,272.5,272.5,170,-175,,170,,240,260,-275,260,,702.5,100,M,Алексей Самбуров,1975,Yes,Multi-ply,SBD
2,Arseniy Novikov,Amateur Open,95.4,-180,180,190,190,135,140,-145,140,,190,-210,-210,190,,520,100,M,Арсений Новиков,1986,Yes,Multi-ply,SBD
1,Denis Makeev #1,Amateur Open,127.1,205,220,235,235,165,172.5,-177.5,172.5,,-245,250,265,265,,672.5,140,M,Денис Макеев,1983,Yes,Multi-ply,SBD
1,Aleksey Zinyagin,Pro Juniors 20-23,88.9,220,-230,230,230,130,140,-150,140,,-215,215,225,225,,595,90,M,Алексей Зинягин,1988,No,Multi-ply,SBD
1,Timofey Markov,Pro Open,87.9,215,230,-237.5,230,140,150,160,160,,250,262.5,270,270,,660,90,M,Тимофей Марков,1982,No,Multi-ply,SBD
DQ,Bogdan Gutsalo,Pro Open,84.5,-210,-210,-210,,-140,,,,,-210,,,,,,90,M,Богдан Гуцало,1981,No,Multi-ply,SBD
1,Maksim Avtukhov,Pro Teen 18-19,98.7,220,-230,230,230,140,150,155,155,,235,-250,,235,,620,100,M,Максим Автухов,1990,No,Multi-ply,SBD
1,Aleksey Yakovlev,Pro Open,94.2,-260,-260,260,260,175,185,200,200,,250,-260,-260,250,,710,100,M,Алексей Яковлев,1978,No,Multi-ply,SBD
2,Dmitriy Kovalev,Pro Open,99.5,-240,240,250,250,155,165,-170,165,,250,280,-295,280,,695,100,M,Дмитрий Ковалев,1977,No,Multi-ply,SBD
1,Sergey Galkin,Pro Open,107,230,-250,260,260,220,235,240,240,,230,250,-260,250,,750,110,M,Сергей Галкин,1981,No,Multi-ply,SBD
1,Aleksey Milovanov,Pro Open,121.4,-330,350,370,370,190,200,210,210,,280,295,-305,295,,875,125,M,Алексей Милованов,1976,No,Multi-ply,SBD
2,Vladimir Shmyrin,Pro Open,120.3,305,-320,-320,305,210,-220,-220,210,,300,320,-330,320,,835,125,M,Владимир Шмырин,1984,No,Multi-ply,SBD
1,Maryana Naumova,Amateur Youth,44,,,,,40,47.5,48.5,48.5,-50,,,,,,48.5,44,F,Марьяна Наумова,1999,Yes,Raw,B
1,Olga Kazantseva,Amateur Masters 45-49,41.7,,,,,30,35,-40,35,,,,,,,35,44,F,Ольга Казанцева,1961,Yes,Raw,B
1,Mariya Lapshova,Amateur Teen 18-19,44.9,,,,,40,45,-47.5,45,,,,,,,45,48,F,Мария Лапшова,1991,Yes,Raw,B
1,Yuliya Tarasova,Amateur Open,55.8,,,,,62.5,67.5,70,70,72.5,,,,,,70,56,F,Юлия Тарасова,1973,Yes,Raw,B
2,Nadezhda Vlasova,Amateur Open,52.8,,,,,47.5,-50,-50,47.5,,,,,,,47.5,56,F,Надежда Власова,1982,Yes,Raw,B
1,Svetlana Zanozina,Amateur Open,58.9,,,,,55,-60,-60,55,,,,,,,55,60,F,Светлана Занозина,1982,Yes,Raw,B
1,Natalya Demyanenko,Amateur Open,65,,,,,62.5,67.5,70,70,,,,,,,70,67.5,F,Наталья Демьяненко,1971,Yes,Raw,B
1,Darya Selyaeva,Amateur Juniors 20-23,69.1,,,,,65,72.5,-75,72.5,,,,,,,72.5,75,F,Дарья Селяева,1988,Yes,Raw,B
1,Elizaveta Sprogis,Amateur Open,91.1,,,,,57.5,60,-65,60,,,,,,,60,90+,F,Елизавета Спрогис,1977,Yes,Raw,B
1,Leonid Muravyev,Amateur Youth,51.3,,,,,47.5,50,52.5,52.5,,,,,,,52.5,52,M,Леонид Муравьев,1998,Yes,Raw,B
1,Ivan Gorelkin,Amateur Teen 16-17,50,,,,,55,60,-62.5,60,,,,,,,60,52,M,Иван Горелкин,1994,Yes,Raw,B
1,Ruslan Shishkin,Amateur Teen 18-19,58.8,,,,,95,100,-102.5,100,,,,,,,100,60,M,Руслан Шишкин,1991,Yes,Raw,B
2,Dmitriy Kosarev,Amateur Teen 18-19,59.7,,,,,95,-100,-100,95,,,,,,,95,60,M,Дмитрий Косарев,1990,Yes,Raw,B
1,Aleksandr Fedorov,Amateur Open,59.3,,,,,110,115,117.5,117.5,,,,,,,117.5,60,M,Александр Федоров,1976,Yes,Raw,B
1,Aleksandr Abramov,Amateur Teen 16-17,64,,,,,77.5,-85,-85,77.5,,,,,,,77.5,67.5,M,Александр Абрамов,1993,Yes,Raw,B
1,Maksim Sukhov,Amateur Teen 18-19,66.3,,,,,-80,80,-87.5,80,,,,,,,80,67.5,M,Максим Сухов,1990,Yes,Raw,B
1,Nikita Samokhvalov,Amateur Juniors 20-23,63,,,,,120,125,-127.5,125,,,,,,,125,67.5,M,Никита Самохвалов,1988,Yes,Raw,B
1,Ilya Kopyrev,Amateur Open,67.4,,,,,122.5,130,-132.5,130,,,,,,,130,67.5,M,Илья Копырев,1980,Yes,Raw,B
2,Nikita Samokhvalov,Amateur Open,63,,,,,125,,,125,,,,,,,125,67.5,M,Никита Самохвалов,1988,Yes,Raw,B
3,Andrei Zhilin,Amateur Open,67,,,,,117.5,122.5,125,125,,,,,,,125,67.5,M,Андрей Жилин,1980,Yes,Raw,B
4,Aleksey Schipanov,Amateur Open,64.2,,,,,105,107.5,110,110,,,,,,,110,67.5,M,Алексей Щипанов,1980,Yes,Raw,B
1,Gevorg Akopyan,Amateur Teen 18-19,73.3,,,,,110,120,130,130,,,,,,,130,75,M,Геворг Акопян,1990,Yes,Raw,B
2,Sergey Kokorev,Amateur Teen 18-19,72.3,,,,,105,110,-117.5,110,,,,,,,110,75,M,Сергей Кокорев,1990,Yes,Raw,B
DQ,Matvey Voskrebentsev,Amateur Teen 18-19,75,,,,,-120,-125,-125,,,,,,,,,75,M,Матвей Воскребенцев,1990,Yes,Raw,B
1,Stepan Dolushkin,Amateur Juniors 20-23,74,,,,,140,145,-155,145,,,,,,,145,75,M,Степан Долушкин,1987,Yes,Raw,B
2,Mikhail Lokhmotkin,Amateur Juniors 20-23,72.6,,,,,130,135,-140,135,,,,,,,135,75,M,Михаил Лохмоткин,1989,Yes,Raw,B
3,Ruslan Bayramov,Amateur Juniors 20-23,72.6,,,,,125,132.5,-140,132.5,,,,,,,132.5,75,M,Руслан Байрамов,1986,Yes,Raw,B
4,Anatoliy Lebedev,Amateur Juniors 20-23,71.5,,,,,-115,120,-125,120,,,,,,,120,75,M,Анатолий Лебедев,1989,Yes,Raw,B
DQ,Leonid Krimer,Amateur Juniors 20-23,73.8,,,,,-125,-125,-125,,,,,,,,,75,M,Леонид Кример,1989,Yes,Raw,B
1,Artem Larionov,Amateur Open,73.9,,,,,150,155,-160,155,,,,,,,155,75,M,Артем Ларионов,1978,Yes,Raw,B
2,Ivan Karangin,Amateur Open,72.6,,,,,140,-145,145,145,,,,,,,145,75,M,Иван Карангин,1985,Yes,Raw,B
3,Dmitriy Pshenichnykh,Amateur Open,75,,,,,115,125,130,130,,,,,,,130,75,M,Дмитрий Пшеничных,1985,Yes,Raw,B
4,Shomusa Saidibragimov,Amateur Open,71.7,,,,,115,-120,125,125,,,,,,,125,75,M,Шомуса Саидибрагимов,1978,Yes,Raw,B
5,Vladimir Lebedev,Amateur Open,73.5,,,,,120,-125,-125,120,,,,,,,120,75,M,Владимир Лебедев,1983,Yes,Raw,B
DQ,Ilya Rysev,Amateur Teen 18-19,76.5,,,,,-90,-90,-90,,,,,,,,,82.5,M,Илья Рысев,1990,Yes,Raw,B
1,Nikolay Balugin,Amateur Juniors 20-23,75.3,,,,,122.5,127.5,130,130,,,,,,,130,82.5,M,Николай Балугин,1987,Yes,Raw,B
2,Dmitriy Lepkov,Amateur Juniors 20-23,79.4,,,,,125,-132.5,-132.5,125,,,,,,,125,82.5,M,Дмитрий Лепков,1987,Yes,Raw,B
DQ,Aleksey Trofimov,Amateur Juniors 20-23,75.6,,,,,-102.5,-102.5,-102.5,,,,,,,,,82.5,M,Алексей Трофимов,1989,Yes,Raw,B
1,Aleksandr Drosin,Amateur Open,82.2,,,,,152.5,160,167.5,167.5,,,,,,,167.5,82.5,M,Александр Дросин,1982,Yes,Raw,B
2,Andrey Omelchenko,Amateur Open,82.3,,,,,155,162.5,-165,162.5,,,,,,,162.5,82.5,M,Андрей Омельченко,1981,Yes,Raw,B
3,Sergey Rudentsov,Amateur Open,80,,,,,140,-150,150,150,,,,,,,150,82.5,M,Сергей Руденцов,1973,Yes,Raw,B
4,Andrey Zharov,Amateur Open,82.5,,,,,-125,132.5,135,135,,,,,,,135,82.5,M,Андрей Жаров,1975,Yes,Raw,B
DQ,Denis Tonkikh,Amateur Open,81.9,,,,,-140,-145,-150,,,,,,,,,82.5,M,Денис Тонких,1976,Yes,Raw,B
DQ,Vladislav Ivanov,Amateur Open,81.8,,,,,-140,-140,,,,,,,,,,82.5,M,Владислав Иванов,1985,Yes,Raw,B
1,Andrey Salov,Amateur Masters 50-54,80.4,,,,,130,140,-142.5,140,,,,,,,140,82.5,M,Андрей Салов,1959,Yes,Raw,B
1,Vladimir Kornishin,Amateur Masters 55-59,77.3,,,,,112.5,117.5,-122.5,117.5,,,,,,,117.5,82.5,M,Владимир Корнишин,1952,Yes,Raw,B
1,Sergey Saidov,Amateur Teen 18-19,88.5,,,,,175,-180,-180,175,,,,,,,175,90,M,Сергей Саидов,1990,Yes,Raw,B
2,Artem Kobanov,Amateur Teen 18-19,88.4,,,,,120,-130,-130,120,,,,,,,120,90,M,Артем Кобанов,1992,Yes,Raw,B
1,Dmitriy Khalyev,Amateur Juniors 20-23,82.6,,,,,150,160,-165,160,,,,,,,160,90,M,Дмитрий Халёв,1989,Yes,Raw,B
2,Pavel Kharevich,Amateur Juniors 20-23,85.5,,,,,127.5,-137.5,-137.5,127.5,,,,,,,127.5,90,M,Павел Харевич,1988,Yes,Raw,B
3,Anton Merkulov,Amateur Juniors 20-23,88.3,,,,,-107.5,110,115,115,,,,,,,115,90,M,Антон Меркулов,1987,Yes,Raw,B
1,Nikolay Karakcheev,Amateur Open,87.3,,,,,160,170,177.5,177.5,,,,,,,177.5,90,M,Николай Каракчеев,1974,Yes,Raw,B
2,Sergey Popov,Amateur Open,86.1,,,,,-175,175,-177.5,175,,,,,,,175,90,M,Сергей Попов,1974,Yes,Raw,B
3,Denis Popov,Amateur Open,88.2,,,,,165,172.5,-177.5,172.5,,,,,,,172.5,90,M,Денис Попов,1982,Yes,Raw,B
4,Maksim Svintsov,Amateur Open,83,,,,,150,160,-170,160,,,,,,,160,90,M,Максим Свинцов,1987,Yes,Raw,B
6,Dmitriy Nosov,Amateur Open,88.7,,,,,150,155,157.5,157.5,,,,,,,157.5,90,M,Дмитрий Носов,1971,Yes,Raw,B
7,Aleksandr Ganin,Amateur Open,86.5,,,,,155,-160,-160,155,,,,,,,155,90,M,Александр Ганин,1985,Yes,Raw,B
8,Ivan Egorov,Amateur Open,88,,,,,137.5,155,-165,155,,,,,,,155,90,M,Иван Егоров,1985,Yes,Raw,B
9,Yuriy Fedin,Amateur Open,90,,,,,145,155,-160,155,,,,,,,155,90,M,Юрий Федин,1973,Yes,Raw,B
10,Aleksandr Potapenko,Amateur Open,87.3,,,,,90,140,145,145,,,,,,,145,90,M,Александр Потапенко,1975,Yes,Raw,B
11,Dimitriy Alekhin,Amateur Open,87,,,,,-140,140,,140,,,,,,,140,90,M,Димитрий Алехин,1977,Yes,Raw,B
12,Umed Imomkulov,Amateur Open,87.6,,,,,125,-135,-137.5,125,,,,,,,125,90,M,Умед Имомкулов,1990,Yes,Raw,B
13,Dmitriy Pronin,Amateur Open,85.5,,,,,120,-130,-130,120,,,,,,,120,90,M,Дмитрий Пронин,1975,Yes,Raw,B
DD,Aleksandr Kalyagin,Amateur Open,88.7,,,,,165,-175,175,175,,,,,,,,90,M,Александр Калягин,1983,Yes,Raw,B
DD,Gennadiy Tamashauskas,Amateur Open,89.8,,,,,145,155,157.5,157.5,,,,,,,,90,M,Геннадий Тамашаускас,1972,Yes,Raw,B
DD,Dmitriy Yakushov,Amateur Masters 40-44,89.5,,,,,155,160,162.5,162.5,,,,,,,,90,M,Дмитрий Якушов,1969,Yes,Raw,B
1,Eduard Tarasov,Amateur Masters 45-49,89,,,,,100,112.5,117.5,117.5,,,,,,,117.5,90,M,Эдуард Тарасов,1962,Yes,Raw,B
1,Dmitriy Kuleshov,Amateur Juniors 20-23,95.1,,,,,165,172.5,180,180,,,,,,,180,100,M,Дмитрий Кулешов,1988,Yes,Raw,B
2,Andrey Chetverikov,Amateur Juniors 20-23,93.3,,,,,142.5,-150,-157.5,142.5,,,,,,,142.5,100,M,Андрей Четвериков,1986,Yes,Raw,B
3,Aleksandr Podolin,Amateur Juniors 20-23,96.5,,,,,142.5,-162.5,-162.5,142.5,,,,,,,142.5,100,M,Александр Подолин,1989,Yes,Raw,B
4,Kirill Pogonin,Amateur Juniors 20-23,98.3,,,,,132.5,142.5,-147.5,142.5,,,,,,,142.5,100,M,Кирилл Погонин,1988,Yes,Raw,B
5,Vladimir Verbov,Amateur Juniors 20-23,92.7,,,,,120,125,-130,125,,,,,,,125,100,M,Владимир Вербов,1986,Yes,Raw,B
1,Pavel Rysenkov,Amateur Open,99.2,,,,,162.5,165,-167.5,165,,,,,,,165,100,M,Павел Рысенков,1978,Yes,Raw,B
2,Yuriy Kononov,Amateur Open,100,,,,,150,-155,-155,150,,,,,,,150,100,M,Юрий Кононов,1977,Yes,Raw,B
3,Aleksey Pyuretskiy,Amateur Open,98.5,,,,,135,142.5,-145,142.5,,,,,,,142.5,100,M,Алексей Пюрецкий,1985,Yes,Raw,B
4,Aleksey Korovushkin,Amateur Open,97.5,,,,,140,-145,-147.5,140,,,,,,,140,100,M,Алексей Коровушкин,1985,Yes,Raw,B
5,Dmitriy Solovey,Amateur Open,93.5,,,,,-110,125,,125,,,,,,,125,100,M,Дмитрий Соловей,1984,Yes,Raw,B
DD,Andrey Zinovyev,Amateur Open,99.3,,,,,172.5,180,-185,180,,,,,,,,100,M,Андрей Зиновьев,1975,Yes,Raw,B
7,Andrey Kozlov,Amateur Masters 40-44,96.2,,,,,142.5,150,152.5,152.5,,,,,,,152.5,100,M,Андрей Козлов,1970,Yes,Raw,B
1,Aleksey Gavshin,Amateur Open,106.2,,,,,165,-175,-175,165,,,,,,,165,110,M,Алексей Гавшин,1978,Yes,Raw,B
2,Sergey Kucher,Amateur Open,106.2,,,,,-145,150,-160,150,,,,,,,150,110,M,Сергей Кучер,1985,Yes,Raw,B
3,Dmitriy Panteleev,Amateur Open,103.3,,,,,105,115,-130,115,,,,,,,115,110,M,Дмитрий Пантелеев,1976,Yes,Raw,B
1,Vasily Chernyshenko,Amateur Masters 45-49,107.5,,,,,142.5,147.5,150,150,,,,,,,150,110,M,Василий Чернышенко,1963,Yes,Raw,B
1,Andrei Zavgorodnyy,Amateur Open,118.1,,,,,220,-230,230,230,,,,,,,230,125,M,Андрей Завгородный,1981,Yes,Raw,B
2,Denis Ogloblin,Amateur Open,114.4,,,,,202.5,,,202.5,,,,,,,202.5,125,M,Денис Оглоблин,1967,Yes,Raw,B
3,Sergey Milovanov,Amateur Open,112.6,,,,,180,-190,-190,180,,,,,,,180,125,M,Сергей Милованов,1973,Yes,Raw,B
4,Maksim Shamis,Amateur Open,114.3,,,,,175,-182.5,-185,175,,,,,,,175,125,M,Максим Шамис,1980,Yes,Raw,B
5,Konstantin Agureev,Amateur Open,118.7,,,,,155,-175,-175,155,,,,,,,155,125,M,Константин Агуреев,1975,Yes,Raw,B
1,Denis Ogloblin,Amateur Masters 40-44,114.4,,,,,195,200,202.5,202.5,205,,,,,,202.5,125,M,Денис Оглоблин,1967,Yes,Raw,B
1,Denis Kondyakov,Amateur Open,132.7,,,,,-180,190,195,195,,,,,,,195,140,M,Денис Кондяков,1978,Yes,Raw,B
2,Nikolay Timofeev,Amateur Open,131.6,,,,,170,180,-187.5,180,,,,,,,180,140,M,Николай Тимофеев,1982,Yes,Raw,B
3,Roman Mishurenkov,Amateur Open,135.8,,,,,172.5,-175,175,175,,,,,,,175,140,M,Роман Мишуренков,1982,Yes,Raw,B
4,Fuad Suleymanov,Amateur Open,126,,,,,-160,170,-180,170,,,,,,,170,140,M,Фуад Сулейманов,1983,Yes,Raw,B
1,Aleksey Starshov-Klementyev,Amateur Open,146.1,,,,,200,210,-212.5,210,,,,,,,210,140+,M,Алексей Старшов-Клементьев,1978,Yes,Raw,B
1,Oleg Grudinin,Pro Juniors 20-23,40,,,,,40,-55,-55,40,,,,,,,40,52,M,Олег Грудинин,1986,No,Raw,B
1,Roman Savinov,Pro Juniors 20-23,69.4,,,,,105,-115,-115,105,,,,,,,105,75,M,Роман Савинов,1989,No,Raw,B
1,Aleksey Khvatov,Pro Open,79.7,,,,,175,185,-190,185,,,,,,,185,82.5,M,Алексей Хватов,1968,No,Raw,B
DQ,Vladimir Fateev,Pro Masters 45-49,81.4,,,,,,,,,,,,,,,,82.5,M,Владимир Фатеев,1964,No,Raw,B
1,Nikolay Krasnov,Pro Masters 50-54,79,,,,,160,170,-175,170,,,,,,,170,82.5,M,Николай Краснов,1960,No,Raw,B
1,Vyacheslav Chelyshev,Pro Juniors 20-23,85.3,,,,,150,160,-165,160,,,,,,,160,90,M,Вячеслав Челышев,1989,No,Raw,B
2,Ilya Konkov,Pro Juniors 20-23,89.7,,,,,157.5,-162.5,-162.5,157.5,,,,,,,157.5,90,M,Илья Коньков,1989,No,Raw,B
1,Aleksey Zyuzin,Pro Open,89.4,,,,,200,207.5,-212.5,207.5,,,,,,,207.5,90,M,Алексей Зюзин,1981,No,Raw,B
2,Ilya Konkov,Pro Open,89.7,,,,,157.5,,,157.5,,,,,,,157.5,90,M,Илья Коньков,1989,No,Raw,B
DQ,Andrey Krylov,Pro Open,89.3,,,,,,,,,,,,,,,,90,M,Андрей Крылов,1983,No,Raw,B
1,Vladimir Malyshev,Pro Masters 70-74,86.1,,,,,127.5,132.5,137.5,137.5,,,,,,,137.5,90,M,Владимир Малышев,1936,No,Raw,B
1,Dmitriy Serezhkin,Pro Teen 18-19,96.7,,,,,165,175,180,180,,,,,,,180,100,M,Дмитрий Сережкин,1990,No,Raw,B
1,Ilya Kirsanov,Pro Juniors 20-23,94.9,,,,,190,-200,200,200,,,,,,,200,100,M,Илья Кирсанов,1987,No,Raw,B
1,Pavel Kuznetsov,Pro Open,92.3,,,,,195,200,-205,200,,,,,,,200,100,M,Павел Кузнецов,1975,No,Raw,B
2,Vadim Polyanin,Pro Open,96.1,,,,,-185,195,-202.5,195,,,,,,,195,100,M,Вадим Полянин,1983,No,Raw,B
3,Mikhail Schegol'kov,Pro Open,97.7,,,,,180,185,-190,185,,,,,,,185,100,M,Михаил Щегольков,1972,No,Raw,B
4,Denis Matyushin,Pro Open,96.1,,,,,170,-180,,170,,,,,,,170,100,M,Денис Матюшин,1984,No,Raw,B
DQ,Dmitriy Makarov,Pro Open,96.9,,,,,,,,,,,,,,,,100,M,Дмитрий Макаров,1974,No,Raw,B
1,Vitaliy Ponomarev,Pro Masters 50-54,98.3,,,,,170,180,190,190,,,,,,,190,100,M,Виталий Пономарев,1957,No,Raw,B
1,Pavel Sudakov,Pro Teen 18-19,104.6,,,,,130,-145,-160,130,,,,,,,130,110,M,Павел Судаков,1991,No,Raw,B
1,Dmitriy Zimin,Pro Juniors 20-23,105,,,,,160,-170,-170,160,,,,,,,160,110,M,Дмитрий Зимин,1987,No,Raw,B
1,Dmitriy Tenetko,Pro Open,109.4,,,,,215,230,242.5,242.5,,,,,,,242.5,110,M,Дмитрий Тенетко,1975,No,Raw,B
2,Eduard Vinogradov,Pro Open,109.1,,,,,195,205,212.5,212.5,,,,,,,212.5,110,M,Эдуард Виноградов,1974,No,Raw,B
3,Andrey Glukhov,Pro Open,106.5,,,,,-205,205,210,210,,,,,,,210,110,M,Андрей Глухов,1978,No,Raw,B
4,Anton Matveev,Pro Open,108,,,,,202.5,205,207.5,207.5,,,,,,,207.5,110,M,Антон Матвеев,1971,No,Raw,B
5,Yuriy Romanov #1,Pro Open,107.7,,,,,185,195,-202.5,195,,,,,,,195,110,M,Юрий Романов,1983,No,Raw,B
1,Vadim Shamkov,Pro Masters 40-44,106.3,,,,,165,170,-175,170,,,,,,,170,110,M,Вадим Шамков,1967,No,Raw,B
1,Andrey Kukhnevskiy,Pro Open,115.4,,,,,200,210,220,220,,,,,,,220,125,M,Андрей Кухневский,1981,No,Raw,B
2,Aleksandr Borodin,Pro Open,120.6,,,,,200,-210,-210,200,,,,,,,200,125,M,Александр Бородин,1976,No,Raw,B
3,Maksim Tsukanov,Pro Open,120.4,,,,,170,-180,-185,170,,,,,,,170,125,M,Максим Цуканов,1980,No,Raw,B
1,Oleg Zaytsev,Pro Masters 40-44,115.7,,,,,160,-165,-170,160,,,,,,,160,125,M,Олег Зайцев,1969,No,Raw,B
1,Roman Strelkov,Pro Open,125.4,,,,,205,217.5,222.5,222.5,,,,,,,222.5,140,M,Роман Стрелков,1969,No,Raw,B
1,Viktor Kozlov,Pro Masters 45-49,127.9,,,,,190,200,212.5,212.5,,,,,,,212.5,140,M,Виктор Козлов,1963,No,Raw,B
DQ,Valeriy Goncharov,Amateur Teen 16-17,54.9,,,,,-112.5,-112.5,-112.5,,,,,,,,,56,M,Валерий Гончаров,1992,Yes,Multi-ply,B
1,Ivan Ionov,Amateur Open,64.8,,,,,115,125,,125,,,,,,,125,67.5,M,Иван Ионов,1982,Yes,Multi-ply,B
1,Denis Popov,Amateur Open,88.2,,,,,215,227.5,-235,227.5,,,,,,,227.5,90,M,Денис Попов,1982,Yes,Multi-ply,B
2,Evgeniy Tutaev,Amateur Open,87.4,,,,,170,180,185,185,,,,,,,185,90,M,Евгений Тутаев,1980,Yes,Multi-ply,B
1,Sergei Kosarev,Amateur Masters 40-44,89,,,,,-170,170,-180,170,,,,,,,170,90,M,Сергей Косарев,1968,Yes,Multi-ply,B
1,Aleksey Mishanenkov,Amateur Open,98,,,,,-175,175,-192.5,175,,,,,,,175,100,M,Алексей Мишаненков,1978,Yes,Multi-ply,B
1,Vasiliy Filatov,Amateur Juniors 20-23,108.4,,,,,177.5,192.5,-202.5,192.5,,,,,,,192.5,110,M,Василий Филатов,1986,Yes,Multi-ply,B
1,Nikolay Solovyev,Amateur Open,102.5,,,,,-240,240,,240,,,,,,,240,110,M,Николай Соловьев,1968,Yes,Multi-ply,B
2,Roman Shulenin,Amateur Open,105.2,,,,,180,-190,-202.5,180,,,,,,,180,110,M,Роман Шуленин,1975,Yes,Multi-ply,B
DQ,Aleksey Ventsov,Amateur Open,102.3,,,,,-205,-205,-205,,,,,,,,,110,M,Алексей Венцов,1981,Yes,Multi-ply,B
1,Aleksey Voronkov,Amateur Juniors 20-23,117.1,,,,,215,230,-235,230,,,,,,,230,125,M,Алексей Воронков,1989,Yes,Multi-ply,B
1,Nikolay Frolov,Pro Juniors 20-23,61.4,,,,,120,-125,-125,120,,,,,,,120,67.5,M,Николай Фролов,1989,No,Multi-ply,B
1,Pavel Grigoryev,Pro Juniors 20-23,87.6,,,,,190,-202.5,-202.5,190,,,,,,,190,90,M,Павел Григорьев,1988,No,Multi-ply,B
2,Maksim Stepanov #4,Pro Juniors 20-23,87.8,,,,,-130,130,-140,130,,,,,,,130,90,M,Максим Степанов,1988,No,Multi-ply,B
1,Yuriy Geraskin,Pro Open,87.6,,,,,210,-225,230,230,,,,,,,230,90,M,Юрий Гераськин,1971,No,Multi-ply,B
1,Gleb Khorash,Pro Juniors 20-23,95.9,,,,,210,-220,-220,210,,,,,,,210,100,M,Глеб Хораш,1987,No,Multi-ply,B
2,Roman Brekhov,Pro Juniors 20-23,92.4,,,,,180,-187.5,-187.5,180,,,,,,,180,100,M,Роман Брехов,1990,No,Multi-ply,B
1,Vitaliy Ponomarev,Pro Open,98.3,,,,,230,245,-250,245,,,,,,,245,100,M,Виталий Пономарев,1957,No,Multi-ply,B
2,Denis Karpov,Pro Open,94.3,,,,,-190,-190,190,190,,,,,,,190,100,M,Денис Карпов,1981,No,Multi-ply,B
1,Vitaly Mashkevich,Pro Juniors 20-23,109.9,,,,,-260,260,-272.5,260,,,,,,,260,110,M,Виталий Машкевич,1989,No,Multi-ply,B
2,Dmitry Krymsky,Pro Juniors 20-23,102.2,,,,,230,-250,-260,230,,,,,,,230,110,M,Дмитрий Крымский,1989,No,Multi-ply,B
1,Vitaly Mashkevich,Pro Open,109.9,,,,,260,,,260,,,,,,,260,110,M,Виталий Машкевич,1989,No,Multi-ply,B
2,Evgeniy Lapunov,Pro Open,103.5,,,,,-220,220,235,235,,,,,,,235,110,M,Евгений Лапунов,1973,No,Multi-ply,B
DQ,Konstantin Konstantinov,Pro Open,107.1,,,,,-200,-210,,,,,,,,,,110,M,Константин Константинов,1978,No,Multi-ply,B
1,Igor Malyanov,Pro Open,116.9,,,,,280,-290,-290,280,,,,,,,280,125,M,Игорь Малянов,1980,No,Multi-ply,B
2,Maksim Tsukanov,Pro Open,120.4,,,,,190,200,212.5,212.5,,,,,,,212.5,125,M,Максим Цуканов,1980,No,Multi-ply,B
3,Dmitry Shvedov-Viardo,Pro Open,115.5,,,,,210,,,210,,,,,,,210,125,M,Дмитрий Шведов-Виардо,1968,No,Multi-ply,B
4,Aleksandr Bykov,Pro Open,111.7,,,,,190,200,-215,200,,,,,,,200,125,M,Александр Быков,1974,No,Multi-ply,B
DQ,Mikhail Slezkin,Pro Open,110.1,,,,,,,,,,,,,,,,125,M,Михаил Слезкин,1975,No,Multi-ply,B
1,Dmitry Shvedov-Viardo,Pro Masters 40-44,115.5,,,,,210,-220,-220,210,,,,,,,210,125,M,Дмитрий Шведов-Виардо,1968,No,Multi-ply,B
