Name,WeightClassKg,Division,Best3SquatKg,Best3BenchKg,Best3DeadliftKg,TotalKg,Sex,Event,Equipment,Place,State
Cody Chaney,75,M-T,199.58,131.54,195.04,526.17,M,SBD,Single-ply,1,
Glen Smith,75,M-O,192.78,124.74,204.12,521.63,M,SBD,Single-ply,1,
Dale Fitzsimmons,82.5,M-M3,167.83,120.2,204.12,492.15,M,SBD,Single-ply,1,
John Clay #1,100,M-O,226.8,163.29,210.92,601.01,M,SBD,Single-ply,1,
Kipp Duplechine,125,M-C,229.06,199.58,226.8,655.44,M,SBD,Single-ply,1,
M. Alderman,125,M-C,65.77,161.03,226.8,453.59,M,SBD,Single-ply,2,
Paul Fletcher,125+,M-O,335.66,204.12,319.78,859.56,M,SBD,Single-ply,1,
Kory Wnuk,125+,M-O,347,283.5,,,M,SBD,Single-ply,DQ,
Rita Jacobs,90,F-O,,22.68,,22.68,F,B,Single-ply,1,
