Name,WeightClassKg,Division,Best3SquatKg,Best3BenchKg,Best3DeadliftKg,TotalKg,Sex,Event,Equipment,Place,Team
Jerry Bianco,100,M-M1,64.86,54.88,64.86,184.61,M,SBD,Single-ply,1,
Bruce Lee,125+,M-M2,24.95,54.88,64.86,144.7,M,SBD,Single-ply,1,
