Division,WeightClassKg,Place,Name,Team,BodyweightKg,Best3SquatKg,Best3BenchKg,Best3DeadliftKg,TotalKg,Equipment,Event,Sex,BirthDate
Girls,51.94,1,Cheyenne Lowrence,Shepherd,51.26,95.25,54.43,106.59,256.28,Single-ply,SBD,F,
Girls,51.94,2,Deandra Mills,Trinity,48.53,97.52,47.63,106.59,251.74,Single-ply,SBD,F,
Girls,51.94,3,Brooklyn McCumber,Shepherd,51.26,77.11,43.09,90.72,210.92,Single-ply,SBD,F,
Girls,51.94,DQ,Kathryn Fisher,Corrigan-Camden,51.26,68.04,,,,Single-ply,SBD,F,
Girls,56.02,1,Sharla Ruiz,Shepherd,54.43,106.59,58.97,97.52,263.08,Single-ply,SBD,F,
Girls,56.02,2,Aphia Baker,Shepherd,54.43,70.31,61.23,97.52,229.06,Single-ply,SBD,F,
Girls,56.02,3,Ailin Marquez,Trinity,53.98,83.91,38.56,83.91,206.38,Single-ply,SBD,F,
Girls,56.02,DQ,Alyssa Phelps,Anderson-Shiro,55.34,,56.7,115.67,,Single-ply,SBD,F,
Girls,60.1,1,Micah Hughes #1,Corrigan-Camden,59.65,97.52,54.43,124.74,276.69,Single-ply,SBD,F,
Girls,60.1,3,Kallie Kelm,Corrigan-Camden,58.97,83.91,61.23,106.59,251.74,Single-ply,SBD,F,
Girls,60.1,4,Leslie Harris #4,Kountze,58.6,56.7,36.29,68.04,161.03,Single-ply,SBD,F,
Girls,60.1,DQ,Summer Owens,Shepherd,59.87,95.25,,,,Single-ply,SBD,F,
Girls,67.36,2,Ashley Gonzales,Shepherd,61.69,104.33,56.7,106.59,267.62,Single-ply,SBD,F,
Girls,67.36,3,Myona Wilson,Trinity,66.68,104.33,45.36,108.86,258.55,Single-ply,SBD,F,
Girls,67.36,4,Aundrea Cuevas,Corrigan-Camden,63.5,86.18,49.9,92.99,229.06,Single-ply,SBD,F,
Girls,75.07,1,Shelby Dean,Shepherd,73.03,147.42,83.91,163.29,394.63,Single-ply,SBD,F,
Girls,75.07,2,Alyssa Hill,Trinity,74.84,133.81,68.04,113.4,315.25,Single-ply,SBD,F,
Girls,75.07,3,Sierra Smith,Trinity,71.21,79.38,47.63,88.45,215.46,Single-ply,SBD,F,
Girls,75.07,DQ,Cora Sievertson,Shepherd,72.12,140.61,70.31,,,Single-ply,SBD,F,
Girls,82.33,1,Ella Snead,Shepherd,81.19,95.25,61.23,102.06,258.55,Single-ply,SBD,F,
Girls,82.33,DQ,Zoey Hawkey,Trinity,79.15,86.18,,,,Single-ply,SBD,F,
Girls,90.04,1,Katlyn Pollard,Shepherd,88.22,165.56,77.11,124.74,367.41,Single-ply,SBD,F,
Girls,90.04,3,Sarah Whittle,Kountze,87.09,77.11,52.16,113.4,242.67,Single-ply,SBD,F,
Girls,90.04,4,Baylee Windt,Shepherd,85.28,81.65,52.16,90.72,224.53,Single-ply,SBD,F,
Girls,90.04,5,Isabella Love,Trinity,83.91,83.91,47.63,74.84,206.38,Single-ply,SBD,F,
Girls,100.02,DQ,Joshlyn Ainsworth,Trinity,99.34,77.11,,,,Single-ply,SBD,F,
Girls,117.71,1,Maria Mendoza,Trinity,111.13,102.06,52.16,102.06,256.28,Single-ply,SBD,F,
Girls,117.71+,1,Kailyn Fisher,Trinity,125.19,210.92,124.74,192.78,528.44,Single-ply,SBD,F,
Girls,117.71+,2,Ember Burkes,Corrigan-Camden,131.54,95.25,52.16,104.33,251.74,Single-ply,SBD,F,
Girls,117.71+,DQ,Lauren Walters,Shepherd,117.93,142.88,,,,Single-ply,SBD,F,
