Place,Name,BirthYear,Country,BodyweightKg,Squat1Kg,Squat2Kg,Squat3Kg,Best3SquatKg,Bench1Kg,Bench2Kg,Bench3Kg,Best3BenchKg,Deadlift1Kg,Deadlift2Kg,Deadlift3Kg,Best3DeadliftKg,TotalKg,WeightClassKg,Sex,CyrillicName,Event,Equipment,Division
1,Anastasiya Polivanova,1993,Russia,45.55,55,-67.5,70,70,35,40,45,45,50,65,-77.5,65,180,47,F,,SBD,Single-ply,Open
1,Kristina Voytkova,1990,Russia,56.35,90,100,-110,100,45,47.5,50,50,100,105,110,110,260,57,F,Кристина Войткова,SBD,Single-ply,Open
1,Nadezhda Talikova,1960,Russia,60.8,-125,125,135,135,-70,70,-75,70,150,160,-170,160,365,63,F,Надежда Таликова,SBD,Single-ply,Open
2,Olga Perfilyeva,1957,Russia,62.65,97.5,102.5,105,105,47.5,50,-52.5,50,117.5,122.5,125,125,280,63,F,Ольга Перфильева,SBD,Single-ply,Open
3,Veronika Zavolzhinskaya,1994,Russia,60.35,-70,75,82.5,82.5,35,42.5,47.5,47.5,60,75,85,85,215,63,F,Вероника Заволжинская,SBD,Single-ply,Open
1,Irina Karpova,1992,Russia,65.75,155,162.5,-170,162.5,77.5,-85,-85,77.5,130,-140,-140,130,370,72,F,Ирина Карпова,SBD,Single-ply,Open
2,Natalya Portnova,1978,Russia,71.45,125,130,-135,130,-70,-70,70,70,147.5,-157.5,-157.5,147.5,347.5,72,F,Наталья Портнова,SBD,Single-ply,Open
1,Marina Krapivina,1989,Russia,75.05,160,170,180,180,80,90,95,95,150,160,-170,160,435,84,F,Марина Крапивина,SBD,Single-ply,Open
2,Margarita Belyaeva,1974,Russia,75.95,100,110,117.5,117.5,65,-70,-70,65,140,150,160,160,342.5,84,F,Маргарита Беляева,SBD,Single-ply,Open
3,Yuliya Alekseeva,1993,Russia,80.65,85,95,105,105,-70,-75,75,75,80,95,105,105,285,84,F,Юлия Алексеева,SBD,Single-ply,Open
4,Anna Zykova,1994,Russia,80.9,70,77.5,-85,77.5,35,42.5,-47.5,42.5,90,100,110,110,230,84,F,Анна Зыкова,SBD,Single-ply,Open
1,Evgeniy Druzhinin,1989,Russia,59,165,-175,180,180,105,110,115,115,180,190,200,200,495,59,M,Евгений Дружинин,SBD,Single-ply,Open
2,Vadim Petrov,1992,Russia,59,-170,172.5,-182.5,172.5,95,-102.5,102.5,102.5,155,170,177.5,177.5,452.5,59,M,Вадим Петров,SBD,Single-ply,Open
3,Sergey Novikov,1993,Russia,51.7,140,147.5,155,155,90,95,,95,150,,,150,400,59,M,Сергей Новиков,SBD,Single-ply,Open
1,Sergey Chikin,1976,Russia,66,200,210,215,215,135,140,145,145,160,,,160,520,66,M,Сергей Чикин,SBD,Single-ply,Open
2,Dmitriy Komarov,1993,Russia,65.6,150,160,165,165,120,-125,-125,120,180,200,210,210,495,66,M,Дмитрий Комаров,SBD,Single-ply,Open
3,Nikolay Prytkov,1995,Russia,64.75,150,165,175,175,115,120,122.5,122.5,160,170,180,180,477.5,66,M,Николай Прытков,SBD,Single-ply,Open
4,Roman Rasskazov,1994,Russia,65.4,130,140,150,150,100,110,112.5,112.5,170,185,190,190,452.5,66,M,Роман Рассказов,SBD,Single-ply,Open
5,Egor Lyaubonas,1994,Russia,65.45,150,160,-170,160,75,80,-85,80,140,145,150,150,390,66,M,Егор Ляубонас,SBD,Single-ply,Open
6,Artem Safonov #4,1995,Russia,62.65,150,155,-165,155,70,-75,75,75,140,-150,-150,140,370,66,M,Артем Сафонов,SBD,Single-ply,Open
1,Pavel Shubin,1990,Russia,73.7,230,240,255,255,155,-160,160,160,220,230,240,240,655,74,M,Павел Шубин,SBD,Single-ply,Open
2,Aleksey Nikulov,1986,Russia,73.8,215,225,235,235,130,135,-140,135,220,230,240,240,610,74,M,Алексей Никулов,SBD,Single-ply,Open
3,Dmitriy Balykov,1991,Russia,69.7,-200,210,220,220,115,122.5,130,130,215,-230,-240,215,565,74,M,Дмитрий Балыков,SBD,Single-ply,Open
4,Gennadiy Korostylev,1990,Russia,72.55,190,200,-210,200,-130,130,137.5,137.5,185,195,-205,195,532.5,74,M,Геннадий Коростылев,SBD,Single-ply,Open
5,Denis Kiselev,1983,Russia,70.4,-200,200,-215,200,110,115,-120,115,200,210,-220,210,525,74,M,Денис Киселев,SBD,Single-ply,Open
6,Yaroslav Zherdev,1987,Russia,74.05,155,-160,160,160,-115,115,120,120,175,185,195,195,475,83,M,Ярослав Жердев,SBD,Single-ply,Open
7,Denis Mishin #3,1989,Russia,71.2,170,180,-190,180,80,90,-92.5,90,190,-200,200,200,470,74,M,Денис Мишин,SBD,Single-ply,Open
8,Aleksey Volkov,1984,Russia,70.65,170,-185,-185,170,100,115,125,125,160,170,-180,170,465,74,M,Алексей Волков,SBD,Single-ply,Open
9,Mikhail Vovk,1989,Russia,71.3,-180,180,-190,180,100,-105,105,105,175,-187.5,-187.5,175,460,74,M,Михаил Вовк,SBD,Single-ply,Open
10,Ivan Seregin,1993,Russia,73.65,140,150,-160,150,110,120,-125,120,150,170,-190,170,440,74,M,Иван Серегин,SBD,Single-ply,Open
11,Roman Demyanov,1919,Russia,68.7,140,-150,155,155,85,-95,95,95,155,-170,170,170,420,74,M,Роман Демьянов,SBD,Single-ply,Open
12,Nikita Redin,1988,Russia,68.4,150,-160,-165,150,95,100,-105,100,150,160,170,170,420,74,M,Никита Редин,SBD,Single-ply,Open
13,Evgeniy Eliseev #1,1995,Russia,70.9,120,130,-140,130,90,100,110,110,130,145,155,155,395,74,M,Евгений Елисеев,SBD,Single-ply,Open
14,Roman Minaev,1995,Russia,73.45,110,120,130,130,90,100,-105,100,130,-155,155,155,385,74,M,Роман Минаев,SBD,Single-ply,Open
1,Vaspurak Tamoyan,1990,Russia,82.9,240,-255,-260,240,160,-170,170,170,240,260,270,270,680,83,M,Васпурак Тамоян,SBD,Single-ply,Open
2,Aleksandr Kurochkin,1988,Russia,80.5,200,220,240,240,150,160,165,165,200,220,240,240,645,83,M,Александр Курочкин,SBD,Single-ply,Open
3,Aleksandr Khobotov,1988,Russia,79.45,-235,240,-250,240,155,165,-170,165,225,235,-242.5,235,640,83,M,Александр Хоботов,SBD,Single-ply,Open
4,Ilya Kopyrnev,1990,Russia,79.3,220,-240,240,240,130,140,-145,140,230,240,250,250,630,83,M,Илья Копырнев,SBD,Single-ply,Open
5,Evgeniy Zaytsev,1987,Russia,81.65,225,235,-245,235,150,160,-162.5,160,200,210,215,215,610,83,M,Евгений Зайцев,SBD,Single-ply,Open
6,Aleksandr Konstantinov,1987,Russia,80.85,230,240,-245,240,115,120,125,125,230,-240,240,240,605,83,M,Александр Константинов,SBD,Single-ply,Open
7,Sergey Kuzin,1986,Russia,81.45,230,240,-245,240,140,145,150,150,200,205,210,210,600,83,M,Сергей Кузин,SBD,Single-ply,Open
8,Aleksey Andreev,1991,Russia,80.8,210,-220,220,220,130,135,140,140,190,200,207.5,207.5,567.5,83,M,Алексей Андреев,SBD,Single-ply,Open
9,Aleksey Zhavoronkov,1993,Russia,82.7,190,-205,215,215,120,125,-130,125,200,210,215,215,555,83,M,Алексей Жаворонков,SBD,Single-ply,Open
10,Evgeniy Loginov,1991,Russia,76.45,-185,185,195,195,105,110,-115,110,177.5,-185,-185,177.5,482.5,83,M,Евгений Логинов,SBD,Single-ply,Open
11,Ilya Khomenko,1994,Russia,82.2,160,170,180,180,95,-102.5,102.5,102.5,-170,185,-200,185,467.5,83,M,Илья Хоменко,SBD,Single-ply,Open
12,Vitaliy Lazarev,1993,Russia,74.8,-175,177.5,185,185,105,-110,-112.5,105,165,170,-192.5,170,460,83,M,Виталий Лазарев,SBD,Single-ply,Open
13,Aleksey Kikhay,1993,Russia,81.15,160,170,-180,170,85,-90,-90,85,160,170,172.5,172.5,427.5,83,M,Алексей Кихай,SBD,Single-ply,Open
14,Vladislav Sinyakin,1996,Russia,82.2,110,120,-125,120,60,-65,-65,60,120,,,120,300,83,M,Владислав Синякин,SBD,Single-ply,Open
DQ,Belyal Arakaev,1986,Russia,75.95,-220,-220,-220,,-115,,,,-200,,,,,83,M,Белял Аракаев,SBD,Single-ply,Open
1,Aleksandr Nosov,1985,Russia,91.6,250,262.5,270,270,187.5,195,-200,195,250,262.5,270,270,735,93,M,Александр Носов,SBD,Single-ply,Open
2,Artur Guseynov,1986,Russia,90.55,260,-275,280,280,170,180,-185,180,255,-265,270,270,730,93,M,Артур Гусейнов,SBD,Single-ply,Open
3,Aleksey Borodin,1986,Russia,91.1,250,-270,270,270,130,140,150,150,250,275,297.5,297.5,717.5,93,M,Алексей Бородин,SBD,Single-ply,Open
4,Vladimir Manushin,1988,Russia,90.95,230,-250,-250,230,170,182.5,195,195,185,200,210,210,635,93,M,Владимир Манушин,SBD,Single-ply,Open
5,Sergey Izotov,1980,Russia,91.8,210,-220,-220,210,160,165,-170,165,-200,220,225,225,600,93,M,Сергей Изотов,SBD,Single-ply,Open
6,Stepan Bonka,1983,Russia,88.2,195,205,-215,205,127.5,132.5,137.5,137.5,-185,185,195,195,537.5,93,M,Степан Бонка,SBD,Single-ply,Open
DQ,Aleksey Apostolov,1986,Russia,92.25,-250,-250,-250,,-200,,,,-240,,,,,93,M,Алексей Апостолов,SBD,Single-ply,Open
DQ,Mikhail Sviryuev,1983,Russia,91.9,-280,-280,-280,,-190,,,,-250,,,,,93,M,Михаил Свирюев,SBD,Single-ply,Open
1,Sergey Rukavishnikov,1988,Russia,102.1,310,-325,-325,310,225,232.5,235,235,260,270,,270,815,105,M,Сергей Рукавишников,SBD,Single-ply,Open
2,Aleksey Ananin,1976,Russia,98.75,295,307.5,,307.5,200,205,210,210,260,272.5,-282.5,272.5,790,105,M,Алексей Ананьин,SBD,Single-ply,Open
3,Aleksey Stepanov,1982,Russia,97.15,285,305,-315,305,185,200,210,210,235,250,-255,250,765,105,M,Алексей Степанов,SBD,Single-ply,Open
4,Eduard Golubov,1991,Russia,102.35,260,-275,290,290,170,-180,,170,250,270,-290,270,730,105,M,Эдуард Голубов,SBD,Single-ply,Open
5,Mikhail Matynyan,1996,Russia,97.2,260,270,-280,270,185,-190,190,190,250,260,-270,260,720,105,M,Михаил Матынян,SBD,Single-ply,Open
6,Nikita Sumenkov,1991,Russia,96.25,260,275,-290,275,175,180,-185,180,235,245,265,265,720,105,M,Никита Суменков,SBD,Single-ply,Open
7,Dmitriy Solodyuk,1978,Russia,95.65,230,245,255,255,180,185,187.5,187.5,240,257.5,275,275,717.5,105,M,Дмитрий Солодюк,SBD,Single-ply,Open
8,Mikhail Okhrimenko,1986,Russia,99.2,-200,200,-210,200,155,-165,165,165,220,230,-240,230,595,105,M,Михаил Охрименко,SBD,Single-ply,Open
9,Ivan Moiseev #4,1989,Russia,95.6,200,210,220,220,140,150,155,155,180,190,200,200,575,105,M,Иван Моисеев,SBD,Single-ply,Open
10,Maksim Sysoev,1993,Russia,99.25,210,-225,-230,210,-130,130,145,145,210,-220,-220,210,565,105,M,Максим Сысоев,SBD,Single-ply,Open
DQ,Aleksandr Shulgin,1982,Russia,103.55,-220,,,,-155,,,,-210,,,,,105,M,Александр Шульгин,SBD,Single-ply,Open
DQ,Pavel Bakharev,1991,Russia,99.6,-300,-310,-310,,-200,,,,-300,,,,,105,M,Павел Бахарев,SBD,Single-ply,Open
1,Aleksandr Grachev,1977,Russia,107.65,275,305,315,315,155,165,-175,165,305,325,340,340,820,120,M,Александр Грачев,SBD,Single-ply,Open
2,Nikita Anufriev,1986,Russia,119.3,290,-305,305,305,-200,200,205,205,265,-280,280,280,790,120,M,Никита Ануфриев,SBD,Single-ply,Open
3,Aleksey Lubov,1990,Russia,117.5,260,270,-280,270,170,220,,220,230,245,260,260,750,120,M,Алексей Лубов,SBD,Single-ply,Open
4,Ilya Sukhachev,1994,Russia,117.75,240,260,-275,260,150,160,167.5,167.5,235,245,-250,245,672.5,120,M,Илья Сухачев,SBD,Single-ply,Open
5,Vladimir Zotov,1973,Russia,106.45,235,250,-265,250,160,170,-175,170,225,240,-250,240,660,120,M,Владимир Зотов,SBD,Single-ply,Open
6,Sergey Terekhin,1992,Russia,108.15,180,200,-210,200,155,-160,-160,155,200,210,222.5,222.5,577.5,120,M,Сергей Терехин,SBD,Single-ply,Open
1,Aleksey Egorov,1989,Russia,123.65,250,,,250,150,160,-170,160,230,,,230,640,120+,M,Алексей Егоров,SBD,Single-ply,Open
