EESchema Schematic File Version 4
EELAYER 26 0
EELAYER END
$Descr A4 11693 8268
encoding utf-8
Sheet 1 1
Title "TMP1075 Breakout"
Date "2019-03-07"
Rev "A"
Comp ""
Comment1 ""
Comment2 ""
Comment3 ""
Comment4 ""
$EndDescr
$Comp
L Sensor_Temperature:TMP1075DGKT U1
U 1 1 5C80F7DA
P 6200 3400
F 0 "U1" H 6200 3565 50  0000 C CNN
F 1 "TMP1075DGKT" H 6200 3474 50  0000 C CNN
F 2 "sop:MSOP8" H 6100 3450 50  0001 C CNN
F 3 "http://www.ti.com/lit/ds/symlink/tmp1075.pdf" H 6200 3550 50  0001 C CNN
F 4 "Oliver Robson" H 6300 3650 50  0001 C CNN "Created By"
F 5 "2019-02-28" H 6400 3750 50  0001 C CNN "Created Date"
F 6 "TI" H 6500 3850 50  0001 C CNN "Manufacturer"
F 7 "TMP1075DGKT" H 6600 3950 50  0001 C CNN "Manufacturer Part Number"
F 8 "Digi-Key" H 6700 4050 50  0001 C CNN "Supplier"
F 9 "296-50245-1-ND" H 6800 4150 50  0001 C CNN "Supplier Part Number"
F 10 "SMT" H 7100 4450 50  0001 C CNN "SMT/THT"
	1    6200 3400
	1    0    0    -1  
$EndComp
$Comp
L Connector_Generic:Conn_01x05 J1
U 1 1 5C80FA79
P 3650 3700
F 0 "J1" H 3570 4117 50  0000 C CNN
F 1 "Conn_01x05" H 3570 4026 50  0000 C CNN
F 2 "Pin_Headers:Pin_Header_Straight_1x05_Pitch2.54mm" H 3650 3700 50  0001 C CNN
F 3 "~" H 3650 3700 50  0001 C CNN
F 4 "THT" H 3650 3700 50  0001 C CNN "SMT/THT"
	1    3650 3700
	-1   0    0    -1  
$EndComp
$Comp
L Connector_Generic:Conn_01x03 J2
U 1 1 5C80FB4B
P 8000 3600
F 0 "J2" H 7919 3275 50  0000 C CNN
F 1 "Conn_01x03" H 7919 3366 50  0000 C CNN
F 2 "Pin_Headers:Pin_Header_Straight_1x03_Pitch2.54mm" H 8000 3600 50  0001 C CNN
F 3 "~" H 8000 3600 50  0001 C CNN
F 4 "THT" H 8000 3600 50  0001 C CNN "SMT/THT"
	1    8000 3600
	1    0    0    1   
$EndComp
Wire Wire Line
	5700 3700 5400 3700
Wire Wire Line
	5300 3700 5300 3800
Wire Wire Line
	5300 3800 5700 3800
$Comp
L power:GND #PWR05
U 1 1 5C80FEBE
P 3950 4000
F 0 "#PWR05" H 3950 3750 50  0001 C CNN
F 1 "GND" H 3955 3827 50  0000 C CNN
F 2 "" H 3950 4000 50  0001 C CNN
F 3 "" H 3950 4000 50  0001 C CNN
	1    3950 4000
	1    0    0    -1  
$EndComp
$Comp
L power:GND #PWR06
U 1 1 5C80FED6
P 6800 4200
F 0 "#PWR06" H 6800 3950 50  0001 C CNN
F 1 "GND" H 6805 4027 50  0000 C CNN
F 2 "" H 6800 4200 50  0001 C CNN
F 3 "" H 6800 4200 50  0001 C CNN
	1    6800 4200
	1    0    0    -1  
$EndComp
$Comp
L power:VCC #PWR04
U 1 1 5C80FF0C
P 4050 3300
F 0 "#PWR04" H 4050 3150 50  0001 C CNN
F 1 "VCC" H 4067 3473 50  0000 C CNN
F 2 "" H 4050 3300 50  0001 C CNN
F 3 "" H 4050 3300 50  0001 C CNN
	1    4050 3300
	1    0    0    -1  
$EndComp
$Comp
L Device:R R3
U 1 1 5C8100FE
P 5400 3250
F 0 "R3" H 5470 3296 50  0000 L CNN
F 1 "4k7" H 5470 3205 50  0000 L CNN
F 2 "Resistors_SMD:R_0603" V 5330 3250 50  0001 C CNN
F 3 "~" H 5400 3250 50  0001 C CNN
F 4 "SMA" H 5400 3250 50  0001 C CNN "SMT/THT"
	1    5400 3250
	1    0    0    -1  
$EndComp
$Comp
L Device:R R2
U 1 1 5C810204
P 5100 3250
F 0 "R2" H 5170 3296 50  0000 L CNN
F 1 "4k7" H 5170 3205 50  0000 L CNN
F 2 "Resistors_SMD:R_0603" V 5030 3250 50  0001 C CNN
F 3 "~" H 5100 3250 50  0001 C CNN
F 4 "SMA" H 5100 3250 50  0001 C CNN "SMT/THT"
	1    5100 3250
	1    0    0    -1  
$EndComp
$Comp
L Device:R R1
U 1 1 5C81022A
P 4800 3250
F 0 "R1" H 4870 3296 50  0000 L CNN
F 1 "4k7" H 4870 3205 50  0000 L CNN
F 2 "Resistors_SMD:R_0603" V 4730 3250 50  0001 C CNN
F 3 "~" H 4800 3250 50  0001 C CNN
F 4 "SMA" H 4800 3250 50  0001 C CNN "SMT/THT"
	1    4800 3250
	1    0    0    -1  
$EndComp
$Comp
L Device:C C1
U 1 1 5C810487
P 5600 4250
F 0 "C1" H 5715 4296 50  0000 L CNN
F 1 "100nF" H 5715 4205 50  0000 L CNN
F 2 "Capacitors_SMD:C_0603" H 5638 4100 50  0001 C CNN
F 3 "~" H 5600 4250 50  0001 C CNN
F 4 "SMT" H 5600 4250 50  0001 C CNN "SMT/THT"
	1    5600 4250
	1    0    0    -1  
$EndComp
$Comp
L Device:R R4
U 1 1 5C8105ED
P 7100 3950
F 0 "R4" H 7170 3996 50  0000 L CNN
F 1 "4k7" H 7170 3905 50  0000 L CNN
F 2 "Resistors_SMD:R_0603" V 7030 3950 50  0001 C CNN
F 3 "~" H 7100 3950 50  0001 C CNN
F 4 "SMA" H 7100 3950 50  0001 C CNN "SMT/THT"
	1    7100 3950
	1    0    0    -1  
$EndComp
$Comp
L Device:R R5
U 1 1 5C81068B
P 7400 3950
F 0 "R5" H 7470 3996 50  0000 L CNN
F 1 "4k7" H 7470 3905 50  0000 L CNN
F 2 "Resistors_SMD:R_0603" V 7330 3950 50  0001 C CNN
F 3 "~" H 7400 3950 50  0001 C CNN
F 4 "SMA" H 7400 3950 50  0001 C CNN "SMT/THT"
	1    7400 3950
	1    0    0    -1  
$EndComp
$Comp
L Device:R R6
U 1 1 5C8106B7
P 7700 3950
F 0 "R6" H 7770 3996 50  0000 L CNN
F 1 "4k7" H 7770 3905 50  0000 L CNN
F 2 "Resistors_SMD:R_0603" V 7630 3950 50  0001 C CNN
F 3 "~" H 7700 3950 50  0001 C CNN
F 4 "SMA" H 7700 3950 50  0001 C CNN "SMT/THT"
	1    7700 3950
	1    0    0    -1  
$EndComp
Wire Wire Line
	7800 3600 7400 3600
Wire Wire Line
	7700 3800 7700 3700
Connection ~ 7700 3700
Wire Wire Line
	7700 3700 7800 3700
Wire Wire Line
	7400 3800 7400 3600
Connection ~ 7400 3600
Wire Wire Line
	7100 3800 7100 3500
Connection ~ 7100 3500
Wire Wire Line
	7100 3500 7800 3500
Wire Wire Line
	6800 4000 6700 4000
$Comp
L power:GND #PWR07
U 1 1 5C811268
P 7100 4200
F 0 "#PWR07" H 7100 3950 50  0001 C CNN
F 1 "GND" H 7105 4027 50  0000 C CNN
F 2 "" H 7100 4200 50  0001 C CNN
F 3 "" H 7100 4200 50  0001 C CNN
	1    7100 4200
	1    0    0    -1  
$EndComp
$Comp
L power:GND #PWR08
U 1 1 5C811287
P 7400 4200
F 0 "#PWR08" H 7400 3950 50  0001 C CNN
F 1 "GND" H 7405 4027 50  0000 C CNN
F 2 "" H 7400 4200 50  0001 C CNN
F 3 "" H 7400 4200 50  0001 C CNN
	1    7400 4200
	1    0    0    -1  
$EndComp
$Comp
L power:GND #PWR09
U 1 1 5C8112A6
P 7700 4200
F 0 "#PWR09" H 7700 3950 50  0001 C CNN
F 1 "GND" H 7705 4027 50  0000 C CNN
F 2 "" H 7700 4200 50  0001 C CNN
F 3 "" H 7700 4200 50  0001 C CNN
	1    7700 4200
	1    0    0    -1  
$EndComp
Wire Wire Line
	7700 4200 7700 4100
Wire Wire Line
	6800 4000 6800 4200
Wire Wire Line
	7100 4100 7100 4200
Wire Wire Line
	7400 4100 7400 4200
$Comp
L power:GND #PWR010
U 1 1 5C813020
P 5600 4500
F 0 "#PWR010" H 5600 4250 50  0001 C CNN
F 1 "GND" H 5605 4327 50  0000 C CNN
F 2 "" H 5600 4500 50  0001 C CNN
F 3 "" H 5600 4500 50  0001 C CNN
	1    5600 4500
	1    0    0    -1  
$EndComp
$Comp
L power:VCC #PWR01
U 1 1 5C814475
P 4800 3000
F 0 "#PWR01" H 4800 2850 50  0001 C CNN
F 1 "VCC" H 4817 3173 50  0000 C CNN
F 2 "" H 4800 3000 50  0001 C CNN
F 3 "" H 4800 3000 50  0001 C CNN
	1    4800 3000
	1    0    0    -1  
$EndComp
$Comp
L power:VCC #PWR02
U 1 1 5C814494
P 5100 3000
F 0 "#PWR02" H 5100 2850 50  0001 C CNN
F 1 "VCC" H 5117 3173 50  0000 C CNN
F 2 "" H 5100 3000 50  0001 C CNN
F 3 "" H 5100 3000 50  0001 C CNN
	1    5100 3000
	1    0    0    -1  
$EndComp
$Comp
L power:VCC #PWR03
U 1 1 5C8144B3
P 5400 3000
F 0 "#PWR03" H 5400 2850 50  0001 C CNN
F 1 "VCC" H 5417 3173 50  0000 C CNN
F 2 "" H 5400 3000 50  0001 C CNN
F 3 "" H 5400 3000 50  0001 C CNN
	1    5400 3000
	1    0    0    -1  
$EndComp
Wire Wire Line
	5400 3000 5400 3100
Wire Wire Line
	5100 3000 5100 3100
Wire Wire Line
	4800 3000 4800 3100
Wire Wire Line
	5100 3400 5100 3700
Connection ~ 5100 3700
Wire Wire Line
	5100 3700 5300 3700
Wire Wire Line
	5600 4100 5600 3500
Connection ~ 5600 3500
Wire Wire Line
	5600 3500 5700 3500
Wire Wire Line
	5600 4400 5600 4500
Text Notes 5550 5000 0    50   ~ 0
Default 7-bit I2C address: 0x48
$Comp
L power:PWR_FLAG #FLG0101
U 1 1 5C817E83
P 3950 3900
F 0 "#FLG0101" H 3950 3975 50  0001 C CNN
F 1 "PWR_FLAG" V 3950 4028 50  0000 L CNN
F 2 "" H 3950 3900 50  0001 C CNN
F 3 "~" H 3950 3900 50  0001 C CNN
	1    3950 3900
	0    1    1    0   
$EndComp
$Comp
L power:PWR_FLAG #FLG0102
U 1 1 5C817EDB
P 4050 3400
F 0 "#FLG0102" H 4050 3475 50  0001 C CNN
F 1 "PWR_FLAG" V 4050 3528 50  0000 L CNN
F 2 "" H 4050 3400 50  0001 C CNN
F 3 "~" H 4050 3400 50  0001 C CNN
	1    4050 3400
	0    1    1    0   
$EndComp
Wire Wire Line
	3850 3900 3950 3900
Wire Wire Line
	3950 3900 3950 4000
Connection ~ 3950 3900
Wire Wire Line
	4050 3500 5600 3500
Connection ~ 4050 3400
Wire Wire Line
	4050 3400 4050 3500
Wire Wire Line
	4050 3300 4050 3400
Wire Wire Line
	3850 3500 4050 3500
Connection ~ 4050 3500
Wire Wire Line
	3850 3700 5100 3700
Text Label 3950 3800 0    50   ~ 0
SDA
Text Label 3950 3700 0    50   ~ 0
SCL
Text Label 3950 3600 0    50   ~ 0
ALERT
Text Label 7500 3500 0    50   ~ 0
A2
Text Label 7500 3600 0    50   ~ 0
A1
Text Label 7500 3700 0    50   ~ 0
A0
Wire Wire Line
	6700 3500 7100 3500
Wire Wire Line
	6700 3600 7400 3600
Wire Wire Line
	6700 3700 7700 3700
Wire Wire Line
	3850 3600 4600 3600
Wire Wire Line
	4600 3600 4600 4000
Wire Wire Line
	4600 4000 4800 4000
Wire Wire Line
	4800 3400 4800 4000
Connection ~ 4800 4000
Wire Wire Line
	4800 4000 5700 4000
Wire Wire Line
	5400 3400 5400 3700
Wire Wire Line
	5250 3800 5250 3750
Wire Wire Line
	5250 3750 5350 3750
Wire Wire Line
	5350 3750 5350 3700
Wire Wire Line
	5350 3700 5400 3700
Wire Wire Line
	3850 3800 5250 3800
Connection ~ 5400 3700
$EndSCHEMATC
