EESchema Schematic File Version 4
EELAYER 26 0
EELAYER END
$Descr A4 11693 8268
encoding utf-8
Sheet 1 1
Title ""
Date ""
Rev ""
Comp ""
Comment1 ""
Comment2 ""
Comment3 ""
Comment4 ""
$EndDescr
$Comp
L esp32_tri_tray:TTGO_Mini_32 J3
U 1 1 5DC1321E
P 8150 3450
F 0 "J3" H 8150 3625 50  0000 C CNN
F 1 "TTGO_Mini_32" H 8150 3534 50  0000 C CNN
F 2 "connect-thru:TTGO_Mini_32" H 8150 3450 50  0001 C CNN
F 3 "" H 8150 3450 50  0001 C CNN
	1    8150 3450
	1    0    0    -1  
$EndComp
Wire Wire Line
	4100 3500 4150 3500
Wire Wire Line
	6400 3500 6350 3500
Wire Wire Line
	4100 3600 4200 3600
Wire Wire Line
	6450 3600 6350 3600
Wire Wire Line
	4100 3700 4250 3700
Wire Wire Line
	6500 3700 6350 3700
Wire Wire Line
	4100 3800 4300 3800
Wire Wire Line
	6550 3800 6350 3800
Wire Wire Line
	4100 3900 4350 3900
Wire Wire Line
	6600 3900 6350 3900
Wire Wire Line
	4100 4000 4400 4000
Wire Wire Line
	6650 4000 6350 4000
Wire Wire Line
	4100 4100 4450 4100
Wire Wire Line
	6700 4100 6350 4100
Wire Wire Line
	4100 4200 4500 4200
Wire Wire Line
	6750 4200 6350 4200
Wire Wire Line
	4100 4300 4550 4300
Wire Wire Line
	6800 4300 6350 4300
Wire Wire Line
	4100 4400 4600 4400
Wire Wire Line
	6850 4400 6350 4400
Wire Wire Line
	3200 4400 3150 4400
Wire Wire Line
	5400 4400 5450 4400
Wire Wire Line
	3200 4300 3100 4300
Wire Wire Line
	5350 4300 5450 4300
Wire Wire Line
	3200 4200 3050 4200
Wire Wire Line
	5300 4200 5450 4200
Wire Wire Line
	3200 4100 3000 4100
Wire Wire Line
	5250 4100 5450 4100
Wire Wire Line
	3200 4000 2950 4000
Wire Wire Line
	5200 4000 5450 4000
Wire Wire Line
	5150 3900 5450 3900
Wire Wire Line
	2900 3900 3200 3900
Wire Wire Line
	3200 3800 2850 3800
Wire Wire Line
	5100 3800 5450 3800
Wire Wire Line
	3200 3700 2800 3700
Wire Wire Line
	5050 3700 5450 3700
Wire Wire Line
	3200 3600 2750 3600
Wire Wire Line
	5000 3600 5450 3600
Wire Wire Line
	3200 3500 2700 3500
Wire Wire Line
	4950 3500 5450 3500
Wire Wire Line
	8650 3500 8600 3500
Wire Wire Line
	8700 3600 8600 3600
Wire Wire Line
	8750 3700 8600 3700
Wire Wire Line
	8800 3800 8600 3800
Wire Wire Line
	8850 3900 8600 3900
Wire Wire Line
	8900 4000 8600 4000
Wire Wire Line
	8950 4100 8600 4100
Wire Wire Line
	9000 4200 8600 4200
Wire Wire Line
	9050 4300 8600 4300
Wire Wire Line
	9100 4400 8600 4400
Wire Wire Line
	7650 4400 7700 4400
Wire Wire Line
	7600 4300 7700 4300
Wire Wire Line
	7550 4200 7700 4200
Wire Wire Line
	7500 4100 7700 4100
Wire Wire Line
	7450 4000 7700 4000
Wire Wire Line
	7400 3900 7700 3900
Wire Wire Line
	7350 3800 7700 3800
Wire Wire Line
	7300 3700 7700 3700
Wire Wire Line
	7250 3600 7700 3600
Wire Wire Line
	7200 3500 7700 3500
Wire Wire Line
	4150 3200 6400 3200
Wire Wire Line
	4200 3100 6450 3100
Wire Wire Line
	4250 3000 6500 3000
Wire Wire Line
	4300 2900 6550 2900
Wire Wire Line
	4350 2800 6600 2800
Wire Wire Line
	4400 2700 6650 2700
Wire Wire Line
	4450 2600 6700 2600
Wire Wire Line
	4500 2500 6750 2500
Wire Wire Line
	4550 2400 6800 2400
Wire Wire Line
	4600 2300 6850 2300
$Comp
L esp32_tri_tray:TTGO_Mini_32 J2
U 1 1 5DC130C9
P 5900 3450
F 0 "J2" H 5900 3625 50  0000 C CNN
F 1 "TTGO_Mini_32" H 5900 3534 50  0000 C CNN
F 2 "connect-thru:TTGO_Mini_32" H 5900 3450 50  0001 C CNN
F 3 "" H 5900 3450 50  0001 C CNN
	1    5900 3450
	1    0    0    -1  
$EndComp
Wire Wire Line
	2700 5400 4950 5400
Wire Wire Line
	2750 5300 5000 5300
Wire Wire Line
	2800 5200 5050 5200
Wire Wire Line
	2850 5100 5100 5100
Wire Wire Line
	2900 5000 5150 5000
Wire Wire Line
	2950 4900 5200 4900
Wire Wire Line
	3000 4800 5250 4800
Wire Wire Line
	3050 4700 5300 4700
Wire Wire Line
	3100 4600 5350 4600
Wire Wire Line
	3150 4500 5400 4500
$Comp
L esp32_tri_tray:TTGO_Mini_32 J1
U 1 1 5DC131B4
P 3650 3450
F 0 "J1" H 3650 3625 50  0000 C CNN
F 1 "TTGO_Mini_32" H 3650 3534 50  0000 C CNN
F 2 "connect-thru:TTGO_Mini_32" H 3650 3450 50  0001 C CNN
F 3 "" H 3650 3450 50  0001 C CNN
	1    3650 3450
	1    0    0    -1  
$EndComp
Wire Wire Line
	3150 4400 3150 4500
Wire Wire Line
	3100 4300 3100 4600
Wire Wire Line
	3050 4700 3050 4200
Wire Wire Line
	3000 4100 3000 4800
Wire Wire Line
	2900 5000 2900 3900
Wire Wire Line
	2950 4000 2950 4900
Wire Wire Line
	2850 3800 2850 5100
Wire Wire Line
	2800 3700 2800 5200
Wire Wire Line
	2750 5300 2750 3600
Wire Wire Line
	2700 3500 2700 5400
Wire Wire Line
	5400 4400 5400 4500
Wire Wire Line
	5350 4300 5350 4600
Wire Wire Line
	5300 4700 5300 4200
Wire Wire Line
	5250 4100 5250 4800
Wire Wire Line
	5150 5000 5150 3900
Wire Wire Line
	5200 4000 5200 4900
Wire Wire Line
	5100 3800 5100 5100
Wire Wire Line
	5050 3700 5050 5200
Wire Wire Line
	5000 5300 5000 3600
Wire Wire Line
	4950 3500 4950 5400
Wire Wire Line
	7600 4300 7600 4600
Wire Wire Line
	7550 4700 7550 4200
Wire Wire Line
	7500 4100 7500 4800
Wire Wire Line
	7400 5000 7400 3900
Wire Wire Line
	7450 4000 7450 4900
Wire Wire Line
	7350 3800 7350 5100
Wire Wire Line
	7300 3700 7300 5200
Wire Wire Line
	7250 5300 7250 3600
Wire Wire Line
	7200 3500 7200 5400
Wire Wire Line
	7650 4400 7650 4500
Wire Wire Line
	4150 3500 4150 3200
Wire Wire Line
	4200 3100 4200 3600
Wire Wire Line
	4250 3700 4250 3000
Wire Wire Line
	4300 2900 4300 3800
Wire Wire Line
	4350 3900 4350 2800
Wire Wire Line
	4400 2700 4400 4000
Wire Wire Line
	4450 4100 4450 2600
Wire Wire Line
	4500 2500 4500 4200
Wire Wire Line
	4550 4300 4550 2400
Wire Wire Line
	4600 2300 4600 4400
Wire Wire Line
	6400 3500 6400 3200
Wire Wire Line
	6450 3100 6450 3600
Wire Wire Line
	6500 3700 6500 3000
Wire Wire Line
	6550 2900 6550 3800
Wire Wire Line
	6600 3900 6600 2800
Wire Wire Line
	6650 2700 6650 4000
Wire Wire Line
	6700 4100 6700 2600
Wire Wire Line
	6750 2500 6750 4200
Wire Wire Line
	6800 4300 6800 2400
Wire Wire Line
	6850 2300 6850 4400
Wire Wire Line
	8650 3500 8650 3200
Wire Wire Line
	8700 3100 8700 3600
Wire Wire Line
	8750 3700 8750 3000
Wire Wire Line
	8800 2900 8800 3800
Wire Wire Line
	8850 3900 8850 2800
Wire Wire Line
	8900 2700 8900 4000
Wire Wire Line
	8950 4100 8950 2600
Wire Wire Line
	9000 2500 9000 4200
Wire Wire Line
	9050 4300 9050 2400
Wire Wire Line
	9100 2300 9100 4400
Wire Wire Line
	6400 3200 8650 3200
Wire Wire Line
	6450 3100 8700 3100
Wire Wire Line
	6500 3000 8750 3000
Wire Wire Line
	6550 2900 8800 2900
Wire Wire Line
	6600 2800 8850 2800
Wire Wire Line
	6650 2700 8900 2700
Wire Wire Line
	6700 2600 8950 2600
Wire Wire Line
	6750 2500 9000 2500
Wire Wire Line
	6800 2400 9050 2400
Wire Wire Line
	6850 2300 9100 2300
Connection ~ 6400 3200
Connection ~ 6450 3100
Connection ~ 6500 3000
Connection ~ 6550 2900
Connection ~ 6600 2800
Connection ~ 6650 2700
Connection ~ 6700 2600
Connection ~ 6750 2500
Connection ~ 6800 2400
Connection ~ 6850 2300
Wire Wire Line
	4950 5400 7200 5400
Wire Wire Line
	5000 5300 7250 5300
Wire Wire Line
	5050 5200 7300 5200
Wire Wire Line
	5100 5100 7350 5100
Wire Wire Line
	5150 5000 7400 5000
Wire Wire Line
	5200 4900 7450 4900
Wire Wire Line
	5250 4800 7500 4800
Wire Wire Line
	5300 4700 7550 4700
Wire Wire Line
	5350 4600 7600 4600
Wire Wire Line
	5400 4500 7650 4500
Connection ~ 4950 5400
Connection ~ 5000 5300
Connection ~ 5050 5200
Connection ~ 5100 5100
Connection ~ 5150 5000
Connection ~ 5200 4900
Connection ~ 5250 4800
Connection ~ 5300 4700
Connection ~ 5350 4600
Connection ~ 5400 4500
Text Label 5100 3200 0    50   ~ 0
TXD
Text Label 5100 3100 0    50   ~ 0
RXD
Text Label 5100 3000 0    50   ~ 0
22
Text Label 5100 2900 0    50   ~ 0
21
Text Label 5100 2800 0    50   ~ 0
16
Text Label 5100 2700 0    50   ~ 0
17
Text Label 5100 2600 0    50   ~ 0
GND
Text Label 5100 2500 0    50   ~ 0
5V
Text Label 5100 2400 0    50   ~ 0
TDO
Text Label 5100 2300 0    50   ~ 0
SD0
Text Label 4200 4500 0    50   ~ 0
SD3
Text Label 4200 4600 0    50   ~ 0
TCK
Text Label 4200 4700 0    50   ~ 0
3V3
Text Label 4200 4800 0    50   ~ 0
5
Text Label 4200 4900 0    50   ~ 0
23
Text Label 4200 5000 0    50   ~ 0
19
Text Label 4200 5100 0    50   ~ 0
18
Text Label 4200 5200 0    50   ~ 0
26
Text Label 4200 5300 0    50   ~ 0
SVP
Text Label 4200 5400 0    50   ~ 0
RST
$EndSCHEMATC
