(kicad_pcb (version 20171130) (host pcbnew "(5.0.0)")

  (general
    (thickness 1.6)
    (drawings 16)
    (tracks 221)
    (zones 0)
    (modules 7)
    (nets 21)
  )

  (page A4)
  (layers
    (0 F.Cu signal)
    (31 B.Cu signal)
    (32 B.Adhes user)
    (33 F.Adhes user)
    (34 B.Paste user)
    (35 F.Paste user)
    (36 B.SilkS user)
    (37 F.SilkS user)
    (38 B.Mask user)
    (39 F.Mask user)
    (40 Dwgs.User user)
    (41 Cmts.User user)
    (42 Eco1.User user)
    (43 Eco2.User user)
    (44 Edge.Cuts user)
    (45 Margin user)
    (46 B.CrtYd user)
    (47 F.CrtYd user)
    (48 B.Fab user)
    (49 F.Fab user)
  )

  (setup
    (last_trace_width 0.4)
    (user_trace_width 0.2)
    (user_trace_width 0.25)
    (user_trace_width 0.4)
    (user_trace_width 0.6)
    (user_trace_width 1)
    (trace_clearance 0.2)
    (zone_clearance 0.35)
    (zone_45_only no)
    (trace_min 0.2)
    (segment_width 0.2)
    (edge_width 0.15)
    (via_size 0.8)
    (via_drill 0.4)
    (via_min_size 0.4)
    (via_min_drill 0.3)
    (uvia_size 0.3)
    (uvia_drill 0.1)
    (uvias_allowed no)
    (uvia_min_size 0.2)
    (uvia_min_drill 0.1)
    (pcb_text_width 0.3)
    (pcb_text_size 1.5 1.5)
    (mod_edge_width 0.15)
    (mod_text_size 1 1)
    (mod_text_width 0.15)
    (pad_size 1.524 1.524)
    (pad_drill 0.762)
    (pad_to_mask_clearance 0.2)
    (aux_axis_origin 0 0)
    (visible_elements FFFFFF7F)
    (pcbplotparams
      (layerselection 0x010e0_ffffffff)
      (usegerberextensions false)
      (usegerberattributes false)
      (usegerberadvancedattributes false)
      (creategerberjobfile false)
      (excludeedgelayer true)
      (linewidth 0.100000)
      (plotframeref false)
      (viasonmask false)
      (mode 1)
      (useauxorigin false)
      (hpglpennumber 1)
      (hpglpenspeed 20)
      (hpglpendiameter 15.000000)
      (psnegative false)
      (psa4output false)
      (plotreference true)
      (plotvalue true)
      (plotinvisibletext false)
      (padsonsilk false)
      (subtractmaskfromsilk false)
      (outputformat 4)
      (mirror false)
      (drillshape 0)
      (scaleselection 1)
      (outputdirectory "outputs/"))
  )

  (net 0 "")
  (net 1 /TXD)
  (net 2 /RXD)
  (net 3 /22)
  (net 4 /21)
  (net 5 /16)
  (net 6 /17)
  (net 7 /GND)
  (net 8 /5V)
  (net 9 /TDO)
  (net 10 /SD0)
  (net 11 /SD3)
  (net 12 /TCK)
  (net 13 /3V3)
  (net 14 /5)
  (net 15 /23)
  (net 16 /19)
  (net 17 /18)
  (net 18 /26)
  (net 19 /SVP)
  (net 20 /RST)

  (net_class Default "This is the default net class."
    (clearance 0.2)
    (trace_width 0.25)
    (via_dia 0.8)
    (via_drill 0.4)
    (uvia_dia 0.3)
    (uvia_drill 0.1)
    (add_net /16)
    (add_net /17)
    (add_net /18)
    (add_net /19)
    (add_net /21)
    (add_net /22)
    (add_net /23)
    (add_net /26)
    (add_net /3V3)
    (add_net /5)
    (add_net /5V)
    (add_net /GND)
    (add_net /RST)
    (add_net /RXD)
    (add_net /SD0)
    (add_net /SD3)
    (add_net /SVP)
    (add_net /TCK)
    (add_net /TDO)
    (add_net /TXD)
  )

  (module Mounting_Holes:MountingHole_3.2mm_M3 (layer F.Cu) (tedit 5DC15834) (tstamp 5DC1828A)
    (at 104.14 73.66)
    (descr "Mounting Hole 3.2mm, no annular, M3")
    (tags "mounting hole 3.2mm no annular m3")
    (attr virtual)
    (fp_text reference REF** (at 0 -4.2) (layer F.SilkS) hide
      (effects (font (size 1 1) (thickness 0.15)))
    )
    (fp_text value MountingHole_3.2mm_M3 (at 0 4.2) (layer F.Fab)
      (effects (font (size 1 1) (thickness 0.15)))
    )
    (fp_circle (center 0 0) (end 3.45 0) (layer F.CrtYd) (width 0.05))
    (fp_circle (center 0 0) (end 3.2 0) (layer Cmts.User) (width 0.15))
    (fp_text user %R (at 0.3 0) (layer F.Fab)
      (effects (font (size 1 1) (thickness 0.15)))
    )
    (pad 1 np_thru_hole circle (at 0 0) (size 3.2 3.2) (drill 3.2) (layers *.Cu *.Mask))
  )

  (module Mounting_Holes:MountingHole_3.2mm_M3 (layer F.Cu) (tedit 5DC15831) (tstamp 5DC1828A)
    (at 109.22 104.14)
    (descr "Mounting Hole 3.2mm, no annular, M3")
    (tags "mounting hole 3.2mm no annular m3")
    (attr virtual)
    (fp_text reference REF** (at 0 -4.2) (layer F.SilkS) hide
      (effects (font (size 1 1) (thickness 0.15)))
    )
    (fp_text value MountingHole_3.2mm_M3 (at 0 4.2) (layer F.Fab)
      (effects (font (size 1 1) (thickness 0.15)))
    )
    (fp_circle (center 0 0) (end 3.45 0) (layer F.CrtYd) (width 0.05))
    (fp_circle (center 0 0) (end 3.2 0) (layer Cmts.User) (width 0.15))
    (fp_text user %R (at 0.3 0) (layer F.Fab)
      (effects (font (size 1 1) (thickness 0.15)))
    )
    (pad 1 np_thru_hole circle (at 0 0) (size 3.2 3.2) (drill 3.2) (layers *.Cu *.Mask))
  )

  (module Mounting_Holes:MountingHole_3.2mm_M3 (layer F.Cu) (tedit 5DC1582D) (tstamp 5DC1828A)
    (at 195.58 104.14)
    (descr "Mounting Hole 3.2mm, no annular, M3")
    (tags "mounting hole 3.2mm no annular m3")
    (attr virtual)
    (fp_text reference REF** (at 0 -4.2) (layer F.SilkS) hide
      (effects (font (size 1 1) (thickness 0.15)))
    )
    (fp_text value MountingHole_3.2mm_M3 (at 0 4.2) (layer F.Fab)
      (effects (font (size 1 1) (thickness 0.15)))
    )
    (fp_circle (center 0 0) (end 3.45 0) (layer F.CrtYd) (width 0.05))
    (fp_circle (center 0 0) (end 3.2 0) (layer Cmts.User) (width 0.15))
    (fp_text user %R (at 0.3 0) (layer F.Fab)
      (effects (font (size 1 1) (thickness 0.15)))
    )
    (pad 1 np_thru_hole circle (at 0 0) (size 3.2 3.2) (drill 3.2) (layers *.Cu *.Mask))
  )

  (module connect-thru:TTGO_Mini_32 (layer F.Cu) (tedit 5DC15847) (tstamp 5DC145CC)
    (at 116.84 88.9)
    (path /5DC131B4)
    (fp_text reference J1 (at 0 0.5) (layer F.SilkS) hide
      (effects (font (size 1 1) (thickness 0.15)))
    )
    (fp_text value TTGO_Mini_32 (at 0 -0.5) (layer F.Fab)
      (effects (font (size 1 1) (thickness 0.15)))
    )
    (fp_line (start 15.24 -17.78) (end 15.24 0) (layer F.SilkS) (width 0.15))
    (fp_line (start 15.24 0) (end 15.24 17.78) (layer F.SilkS) (width 0.15))
    (fp_line (start -15.24 -17.78) (end 15.24 -17.78) (layer F.SilkS) (width 0.15))
    (fp_line (start -12.7 17.78) (end -12.7 13.97) (layer F.SilkS) (width 0.15))
    (fp_arc (start -13.97 13.97) (end -12.7 13.97) (angle -90) (layer F.SilkS) (width 0.15))
    (fp_line (start -13.97 12.7) (end -15.24 12.7) (layer F.SilkS) (width 0.15))
    (fp_line (start 15.24 17.78) (end -12.7 17.78) (layer F.SilkS) (width 0.15))
    (fp_line (start -15.24 12.7) (end -15.24 -17.78) (layer F.SilkS) (width 0.15))
    (fp_text user TXD (at 7.62 -11.43) (layer F.SilkS)
      (effects (font (size 1 1) (thickness 0.15)))
    )
    (fp_text user RXD (at 7.62 -8.89) (layer F.SilkS)
      (effects (font (size 1 1) (thickness 0.15)))
    )
    (fp_text user 22 (at 7.62 -6.35) (layer F.SilkS)
      (effects (font (size 1 1) (thickness 0.15)))
    )
    (fp_text user 21 (at 7.62 -3.81) (layer F.SilkS)
      (effects (font (size 1 1) (thickness 0.15)))
    )
    (fp_text user 16 (at 7.62 -1.27) (layer F.SilkS)
      (effects (font (size 1 1) (thickness 0.15)))
    )
    (fp_text user 17 (at 7.62 1.27) (layer F.SilkS)
      (effects (font (size 1 1) (thickness 0.15)))
    )
    (fp_text user GND (at 7.62 3.81) (layer F.SilkS)
      (effects (font (size 1 1) (thickness 0.15)))
    )
    (fp_text user 5V (at 7.62 6.35) (layer F.SilkS)
      (effects (font (size 1 1) (thickness 0.15)))
    )
    (fp_text user TDO (at 7.62 8.89) (layer F.SilkS)
      (effects (font (size 1 1) (thickness 0.15)))
    )
    (fp_text user SD0 (at 7.62 11.43) (layer F.SilkS)
      (effects (font (size 1 1) (thickness 0.15)))
    )
    (fp_text user SD3 (at -7.62 11.43) (layer F.SilkS)
      (effects (font (size 1 1) (thickness 0.15)))
    )
    (fp_text user TCK (at -7.62 8.89) (layer F.SilkS)
      (effects (font (size 1 1) (thickness 0.15)))
    )
    (fp_text user 3V3 (at -7.62 6.35) (layer F.SilkS)
      (effects (font (size 1 1) (thickness 0.15)))
    )
    (fp_text user 5 (at -7.62 3.81) (layer F.SilkS)
      (effects (font (size 1 1) (thickness 0.15)))
    )
    (fp_text user 23 (at -7.62 1.27) (layer F.SilkS)
      (effects (font (size 1 1) (thickness 0.15)))
    )
    (fp_text user 19 (at -7.62 -1.27) (layer F.SilkS)
      (effects (font (size 1 1) (thickness 0.15)))
    )
    (fp_text user 18 (at -7.62 -3.81) (layer F.SilkS)
      (effects (font (size 1 1) (thickness 0.15)))
    )
    (fp_text user 26 (at -7.62 -6.35) (layer F.SilkS)
      (effects (font (size 1 1) (thickness 0.15)))
    )
    (fp_text user SVP (at -7.62 -8.89) (layer F.SilkS)
      (effects (font (size 1 1) (thickness 0.15)))
    )
    (fp_text user RST (at -7.62 -11.43) (layer F.SilkS)
      (effects (font (size 1 1) (thickness 0.15)))
    )
    (fp_line (start 10.16 -12.7) (end 12.7 -12.7) (layer F.SilkS) (width 0.15))
    (fp_line (start 12.7 -12.7) (end 12.7 12.7) (layer F.SilkS) (width 0.15))
    (fp_line (start 12.7 12.7) (end 10.16 12.7) (layer F.SilkS) (width 0.15))
    (fp_line (start 10.16 12.7) (end 10.16 -12.7) (layer F.SilkS) (width 0.15))
    (fp_line (start -10.16 -12.7) (end -10.16 12.7) (layer F.SilkS) (width 0.15))
    (fp_line (start -10.16 12.7) (end -12.7 12.7) (layer F.SilkS) (width 0.15))
    (fp_line (start -12.7 12.7) (end -12.7 -12.7) (layer F.SilkS) (width 0.15))
    (fp_line (start -12.7 -12.7) (end -10.16 -12.7) (layer F.SilkS) (width 0.15))
    (pad 1 thru_hole rect (at 11.43 -11.43) (size 1.524 1.524) (drill 0.9) (layers *.Cu *.Mask)
      (net 1 /TXD))
    (pad 2 thru_hole circle (at 11.43 -8.89) (size 1.524 1.524) (drill 0.9) (layers *.Cu *.Mask)
      (net 2 /RXD))
    (pad 3 thru_hole circle (at 11.43 -6.35) (size 1.524 1.524) (drill 0.9) (layers *.Cu *.Mask)
      (net 3 /22))
    (pad 4 thru_hole circle (at 11.43 -3.81) (size 1.524 1.524) (drill 0.9) (layers *.Cu *.Mask)
      (net 4 /21))
    (pad 5 thru_hole circle (at 11.43 -1.27) (size 1.524 1.524) (drill 0.9) (layers *.Cu *.Mask)
      (net 5 /16))
    (pad 6 thru_hole circle (at 11.43 1.27) (size 1.524 1.524) (drill 0.9) (layers *.Cu *.Mask)
      (net 6 /17))
    (pad 7 thru_hole circle (at 11.43 3.81) (size 1.524 1.524) (drill 0.9) (layers *.Cu *.Mask)
      (net 7 /GND))
    (pad 8 thru_hole circle (at 11.43 6.35) (size 1.524 1.524) (drill 0.9) (layers *.Cu *.Mask)
      (net 8 /5V))
    (pad 9 thru_hole circle (at 11.43 8.89) (size 1.524 1.524) (drill 0.9) (layers *.Cu *.Mask)
      (net 9 /TDO))
    (pad 10 thru_hole circle (at 11.43 11.43) (size 1.524 1.524) (drill 0.9) (layers *.Cu *.Mask)
      (net 10 /SD0))
    (pad 11 thru_hole circle (at -11.43 11.43) (size 1.524 1.524) (drill 0.9) (layers *.Cu *.Mask)
      (net 11 /SD3))
    (pad 12 thru_hole circle (at -11.43 8.89) (size 1.524 1.524) (drill 0.9) (layers *.Cu *.Mask)
      (net 12 /TCK))
    (pad 13 thru_hole circle (at -11.43 6.35) (size 1.524 1.524) (drill 0.9) (layers *.Cu *.Mask)
      (net 13 /3V3))
    (pad 14 thru_hole circle (at -11.43 3.81) (size 1.524 1.524) (drill 0.9) (layers *.Cu *.Mask)
      (net 14 /5))
    (pad 15 thru_hole circle (at -11.43 1.27) (size 1.524 1.524) (drill 0.9) (layers *.Cu *.Mask)
      (net 15 /23))
    (pad 16 thru_hole circle (at -11.43 -1.27) (size 1.524 1.524) (drill 0.9) (layers *.Cu *.Mask)
      (net 16 /19))
    (pad 17 thru_hole circle (at -11.43 -3.81) (size 1.524 1.524) (drill 0.9) (layers *.Cu *.Mask)
      (net 17 /18))
    (pad 18 thru_hole circle (at -11.43 -6.35) (size 1.524 1.524) (drill 0.9) (layers *.Cu *.Mask)
      (net 18 /26))
    (pad 19 thru_hole circle (at -11.43 -8.89) (size 1.524 1.524) (drill 0.9) (layers *.Cu *.Mask)
      (net 19 /SVP))
    (pad 20 thru_hole circle (at -11.43 -11.43) (size 1.524 1.524) (drill 0.9) (layers *.Cu *.Mask)
      (net 20 /RST))
  )

  (module connect-thru:TTGO_Mini_32 (layer F.Cu) (tedit 5DC15849) (tstamp 5DC14608)
    (at 149.86 88.9)
    (path /5DC130C9)
    (fp_text reference J2 (at 0 0.5) (layer F.SilkS) hide
      (effects (font (size 1 1) (thickness 0.15)))
    )
    (fp_text value TTGO_Mini_32 (at 0 -0.5) (layer F.Fab)
      (effects (font (size 1 1) (thickness 0.15)))
    )
    (fp_line (start -12.7 -12.7) (end -10.16 -12.7) (layer F.SilkS) (width 0.15))
    (fp_line (start -12.7 12.7) (end -12.7 -12.7) (layer F.SilkS) (width 0.15))
    (fp_line (start -10.16 12.7) (end -12.7 12.7) (layer F.SilkS) (width 0.15))
    (fp_line (start -10.16 -12.7) (end -10.16 12.7) (layer F.SilkS) (width 0.15))
    (fp_line (start 10.16 12.7) (end 10.16 -12.7) (layer F.SilkS) (width 0.15))
    (fp_line (start 12.7 12.7) (end 10.16 12.7) (layer F.SilkS) (width 0.15))
    (fp_line (start 12.7 -12.7) (end 12.7 12.7) (layer F.SilkS) (width 0.15))
    (fp_line (start 10.16 -12.7) (end 12.7 -12.7) (layer F.SilkS) (width 0.15))
    (fp_text user RST (at -7.62 -11.43) (layer F.SilkS)
      (effects (font (size 1 1) (thickness 0.15)))
    )
    (fp_text user SVP (at -7.62 -8.89) (layer F.SilkS)
      (effects (font (size 1 1) (thickness 0.15)))
    )
    (fp_text user 26 (at -7.62 -6.35) (layer F.SilkS)
      (effects (font (size 1 1) (thickness 0.15)))
    )
    (fp_text user 18 (at -7.62 -3.81) (layer F.SilkS)
      (effects (font (size 1 1) (thickness 0.15)))
    )
    (fp_text user 19 (at -7.62 -1.27) (layer F.SilkS)
      (effects (font (size 1 1) (thickness 0.15)))
    )
    (fp_text user 23 (at -7.62 1.27) (layer F.SilkS)
      (effects (font (size 1 1) (thickness 0.15)))
    )
    (fp_text user 5 (at -7.62 3.81) (layer F.SilkS)
      (effects (font (size 1 1) (thickness 0.15)))
    )
    (fp_text user 3V3 (at -7.62 6.35) (layer F.SilkS)
      (effects (font (size 1 1) (thickness 0.15)))
    )
    (fp_text user TCK (at -7.62 8.89) (layer F.SilkS)
      (effects (font (size 1 1) (thickness 0.15)))
    )
    (fp_text user SD3 (at -7.62 11.43) (layer F.SilkS)
      (effects (font (size 1 1) (thickness 0.15)))
    )
    (fp_text user SD0 (at 7.62 11.43) (layer F.SilkS)
      (effects (font (size 1 1) (thickness 0.15)))
    )
    (fp_text user TDO (at 7.62 8.89) (layer F.SilkS)
      (effects (font (size 1 1) (thickness 0.15)))
    )
    (fp_text user 5V (at 7.62 6.35) (layer F.SilkS)
      (effects (font (size 1 1) (thickness 0.15)))
    )
    (fp_text user GND (at 7.62 3.81) (layer F.SilkS)
      (effects (font (size 1 1) (thickness 0.15)))
    )
    (fp_text user 17 (at 7.62 1.27) (layer F.SilkS)
      (effects (font (size 1 1) (thickness 0.15)))
    )
    (fp_text user 16 (at 7.62 -1.27) (layer F.SilkS)
      (effects (font (size 1 1) (thickness 0.15)))
    )
    (fp_text user 21 (at 7.62 -3.81) (layer F.SilkS)
      (effects (font (size 1 1) (thickness 0.15)))
    )
    (fp_text user 22 (at 7.62 -6.35) (layer F.SilkS)
      (effects (font (size 1 1) (thickness 0.15)))
    )
    (fp_text user RXD (at 7.62 -8.89) (layer F.SilkS)
      (effects (font (size 1 1) (thickness 0.15)))
    )
    (fp_text user TXD (at 7.62 -11.43) (layer F.SilkS)
      (effects (font (size 1 1) (thickness 0.15)))
    )
    (fp_line (start -15.24 12.7) (end -15.24 -17.78) (layer F.SilkS) (width 0.15))
    (fp_line (start 15.24 17.78) (end -12.7 17.78) (layer F.SilkS) (width 0.15))
    (fp_line (start -13.97 12.7) (end -15.24 12.7) (layer F.SilkS) (width 0.15))
    (fp_arc (start -13.97 13.97) (end -12.7 13.97) (angle -90) (layer F.SilkS) (width 0.15))
    (fp_line (start -12.7 17.78) (end -12.7 13.97) (layer F.SilkS) (width 0.15))
    (fp_line (start -15.24 -17.78) (end 15.24 -17.78) (layer F.SilkS) (width 0.15))
    (fp_line (start 15.24 0) (end 15.24 17.78) (layer F.SilkS) (width 0.15))
    (fp_line (start 15.24 -17.78) (end 15.24 0) (layer F.SilkS) (width 0.15))
    (pad 20 thru_hole circle (at -11.43 -11.43) (size 1.524 1.524) (drill 0.9) (layers *.Cu *.Mask)
      (net 20 /RST))
    (pad 19 thru_hole circle (at -11.43 -8.89) (size 1.524 1.524) (drill 0.9) (layers *.Cu *.Mask)
      (net 19 /SVP))
    (pad 18 thru_hole circle (at -11.43 -6.35) (size 1.524 1.524) (drill 0.9) (layers *.Cu *.Mask)
      (net 18 /26))
    (pad 17 thru_hole circle (at -11.43 -3.81) (size 1.524 1.524) (drill 0.9) (layers *.Cu *.Mask)
      (net 17 /18))
    (pad 16 thru_hole circle (at -11.43 -1.27) (size 1.524 1.524) (drill 0.9) (layers *.Cu *.Mask)
      (net 16 /19))
    (pad 15 thru_hole circle (at -11.43 1.27) (size 1.524 1.524) (drill 0.9) (layers *.Cu *.Mask)
      (net 15 /23))
    (pad 14 thru_hole circle (at -11.43 3.81) (size 1.524 1.524) (drill 0.9) (layers *.Cu *.Mask)
      (net 14 /5))
    (pad 13 thru_hole circle (at -11.43 6.35) (size 1.524 1.524) (drill 0.9) (layers *.Cu *.Mask)
      (net 13 /3V3))
    (pad 12 thru_hole circle (at -11.43 8.89) (size 1.524 1.524) (drill 0.9) (layers *.Cu *.Mask)
      (net 12 /TCK))
    (pad 11 thru_hole circle (at -11.43 11.43) (size 1.524 1.524) (drill 0.9) (layers *.Cu *.Mask)
      (net 11 /SD3))
    (pad 10 thru_hole circle (at 11.43 11.43) (size 1.524 1.524) (drill 0.9) (layers *.Cu *.Mask)
      (net 10 /SD0))
    (pad 9 thru_hole circle (at 11.43 8.89) (size 1.524 1.524) (drill 0.9) (layers *.Cu *.Mask)
      (net 9 /TDO))
    (pad 8 thru_hole circle (at 11.43 6.35) (size 1.524 1.524) (drill 0.9) (layers *.Cu *.Mask)
      (net 8 /5V))
    (pad 7 thru_hole circle (at 11.43 3.81) (size 1.524 1.524) (drill 0.9) (layers *.Cu *.Mask)
      (net 7 /GND))
    (pad 6 thru_hole circle (at 11.43 1.27) (size 1.524 1.524) (drill 0.9) (layers *.Cu *.Mask)
      (net 6 /17))
    (pad 5 thru_hole circle (at 11.43 -1.27) (size 1.524 1.524) (drill 0.9) (layers *.Cu *.Mask)
      (net 5 /16))
    (pad 4 thru_hole circle (at 11.43 -3.81) (size 1.524 1.524) (drill 0.9) (layers *.Cu *.Mask)
      (net 4 /21))
    (pad 3 thru_hole circle (at 11.43 -6.35) (size 1.524 1.524) (drill 0.9) (layers *.Cu *.Mask)
      (net 3 /22))
    (pad 2 thru_hole circle (at 11.43 -8.89) (size 1.524 1.524) (drill 0.9) (layers *.Cu *.Mask)
      (net 2 /RXD))
    (pad 1 thru_hole rect (at 11.43 -11.43) (size 1.524 1.524) (drill 0.9) (layers *.Cu *.Mask)
      (net 1 /TXD))
  )

  (module connect-thru:TTGO_Mini_32 (layer F.Cu) (tedit 5DC1584C) (tstamp 5DC14644)
    (at 182.88 88.9)
    (path /5DC1321E)
    (fp_text reference J3 (at 0 0.5) (layer F.SilkS) hide
      (effects (font (size 1 1) (thickness 0.15)))
    )
    (fp_text value TTGO_Mini_32 (at 0 -0.5) (layer F.Fab)
      (effects (font (size 1 1) (thickness 0.15)))
    )
    (fp_line (start 15.24 -17.78) (end 15.24 0) (layer F.SilkS) (width 0.15))
    (fp_line (start 15.24 0) (end 15.24 17.78) (layer F.SilkS) (width 0.15))
    (fp_line (start -15.24 -17.78) (end 15.24 -17.78) (layer F.SilkS) (width 0.15))
    (fp_line (start -12.7 17.78) (end -12.7 13.97) (layer F.SilkS) (width 0.15))
    (fp_arc (start -13.97 13.97) (end -12.7 13.97) (angle -90) (layer F.SilkS) (width 0.15))
    (fp_line (start -13.97 12.7) (end -15.24 12.7) (layer F.SilkS) (width 0.15))
    (fp_line (start 15.24 17.78) (end -12.7 17.78) (layer F.SilkS) (width 0.15))
    (fp_line (start -15.24 12.7) (end -15.24 -17.78) (layer F.SilkS) (width 0.15))
    (fp_text user TXD (at 7.62 -11.43) (layer F.SilkS)
      (effects (font (size 1 1) (thickness 0.15)))
    )
    (fp_text user RXD (at 7.62 -8.89) (layer F.SilkS)
      (effects (font (size 1 1) (thickness 0.15)))
    )
    (fp_text user 22 (at 7.62 -6.35) (layer F.SilkS)
      (effects (font (size 1 1) (thickness 0.15)))
    )
    (fp_text user 21 (at 7.62 -3.81) (layer F.SilkS)
      (effects (font (size 1 1) (thickness 0.15)))
    )
    (fp_text user 16 (at 7.62 -1.27) (layer F.SilkS)
      (effects (font (size 1 1) (thickness 0.15)))
    )
    (fp_text user 17 (at 7.62 1.27) (layer F.SilkS)
      (effects (font (size 1 1) (thickness 0.15)))
    )
    (fp_text user GND (at 7.62 3.81) (layer F.SilkS)
      (effects (font (size 1 1) (thickness 0.15)))
    )
    (fp_text user 5V (at 7.62 6.35) (layer F.SilkS)
      (effects (font (size 1 1) (thickness 0.15)))
    )
    (fp_text user TDO (at 7.62 8.89) (layer F.SilkS)
      (effects (font (size 1 1) (thickness 0.15)))
    )
    (fp_text user SD0 (at 7.62 11.43) (layer F.SilkS)
      (effects (font (size 1 1) (thickness 0.15)))
    )
    (fp_text user SD3 (at -7.62 11.43) (layer F.SilkS)
      (effects (font (size 1 1) (thickness 0.15)))
    )
    (fp_text user TCK (at -7.62 8.89) (layer F.SilkS)
      (effects (font (size 1 1) (thickness 0.15)))
    )
    (fp_text user 3V3 (at -7.62 6.35) (layer F.SilkS)
      (effects (font (size 1 1) (thickness 0.15)))
    )
    (fp_text user 5 (at -7.62 3.81) (layer F.SilkS)
      (effects (font (size 1 1) (thickness 0.15)))
    )
    (fp_text user 23 (at -7.62 1.27) (layer F.SilkS)
      (effects (font (size 1 1) (thickness 0.15)))
    )
    (fp_text user 19 (at -7.62 -1.27) (layer F.SilkS)
      (effects (font (size 1 1) (thickness 0.15)))
    )
    (fp_text user 18 (at -7.62 -3.81) (layer F.SilkS)
      (effects (font (size 1 1) (thickness 0.15)))
    )
    (fp_text user 26 (at -7.62 -6.35) (layer F.SilkS)
      (effects (font (size 1 1) (thickness 0.15)))
    )
    (fp_text user SVP (at -7.62 -8.89) (layer F.SilkS)
      (effects (font (size 1 1) (thickness 0.15)))
    )
    (fp_text user RST (at -7.62 -11.43) (layer F.SilkS)
      (effects (font (size 1 1) (thickness 0.15)))
    )
    (fp_line (start 10.16 -12.7) (end 12.7 -12.7) (layer F.SilkS) (width 0.15))
    (fp_line (start 12.7 -12.7) (end 12.7 12.7) (layer F.SilkS) (width 0.15))
    (fp_line (start 12.7 12.7) (end 10.16 12.7) (layer F.SilkS) (width 0.15))
    (fp_line (start 10.16 12.7) (end 10.16 -12.7) (layer F.SilkS) (width 0.15))
    (fp_line (start -10.16 -12.7) (end -10.16 12.7) (layer F.SilkS) (width 0.15))
    (fp_line (start -10.16 12.7) (end -12.7 12.7) (layer F.SilkS) (width 0.15))
    (fp_line (start -12.7 12.7) (end -12.7 -12.7) (layer F.SilkS) (width 0.15))
    (fp_line (start -12.7 -12.7) (end -10.16 -12.7) (layer F.SilkS) (width 0.15))
    (pad 1 thru_hole rect (at 11.43 -11.43) (size 1.524 1.524) (drill 0.9) (layers *.Cu *.Mask)
      (net 1 /TXD))
    (pad 2 thru_hole circle (at 11.43 -8.89) (size 1.524 1.524) (drill 0.9) (layers *.Cu *.Mask)
      (net 2 /RXD))
    (pad 3 thru_hole circle (at 11.43 -6.35) (size 1.524 1.524) (drill 0.9) (layers *.Cu *.Mask)
      (net 3 /22))
    (pad 4 thru_hole circle (at 11.43 -3.81) (size 1.524 1.524) (drill 0.9) (layers *.Cu *.Mask)
      (net 4 /21))
    (pad 5 thru_hole circle (at 11.43 -1.27) (size 1.524 1.524) (drill 0.9) (layers *.Cu *.Mask)
      (net 5 /16))
    (pad 6 thru_hole circle (at 11.43 1.27) (size 1.524 1.524) (drill 0.9) (layers *.Cu *.Mask)
      (net 6 /17))
    (pad 7 thru_hole circle (at 11.43 3.81) (size 1.524 1.524) (drill 0.9) (layers *.Cu *.Mask)
      (net 7 /GND))
    (pad 8 thru_hole circle (at 11.43 6.35) (size 1.524 1.524) (drill 0.9) (layers *.Cu *.Mask)
      (net 8 /5V))
    (pad 9 thru_hole circle (at 11.43 8.89) (size 1.524 1.524) (drill 0.9) (layers *.Cu *.Mask)
      (net 9 /TDO))
    (pad 10 thru_hole circle (at 11.43 11.43) (size 1.524 1.524) (drill 0.9) (layers *.Cu *.Mask)
      (net 10 /SD0))
    (pad 11 thru_hole circle (at -11.43 11.43) (size 1.524 1.524) (drill 0.9) (layers *.Cu *.Mask)
      (net 11 /SD3))
    (pad 12 thru_hole circle (at -11.43 8.89) (size 1.524 1.524) (drill 0.9) (layers *.Cu *.Mask)
      (net 12 /TCK))
    (pad 13 thru_hole circle (at -11.43 6.35) (size 1.524 1.524) (drill 0.9) (layers *.Cu *.Mask)
      (net 13 /3V3))
    (pad 14 thru_hole circle (at -11.43 3.81) (size 1.524 1.524) (drill 0.9) (layers *.Cu *.Mask)
      (net 14 /5))
    (pad 15 thru_hole circle (at -11.43 1.27) (size 1.524 1.524) (drill 0.9) (layers *.Cu *.Mask)
      (net 15 /23))
    (pad 16 thru_hole circle (at -11.43 -1.27) (size 1.524 1.524) (drill 0.9) (layers *.Cu *.Mask)
      (net 16 /19))
    (pad 17 thru_hole circle (at -11.43 -3.81) (size 1.524 1.524) (drill 0.9) (layers *.Cu *.Mask)
      (net 17 /18))
    (pad 18 thru_hole circle (at -11.43 -6.35) (size 1.524 1.524) (drill 0.9) (layers *.Cu *.Mask)
      (net 18 /26))
    (pad 19 thru_hole circle (at -11.43 -8.89) (size 1.524 1.524) (drill 0.9) (layers *.Cu *.Mask)
      (net 19 /SVP))
    (pad 20 thru_hole circle (at -11.43 -11.43) (size 1.524 1.524) (drill 0.9) (layers *.Cu *.Mask)
      (net 20 /RST))
  )

  (module Mounting_Holes:MountingHole_3.2mm_M3 (layer F.Cu) (tedit 5DC15838) (tstamp 5DC17D36)
    (at 195.58 73.66)
    (descr "Mounting Hole 3.2mm, no annular, M3")
    (tags "mounting hole 3.2mm no annular m3")
    (attr virtual)
    (fp_text reference REF** (at 0 -4.2) (layer F.SilkS) hide
      (effects (font (size 1 1) (thickness 0.15)))
    )
    (fp_text value MountingHole_3.2mm_M3 (at 0 4.2) (layer F.Fab)
      (effects (font (size 1 1) (thickness 0.15)))
    )
    (fp_text user %R (at 0.3 0) (layer F.Fab)
      (effects (font (size 1 1) (thickness 0.15)))
    )
    (fp_circle (center 0 0) (end 3.2 0) (layer Cmts.User) (width 0.15))
    (fp_circle (center 0 0) (end 3.45 0) (layer F.CrtYd) (width 0.05))
    (pad 1 np_thru_hole circle (at 0 0) (size 3.2 3.2) (drill 3.2) (layers *.Cu *.Mask))
  )

  (gr_line (start 101.6 73.66) (end 101.6 101.6) (layer Edge.Cuts) (width 0.15))
  (gr_line (start 195.58 71.12) (end 104.14 71.12) (layer Edge.Cuts) (width 0.15))
  (gr_line (start 198.12 104.14) (end 198.12 73.66) (layer Edge.Cuts) (width 0.15))
  (gr_line (start 104.14 106.68) (end 195.58 106.68) (layer Edge.Cuts) (width 0.15))
  (gr_arc (start 104.14 73.66) (end 104.14 71.12) (angle -90) (layer Edge.Cuts) (width 0.15))
  (gr_arc (start 195.58 73.66) (end 198.12 73.66) (angle -90) (layer Edge.Cuts) (width 0.15))
  (gr_arc (start 195.58 104.14) (end 195.58 106.68) (angle -90) (layer Edge.Cuts) (width 0.15))
  (gr_arc (start 102.87 102.87) (end 104.14 102.87) (angle -90) (layer Edge.Cuts) (width 0.15))
  (gr_line (start 101.6 101.6) (end 102.87 101.6) (layer Edge.Cuts) (width 0.15))
  (gr_line (start 104.14 106.68) (end 104.14 102.87) (layer Edge.Cuts) (width 0.15))
  (gr_text littleawesomeideas.com (at 121.285 105.41) (layer F.SilkS)
    (effects (font (size 1 1) (thickness 0.2)))
  )
  (gr_text "REV A" (at 173.482 105.664) (layer F.SilkS)
    (effects (font (size 1.5 1.5) (thickness 0.3)))
  )
  (gr_text "TTGO Mini 32 Tri-Tray" (at 151.13 105.156) (layer F.SilkS)
    (effects (font (size 1.5 1.5) (thickness 0.3)))
  )
  (gr_text 3 (at 182.88 73.66) (layer F.SilkS)
    (effects (font (size 3 3) (thickness 0.3)))
  )
  (gr_text 2 (at 149.86 73.66) (layer F.SilkS)
    (effects (font (size 3 3) (thickness 0.3)))
  )
  (gr_text 1 (at 116.84 73.66) (layer F.SilkS)
    (effects (font (size 3 3) (thickness 0.3)))
  )

  (segment (start 162.814 77.47) (end 161.29 77.47) (width 0.4) (layer F.Cu) (net 1))
  (segment (start 164.084 76.2) (end 162.814 77.47) (width 0.4) (layer F.Cu) (net 1))
  (segment (start 191.77 76.2) (end 164.084 76.2) (width 0.4) (layer F.Cu) (net 1))
  (segment (start 194.31 77.47) (end 193.04 77.47) (width 0.4) (layer F.Cu) (net 1))
  (segment (start 193.04 77.47) (end 191.77 76.2) (width 0.4) (layer F.Cu) (net 1))
  (segment (start 161.29 77.47) (end 159.766 77.47) (width 0.4) (layer F.Cu) (net 1))
  (segment (start 159.766 77.47) (end 158.496 76.2) (width 0.4) (layer F.Cu) (net 1))
  (segment (start 158.496 76.2) (end 131.826 76.2) (width 0.4) (layer F.Cu) (net 1))
  (segment (start 131.826 76.2) (end 130.556 77.47) (width 0.4) (layer F.Cu) (net 1))
  (segment (start 130.556 77.47) (end 128.27 77.47) (width 0.4) (layer F.Cu) (net 1))
  (segment (start 128.27 80.01) (end 129.54 78.74) (width 0.4) (layer F.Cu) (net 2))
  (segment (start 160.02 78.74) (end 161.29 80.01) (width 0.4) (layer F.Cu) (net 2))
  (segment (start 129.54 78.74) (end 160.02 78.74) (width 0.4) (layer F.Cu) (net 2))
  (segment (start 161.29 80.01) (end 162.56 78.74) (width 0.4) (layer F.Cu) (net 2))
  (segment (start 193.04 78.74) (end 194.31 80.01) (width 0.4) (layer F.Cu) (net 2))
  (segment (start 162.56 78.74) (end 193.04 78.74) (width 0.4) (layer F.Cu) (net 2))
  (segment (start 194.31 82.55) (end 193.04 81.28) (width 0.4) (layer F.Cu) (net 3))
  (segment (start 162.56 81.28) (end 161.29 82.55) (width 0.4) (layer F.Cu) (net 3))
  (segment (start 193.04 81.28) (end 162.56 81.28) (width 0.4) (layer F.Cu) (net 3))
  (segment (start 161.29 82.55) (end 160.02 81.28) (width 0.4) (layer F.Cu) (net 3))
  (segment (start 129.54 81.28) (end 128.27 82.55) (width 0.4) (layer F.Cu) (net 3))
  (segment (start 160.02 81.28) (end 129.54 81.28) (width 0.4) (layer F.Cu) (net 3))
  (segment (start 128.27 85.09) (end 129.54 83.82) (width 0.4) (layer F.Cu) (net 4))
  (segment (start 160.02 83.82) (end 161.29 85.09) (width 0.4) (layer F.Cu) (net 4))
  (segment (start 129.54 83.82) (end 160.02 83.82) (width 0.4) (layer F.Cu) (net 4))
  (segment (start 161.29 85.09) (end 162.56 83.82) (width 0.4) (layer F.Cu) (net 4))
  (segment (start 193.04 83.82) (end 194.31 85.09) (width 0.4) (layer F.Cu) (net 4))
  (segment (start 162.56 83.82) (end 193.04 83.82) (width 0.4) (layer F.Cu) (net 4))
  (segment (start 129.031999 86.868001) (end 128.27 87.63) (width 0.4) (layer F.Cu) (net 5))
  (segment (start 160.02 86.36) (end 161.397999 87.737999) (width 0.4) (layer F.Cu) (net 5))
  (segment (start 128.924 86.976) (end 129.54 86.36) (width 0.4) (layer F.Cu) (net 5))
  (segment (start 129.54 86.36) (end 160.02 86.36) (width 0.4) (layer F.Cu) (net 5))
  (segment (start 193.04 86.36) (end 194.31 87.63) (width 0.4) (layer F.Cu) (net 5))
  (segment (start 161.29 87.63) (end 162.56 86.36) (width 0.4) (layer F.Cu) (net 5))
  (segment (start 162.56 86.36) (end 193.04 86.36) (width 0.4) (layer F.Cu) (net 5))
  (segment (start 161.29 90.17) (end 162.56 88.9) (width 0.4) (layer F.Cu) (net 6))
  (segment (start 193.04 88.9) (end 194.31 90.17) (width 0.4) (layer F.Cu) (net 6))
  (segment (start 162.56 88.9) (end 193.04 88.9) (width 0.4) (layer F.Cu) (net 6))
  (segment (start 160.02 88.9) (end 161.29 90.17) (width 0.4) (layer F.Cu) (net 6))
  (segment (start 128.27 90.17) (end 129.54 88.9) (width 0.4) (layer F.Cu) (net 6))
  (segment (start 129.54 88.9) (end 160.02 88.9) (width 0.4) (layer F.Cu) (net 6))
  (via (at 175.26 91.44) (size 0.8) (drill 0.4) (layers F.Cu B.Cu) (net 7))
  (via (at 177.8 91.44) (size 0.8) (drill 0.4) (layers F.Cu B.Cu) (net 7))
  (via (at 180.34 91.44) (size 0.8) (drill 0.4) (layers F.Cu B.Cu) (net 7))
  (via (at 182.88 91.44) (size 0.8) (drill 0.4) (layers F.Cu B.Cu) (net 7))
  (via (at 185.42 91.44) (size 0.8) (drill 0.4) (layers F.Cu B.Cu) (net 7))
  (via (at 187.96 91.44) (size 0.8) (drill 0.4) (layers F.Cu B.Cu) (net 7))
  (via (at 190.5 91.44) (size 0.8) (drill 0.4) (layers F.Cu B.Cu) (net 7))
  (via (at 196.596 76.708) (size 0.8) (drill 0.4) (layers F.Cu B.Cu) (net 7))
  (via (at 196.596 78.994) (size 0.8) (drill 0.4) (layers F.Cu B.Cu) (net 7))
  (via (at 196.596 81.28) (size 0.8) (drill 0.4) (layers F.Cu B.Cu) (net 7))
  (via (at 196.596 83.82) (size 0.8) (drill 0.4) (layers F.Cu B.Cu) (net 7))
  (via (at 196.596 86.36) (size 0.8) (drill 0.4) (layers F.Cu B.Cu) (net 7))
  (via (at 196.596 88.9) (size 0.8) (drill 0.4) (layers F.Cu B.Cu) (net 7))
  (via (at 196.596 91.44) (size 0.8) (drill 0.4) (layers F.Cu B.Cu) (net 7))
  (via (at 196.596 93.98) (size 0.8) (drill 0.4) (layers F.Cu B.Cu) (net 7))
  (via (at 196.596 96.52) (size 0.8) (drill 0.4) (layers F.Cu B.Cu) (net 7))
  (via (at 196.596 99.06) (size 0.8) (drill 0.4) (layers F.Cu B.Cu) (net 7))
  (via (at 196.596 101.092) (size 0.8) (drill 0.4) (layers F.Cu B.Cu) (net 7))
  (via (at 190.5 104.14) (size 0.8) (drill 0.4) (layers F.Cu B.Cu) (net 7))
  (via (at 187.96 104.14) (size 0.8) (drill 0.4) (layers F.Cu B.Cu) (net 7))
  (via (at 185.42 104.14) (size 0.8) (drill 0.4) (layers F.Cu B.Cu) (net 7))
  (via (at 182.88 104.14) (size 0.8) (drill 0.4) (layers F.Cu B.Cu) (net 7))
  (via (at 180.34 104.14) (size 0.8) (drill 0.4) (layers F.Cu B.Cu) (net 7))
  (via (at 177.8 104.14) (size 0.8) (drill 0.4) (layers F.Cu B.Cu) (net 7))
  (via (at 175.26 104.14) (size 0.8) (drill 0.4) (layers F.Cu B.Cu) (net 7))
  (via (at 172.72 104.14) (size 0.8) (drill 0.4) (layers F.Cu B.Cu) (net 7))
  (via (at 170.18 104.14) (size 0.8) (drill 0.4) (layers F.Cu B.Cu) (net 7))
  (via (at 167.64 104.14) (size 0.8) (drill 0.4) (layers F.Cu B.Cu) (net 7))
  (via (at 165.1 104.14) (size 0.8) (drill 0.4) (layers F.Cu B.Cu) (net 7))
  (via (at 162.56 104.14) (size 0.8) (drill 0.4) (layers F.Cu B.Cu) (net 7))
  (via (at 160.02 103.632) (size 0.8) (drill 0.4) (layers F.Cu B.Cu) (net 7))
  (via (at 157.48 103.886) (size 0.8) (drill 0.4) (layers F.Cu B.Cu) (net 7))
  (via (at 154.94 103.632) (size 0.8) (drill 0.4) (layers F.Cu B.Cu) (net 7))
  (via (at 152.4 103.632) (size 0.8) (drill 0.4) (layers F.Cu B.Cu) (net 7))
  (via (at 149.86 104.14) (size 0.8) (drill 0.4) (layers F.Cu B.Cu) (net 7))
  (via (at 147.32 103.632) (size 0.8) (drill 0.4) (layers F.Cu B.Cu) (net 7))
  (via (at 144.78 103.886) (size 0.8) (drill 0.4) (layers F.Cu B.Cu) (net 7))
  (via (at 142.24 103.886) (size 0.8) (drill 0.4) (layers F.Cu B.Cu) (net 7))
  (via (at 139.7 103.632) (size 0.8) (drill 0.4) (layers F.Cu B.Cu) (net 7))
  (via (at 137.16 104.14) (size 0.8) (drill 0.4) (layers F.Cu B.Cu) (net 7))
  (via (at 134.62 104.14) (size 0.8) (drill 0.4) (layers F.Cu B.Cu) (net 7))
  (via (at 132.08 104.14) (size 0.8) (drill 0.4) (layers F.Cu B.Cu) (net 7))
  (via (at 129.54 104.14) (size 0.8) (drill 0.4) (layers F.Cu B.Cu) (net 7))
  (via (at 127 104.14) (size 0.8) (drill 0.4) (layers F.Cu B.Cu) (net 7))
  (via (at 124.46 104.14) (size 0.8) (drill 0.4) (layers F.Cu B.Cu) (net 7))
  (via (at 121.92 104.14) (size 0.8) (drill 0.4) (layers F.Cu B.Cu) (net 7))
  (via (at 119.38 104.14) (size 0.8) (drill 0.4) (layers F.Cu B.Cu) (net 7))
  (via (at 116.84 104.14) (size 0.8) (drill 0.4) (layers F.Cu B.Cu) (net 7))
  (via (at 114.3 104.14) (size 0.8) (drill 0.4) (layers F.Cu B.Cu) (net 7))
  (via (at 112.014 104.14) (size 0.8) (drill 0.4) (layers F.Cu B.Cu) (net 7))
  (via (at 106.172 104.14) (size 0.8) (drill 0.4) (layers F.Cu B.Cu) (net 7))
  (via (at 103.124 99.06) (size 0.8) (drill 0.4) (layers F.Cu B.Cu) (net 7))
  (via (at 103.124 96.52) (size 0.8) (drill 0.4) (layers F.Cu B.Cu) (net 7))
  (via (at 103.124 93.98) (size 0.8) (drill 0.4) (layers F.Cu B.Cu) (net 7))
  (via (at 103.124 91.44) (size 0.8) (drill 0.4) (layers F.Cu B.Cu) (net 7))
  (via (at 103.124 88.9) (size 0.8) (drill 0.4) (layers F.Cu B.Cu) (net 7))
  (via (at 103.124 86.36) (size 0.8) (drill 0.4) (layers F.Cu B.Cu) (net 7))
  (via (at 103.124 83.82) (size 0.8) (drill 0.4) (layers F.Cu B.Cu) (net 7))
  (via (at 103.124 81.28) (size 0.8) (drill 0.4) (layers F.Cu B.Cu) (net 7))
  (via (at 103.124 78.74) (size 0.8) (drill 0.4) (layers F.Cu B.Cu) (net 7))
  (via (at 103.124 76.708) (size 0.8) (drill 0.4) (layers F.Cu B.Cu) (net 7))
  (via (at 107.188 73.66) (size 0.8) (drill 0.4) (layers F.Cu B.Cu) (net 7))
  (via (at 109.22 73.66) (size 0.8) (drill 0.4) (layers F.Cu B.Cu) (net 7))
  (via (at 111.76 73.66) (size 0.8) (drill 0.4) (layers F.Cu B.Cu) (net 7))
  (via (at 114.808 73.66) (size 0.8) (drill 0.4) (layers F.Cu B.Cu) (net 7))
  (via (at 118.11 73.66) (size 0.8) (drill 0.4) (layers F.Cu B.Cu) (net 7))
  (via (at 121.412 73.66) (size 0.8) (drill 0.4) (layers F.Cu B.Cu) (net 7))
  (via (at 124.46 73.66) (size 0.8) (drill 0.4) (layers F.Cu B.Cu) (net 7))
  (via (at 127 73.66) (size 0.8) (drill 0.4) (layers F.Cu B.Cu) (net 7))
  (via (at 129.54 73.66) (size 0.8) (drill 0.4) (layers F.Cu B.Cu) (net 7))
  (via (at 132.08 73.66) (size 0.8) (drill 0.4) (layers F.Cu B.Cu) (net 7))
  (via (at 134.62 73.66) (size 0.8) (drill 0.4) (layers F.Cu B.Cu) (net 7))
  (via (at 137.16 73.66) (size 0.8) (drill 0.4) (layers F.Cu B.Cu) (net 7))
  (via (at 139.7 73.66) (size 0.8) (drill 0.4) (layers F.Cu B.Cu) (net 7))
  (via (at 142.24 73.66) (size 0.8) (drill 0.4) (layers F.Cu B.Cu) (net 7))
  (via (at 144.78 73.66) (size 0.8) (drill 0.4) (layers F.Cu B.Cu) (net 7))
  (via (at 146.812 73.66) (size 0.8) (drill 0.4) (layers F.Cu B.Cu) (net 7))
  (via (at 149.098 73.66) (size 0.8) (drill 0.4) (layers F.Cu B.Cu) (net 7))
  (via (at 152.146 73.66) (size 0.8) (drill 0.4) (layers F.Cu B.Cu) (net 7))
  (via (at 154.94 73.66) (size 0.8) (drill 0.4) (layers F.Cu B.Cu) (net 7))
  (via (at 157.48 73.66) (size 0.8) (drill 0.4) (layers F.Cu B.Cu) (net 7))
  (via (at 160.02 73.66) (size 0.8) (drill 0.4) (layers F.Cu B.Cu) (net 7))
  (via (at 162.56 73.66) (size 0.8) (drill 0.4) (layers F.Cu B.Cu) (net 7))
  (via (at 165.1 73.66) (size 0.8) (drill 0.4) (layers F.Cu B.Cu) (net 7))
  (via (at 167.64 73.66) (size 0.8) (drill 0.4) (layers F.Cu B.Cu) (net 7))
  (via (at 170.18 73.66) (size 0.8) (drill 0.4) (layers F.Cu B.Cu) (net 7))
  (via (at 172.72 73.66) (size 0.8) (drill 0.4) (layers F.Cu B.Cu) (net 7))
  (via (at 175.26 73.66) (size 0.8) (drill 0.4) (layers F.Cu B.Cu) (net 7))
  (via (at 177.8 73.66) (size 0.8) (drill 0.4) (layers F.Cu B.Cu) (net 7))
  (via (at 180.34 73.66) (size 0.8) (drill 0.4) (layers F.Cu B.Cu) (net 7))
  (via (at 182.88 73.914) (size 0.8) (drill 0.4) (layers F.Cu B.Cu) (net 7))
  (via (at 185.42 73.66) (size 0.8) (drill 0.4) (layers F.Cu B.Cu) (net 7))
  (via (at 187.96 73.66) (size 0.8) (drill 0.4) (layers F.Cu B.Cu) (net 7))
  (via (at 190.5 73.66) (size 0.8) (drill 0.4) (layers F.Cu B.Cu) (net 7))
  (via (at 192.532 73.66) (size 0.8) (drill 0.4) (layers F.Cu B.Cu) (net 7))
  (via (at 108.585 92.075) (size 0.8) (drill 0.4) (layers F.Cu B.Cu) (net 7))
  (via (at 111.125 91.44) (size 0.8) (drill 0.4) (layers F.Cu B.Cu) (net 7))
  (via (at 114.3 92.075) (size 0.8) (drill 0.4) (layers F.Cu B.Cu) (net 7))
  (via (at 117.475 91.44) (size 0.8) (drill 0.4) (layers F.Cu B.Cu) (net 7))
  (via (at 120.65 92.075) (size 0.8) (drill 0.4) (layers F.Cu B.Cu) (net 7))
  (via (at 123.19 91.44) (size 0.8) (drill 0.4) (layers F.Cu B.Cu) (net 7))
  (via (at 125.73 92.075) (size 0.8) (drill 0.4) (layers F.Cu B.Cu) (net 7))
  (segment (start 194.31 95.25) (end 192.786 95.25) (width 1) (layer F.Cu) (net 8) (tstamp 5DC15270))
  (segment (start 161.29 95.25) (end 159.766 95.25) (width 1) (layer F.Cu) (net 8) (tstamp 5DC15270))
  (segment (start 161.29 95.25) (end 162.814 95.25) (width 1) (layer F.Cu) (net 8) (tstamp 5DC15270))
  (segment (start 128.27 95.25) (end 129.794 95.25) (width 1) (layer F.Cu) (net 8))
  (segment (start 161.29 97.79) (end 162.56 97.79) (width 0.4) (layer F.Cu) (net 9))
  (segment (start 162.56 97.79) (end 163.83 99.06) (width 0.4) (layer F.Cu) (net 9))
  (segment (start 193.04 99.06) (end 194.31 97.79) (width 0.4) (layer F.Cu) (net 9))
  (segment (start 163.83 99.06) (end 193.04 99.06) (width 0.4) (layer F.Cu) (net 9))
  (segment (start 129.54 99.06) (end 128.27 97.79) (width 0.4) (layer F.Cu) (net 9))
  (segment (start 161.29 97.79) (end 160.02 99.06) (width 0.4) (layer F.Cu) (net 9))
  (segment (start 160.02 99.06) (end 129.54 99.06) (width 0.4) (layer F.Cu) (net 9))
  (segment (start 162.56 101.6) (end 161.29 100.33) (width 0.4) (layer F.Cu) (net 10))
  (segment (start 194.31 100.33) (end 193.04 101.6) (width 0.4) (layer F.Cu) (net 10))
  (segment (start 193.04 101.6) (end 162.56 101.6) (width 0.4) (layer F.Cu) (net 10))
  (segment (start 160.02 101.6) (end 161.29 100.33) (width 0.4) (layer F.Cu) (net 10))
  (segment (start 128.27 100.33) (end 129.54 101.6) (width 0.4) (layer F.Cu) (net 10))
  (segment (start 160.02 101.6) (end 129.54 101.6) (width 0.4) (layer F.Cu) (net 10))
  (segment (start 105.41 100.33) (end 106.68 101.6) (width 0.4) (layer B.Cu) (net 11))
  (segment (start 137.16 101.6) (end 138.43 100.33) (width 0.4) (layer B.Cu) (net 11))
  (segment (start 106.68 101.6) (end 137.16 101.6) (width 0.4) (layer B.Cu) (net 11))
  (segment (start 138.43 100.33) (end 139.7 101.6) (width 0.4) (layer B.Cu) (net 11))
  (segment (start 170.18 101.6) (end 171.45 100.33) (width 0.4) (layer B.Cu) (net 11))
  (segment (start 139.7 101.6) (end 170.18 101.6) (width 0.4) (layer B.Cu) (net 11))
  (segment (start 171.45 97.79) (end 170.18 99.06) (width 0.4) (layer B.Cu) (net 12))
  (segment (start 139.7 99.06) (end 138.43 97.79) (width 0.4) (layer B.Cu) (net 12))
  (segment (start 170.18 99.06) (end 139.7 99.06) (width 0.4) (layer B.Cu) (net 12))
  (segment (start 138.43 97.79) (end 137.16 99.06) (width 0.4) (layer B.Cu) (net 12))
  (segment (start 106.68 99.06) (end 105.41 97.79) (width 0.4) (layer B.Cu) (net 12))
  (segment (start 137.16 99.06) (end 106.68 99.06) (width 0.4) (layer B.Cu) (net 12))
  (segment (start 105.41 95.25) (end 106.68 95.25) (width 1) (layer B.Cu) (net 13))
  (segment (start 171.45 95.25) (end 170.18 95.25) (width 1) (layer B.Cu) (net 13))
  (segment (start 138.43 92.71) (end 139.7 91.44) (width 0.4) (layer B.Cu) (net 14))
  (segment (start 170.18 91.44) (end 171.45 92.71) (width 0.4) (layer B.Cu) (net 14))
  (segment (start 139.7 91.44) (end 165.1 91.44) (width 0.4) (layer B.Cu) (net 14))
  (segment (start 165.1 91.44) (end 167.64 91.44) (width 0.4) (layer B.Cu) (net 14) (tstamp 5DC16F0D))
  (segment (start 167.64 91.44) (end 170.18 91.44) (width 0.4) (layer B.Cu) (net 14) (tstamp 5DC16FF3))
  (segment (start 137.16 91.44) (end 138.43 92.71) (width 0.4) (layer B.Cu) (net 14))
  (segment (start 127 91.44) (end 137.16 91.44) (width 0.4) (layer B.Cu) (net 14))
  (segment (start 125.476 89.916) (end 127 91.44) (width 0.4) (layer B.Cu) (net 14))
  (segment (start 108.204 89.916) (end 125.476 89.916) (width 0.4) (layer B.Cu) (net 14))
  (segment (start 105.41 92.71) (end 108.204 89.916) (width 0.4) (layer B.Cu) (net 14))
  (segment (start 138.43 90.17) (end 137.16 88.9) (width 0.4) (layer B.Cu) (net 15))
  (segment (start 139.191999 89.408001) (end 138.43 90.17) (width 0.4) (layer B.Cu) (net 15))
  (segment (start 139.7 88.9) (end 139.191999 89.408001) (width 0.4) (layer B.Cu) (net 15))
  (segment (start 171.45 90.17) (end 170.18 88.9) (width 0.4) (layer B.Cu) (net 15))
  (segment (start 170.18 88.9) (end 139.7 88.9) (width 0.4) (layer B.Cu) (net 15))
  (segment (start 106.68 88.9) (end 105.41 90.17) (width 0.4) (layer B.Cu) (net 15))
  (segment (start 137.16 88.9) (end 106.68 88.9) (width 0.4) (layer B.Cu) (net 15))
  (segment (start 105.41 87.63) (end 106.68 86.36) (width 0.4) (layer B.Cu) (net 16))
  (segment (start 137.16 86.36) (end 138.43 87.63) (width 0.4) (layer B.Cu) (net 16))
  (segment (start 106.68 86.36) (end 137.16 86.36) (width 0.4) (layer B.Cu) (net 16))
  (segment (start 138.43 87.63) (end 139.7 86.36) (width 0.4) (layer B.Cu) (net 16))
  (segment (start 170.18 86.36) (end 171.45 87.63) (width 0.4) (layer B.Cu) (net 16))
  (segment (start 139.7 86.36) (end 170.18 86.36) (width 0.4) (layer B.Cu) (net 16))
  (segment (start 171.45 85.09) (end 170.18 83.82) (width 0.4) (layer B.Cu) (net 17))
  (segment (start 139.7 83.82) (end 138.43 85.09) (width 0.4) (layer B.Cu) (net 17))
  (segment (start 170.18 83.82) (end 139.7 83.82) (width 0.4) (layer B.Cu) (net 17))
  (segment (start 138.43 85.09) (end 137.16 83.82) (width 0.4) (layer B.Cu) (net 17))
  (segment (start 106.68 83.82) (end 105.41 85.09) (width 0.4) (layer B.Cu) (net 17))
  (segment (start 137.16 83.82) (end 106.68 83.82) (width 0.4) (layer B.Cu) (net 17))
  (segment (start 105.41 82.55) (end 106.68 81.28) (width 0.4) (layer B.Cu) (net 18))
  (segment (start 137.16 81.28) (end 138.43 82.55) (width 0.4) (layer B.Cu) (net 18))
  (segment (start 106.68 81.28) (end 137.16 81.28) (width 0.4) (layer B.Cu) (net 18))
  (segment (start 138.43 82.55) (end 139.7 81.28) (width 0.4) (layer B.Cu) (net 18))
  (segment (start 170.18 81.28) (end 171.45 82.55) (width 0.4) (layer B.Cu) (net 18))
  (segment (start 139.7 81.28) (end 170.18 81.28) (width 0.4) (layer B.Cu) (net 18))
  (segment (start 171.45 80.01) (end 170.18 78.74) (width 0.4) (layer B.Cu) (net 19))
  (segment (start 139.7 78.74) (end 138.43 80.01) (width 0.4) (layer B.Cu) (net 19))
  (segment (start 170.18 78.74) (end 139.7 78.74) (width 0.4) (layer B.Cu) (net 19))
  (segment (start 138.43 80.01) (end 137.16 78.74) (width 0.4) (layer B.Cu) (net 19))
  (segment (start 106.68 78.74) (end 105.41 80.01) (width 0.4) (layer B.Cu) (net 19))
  (segment (start 137.16 78.74) (end 106.68 78.74) (width 0.4) (layer B.Cu) (net 19))
  (segment (start 105.41 77.47) (end 106.68 76.2) (width 0.4) (layer B.Cu) (net 20))
  (segment (start 137.16 76.2) (end 138.43 77.47) (width 0.4) (layer B.Cu) (net 20))
  (segment (start 106.68 76.2) (end 137.16 76.2) (width 0.4) (layer B.Cu) (net 20))
  (segment (start 138.43 77.47) (end 139.7 76.2) (width 0.4) (layer B.Cu) (net 20))
  (segment (start 170.18 76.2) (end 171.45 77.47) (width 0.4) (layer B.Cu) (net 20))
  (segment (start 139.7 76.2) (end 170.18 76.2) (width 0.4) (layer B.Cu) (net 20))

  (zone (net 7) (net_name /GND) (layer B.Cu) (tstamp 5DC19424) (hatch edge 0.508)
    (connect_pads (clearance 0.35))
    (min_thickness 0.25)
    (fill yes (arc_segments 16) (thermal_gap 0.508) (thermal_bridge_width 0.508))
    (polygon
      (pts
        (xy 101.6 71.12) (xy 198.12 71.12) (xy 198.12 106.68) (xy 101.6 106.68)
      )
    )
    (filled_polygon
      (pts
        (xy 194.404607 71.9009) (xy 193.8209 72.484607) (xy 193.505 73.247257) (xy 193.505 74.072743) (xy 193.8209 74.835393)
        (xy 194.404607 75.4191) (xy 195.167257 75.735) (xy 195.992743 75.735) (xy 196.755393 75.4191) (xy 197.3391 74.835393)
        (xy 197.570001 74.277949) (xy 197.57 103.522049) (xy 197.3391 102.964607) (xy 196.755393 102.3809) (xy 195.992743 102.065)
        (xy 195.167257 102.065) (xy 194.404607 102.3809) (xy 193.8209 102.964607) (xy 193.505 103.727257) (xy 193.505 104.552743)
        (xy 193.8209 105.315393) (xy 194.404607 105.8991) (xy 194.962049 106.13) (xy 109.837951 106.13) (xy 110.395393 105.8991)
        (xy 110.9791 105.315393) (xy 111.295 104.552743) (xy 111.295 103.727257) (xy 110.9791 102.964607) (xy 110.395393 102.3809)
        (xy 110.139728 102.275) (xy 137.093519 102.275) (xy 137.16 102.288224) (xy 137.226481 102.275) (xy 137.423372 102.235836)
        (xy 137.646648 102.086648) (xy 137.684309 102.030284) (xy 138.158241 101.556353) (xy 138.183945 101.567) (xy 138.676055 101.567)
        (xy 138.701759 101.556353) (xy 139.175694 102.030289) (xy 139.213352 102.086648) (xy 139.436628 102.235836) (xy 139.633519 102.275)
        (xy 139.699999 102.288224) (xy 139.766479 102.275) (xy 170.113519 102.275) (xy 170.18 102.288224) (xy 170.246481 102.275)
        (xy 170.443372 102.235836) (xy 170.666648 102.086648) (xy 170.704309 102.030284) (xy 171.178241 101.556353) (xy 171.203945 101.567)
        (xy 171.696055 101.567) (xy 172.150704 101.378678) (xy 172.498678 101.030704) (xy 172.687 100.576055) (xy 172.687 100.083945)
        (xy 193.073 100.083945) (xy 193.073 100.576055) (xy 193.261322 101.030704) (xy 193.609296 101.378678) (xy 194.063945 101.567)
        (xy 194.556055 101.567) (xy 195.010704 101.378678) (xy 195.358678 101.030704) (xy 195.547 100.576055) (xy 195.547 100.083945)
        (xy 195.358678 99.629296) (xy 195.010704 99.281322) (xy 194.556055 99.093) (xy 194.063945 99.093) (xy 193.609296 99.281322)
        (xy 193.261322 99.629296) (xy 193.073 100.083945) (xy 172.687 100.083945) (xy 172.498678 99.629296) (xy 172.150704 99.281322)
        (xy 171.696055 99.093) (xy 171.203945 99.093) (xy 171.02922 99.165374) (xy 171.178241 99.016353) (xy 171.203945 99.027)
        (xy 171.696055 99.027) (xy 172.150704 98.838678) (xy 172.498678 98.490704) (xy 172.687 98.036055) (xy 172.687 97.543945)
        (xy 193.073 97.543945) (xy 193.073 98.036055) (xy 193.261322 98.490704) (xy 193.609296 98.838678) (xy 194.063945 99.027)
        (xy 194.556055 99.027) (xy 195.010704 98.838678) (xy 195.358678 98.490704) (xy 195.547 98.036055) (xy 195.547 97.543945)
        (xy 195.358678 97.089296) (xy 195.010704 96.741322) (xy 194.556055 96.553) (xy 194.063945 96.553) (xy 193.609296 96.741322)
        (xy 193.261322 97.089296) (xy 193.073 97.543945) (xy 172.687 97.543945) (xy 172.498678 97.089296) (xy 172.150704 96.741322)
        (xy 171.696055 96.553) (xy 171.203945 96.553) (xy 170.749296 96.741322) (xy 170.401322 97.089296) (xy 170.213 97.543945)
        (xy 170.213 98.036055) (xy 170.223647 98.061759) (xy 169.900407 98.385) (xy 162.382462 98.385) (xy 162.527 98.036055)
        (xy 162.527 97.543945) (xy 162.51004 97.503) (xy 168.91 97.503) (xy 169.091775 97.466843) (xy 169.245876 97.363876)
        (xy 170.384752 96.225) (xy 170.675618 96.225) (xy 170.749296 96.298678) (xy 171.203945 96.487) (xy 171.696055 96.487)
        (xy 172.150704 96.298678) (xy 172.498678 95.950704) (xy 172.687 95.496055) (xy 172.687 95.003945) (xy 193.073 95.003945)
        (xy 193.073 95.496055) (xy 193.261322 95.950704) (xy 193.609296 96.298678) (xy 194.063945 96.487) (xy 194.556055 96.487)
        (xy 195.010704 96.298678) (xy 195.358678 95.950704) (xy 195.547 95.496055) (xy 195.547 95.003945) (xy 195.358678 94.549296)
        (xy 195.010704 94.201322) (xy 194.699083 94.072244) (xy 195.038216 93.931771) (xy 195.107957 93.69039) (xy 194.31 92.892434)
        (xy 193.512043 93.69039) (xy 193.581784 93.931771) (xy 193.94701 94.061436) (xy 193.609296 94.201322) (xy 193.261322 94.549296)
        (xy 193.073 95.003945) (xy 172.687 95.003945) (xy 172.498678 94.549296) (xy 172.150704 94.201322) (xy 171.696055 94.013)
        (xy 171.203945 94.013) (xy 170.749296 94.201322) (xy 170.675618 94.275) (xy 170.384752 94.275) (xy 169.245876 93.136124)
        (xy 169.091775 93.033157) (xy 168.91 92.997) (xy 163.83 92.997) (xy 163.648225 93.033157) (xy 163.494124 93.136124)
        (xy 162.209815 94.420433) (xy 161.990704 94.201322) (xy 161.679083 94.072244) (xy 162.018216 93.931771) (xy 162.087957 93.69039)
        (xy 161.29 92.892434) (xy 160.492043 93.69039) (xy 160.561784 93.931771) (xy 160.92701 94.061436) (xy 160.589296 94.201322)
        (xy 160.370185 94.420433) (xy 159.085876 93.136124) (xy 158.931775 93.033157) (xy 158.75 92.997) (xy 140.97 92.997)
        (xy 140.788225 93.033157) (xy 140.634124 93.136124) (xy 139.349815 94.420433) (xy 139.130704 94.201322) (xy 138.676055 94.013)
        (xy 138.183945 94.013) (xy 137.729296 94.201322) (xy 137.510185 94.420433) (xy 136.225876 93.136124) (xy 136.071775 93.033157)
        (xy 135.89 92.997) (xy 130.81 92.997) (xy 130.628225 93.033157) (xy 130.474124 93.136124) (xy 129.189815 94.420433)
        (xy 128.970704 94.201322) (xy 128.659083 94.072244) (xy 128.998216 93.931771) (xy 129.067957 93.69039) (xy 128.27 92.892434)
        (xy 127.472043 93.69039) (xy 127.541784 93.931771) (xy 127.90701 94.061436) (xy 127.569296 94.201322) (xy 127.350185 94.420433)
        (xy 126.065876 93.136124) (xy 125.911775 93.033157) (xy 125.73 92.997) (xy 107.95 92.997) (xy 107.768225 93.033157)
        (xy 107.614124 93.136124) (xy 106.475248 94.275) (xy 106.184382 94.275) (xy 106.110704 94.201322) (xy 105.656055 94.013)
        (xy 105.163945 94.013) (xy 104.709296 94.201322) (xy 104.361322 94.549296) (xy 104.173 95.003945) (xy 104.173 95.496055)
        (xy 104.361322 95.950704) (xy 104.709296 96.298678) (xy 105.163945 96.487) (xy 105.656055 96.487) (xy 106.110704 96.298678)
        (xy 106.184382 96.225) (xy 106.475248 96.225) (xy 107.614124 97.363876) (xy 107.768225 97.466843) (xy 107.95 97.503)
        (xy 127.04996 97.503) (xy 127.033 97.543945) (xy 127.033 98.036055) (xy 127.177538 98.385) (xy 106.959595 98.385)
        (xy 106.636353 98.061759) (xy 106.647 98.036055) (xy 106.647 97.543945) (xy 106.458678 97.089296) (xy 106.110704 96.741322)
        (xy 105.656055 96.553) (xy 105.163945 96.553) (xy 104.709296 96.741322) (xy 104.361322 97.089296) (xy 104.173 97.543945)
        (xy 104.173 98.036055) (xy 104.361322 98.490704) (xy 104.709296 98.838678) (xy 105.163945 99.027) (xy 105.656055 99.027)
        (xy 105.681759 99.016353) (xy 105.830779 99.165373) (xy 105.656055 99.093) (xy 105.163945 99.093) (xy 104.709296 99.281322)
        (xy 104.361322 99.629296) (xy 104.173 100.083945) (xy 104.173 100.576055) (xy 104.361322 101.030704) (xy 104.709296 101.378678)
        (xy 105.163945 101.567) (xy 105.656055 101.567) (xy 105.681759 101.556353) (xy 106.155694 102.030289) (xy 106.193352 102.086648)
        (xy 106.416628 102.235836) (xy 106.613519 102.275) (xy 106.679999 102.288224) (xy 106.746479 102.275) (xy 108.300272 102.275)
        (xy 108.044607 102.3809) (xy 107.4609 102.964607) (xy 107.145 103.727257) (xy 107.145 104.552743) (xy 107.4609 105.315393)
        (xy 108.044607 105.8991) (xy 108.602049 106.13) (xy 104.69 106.13) (xy 104.69 102.81583) (xy 104.68529 102.792151)
        (xy 104.668613 102.601532) (xy 104.650016 102.532125) (xy 104.637537 102.461356) (xy 104.486683 102.046889) (xy 104.486683 102.046888)
        (xy 104.391176 101.881467) (xy 104.107664 101.543591) (xy 103.96134 101.42081) (xy 103.961338 101.420809) (xy 103.579367 101.200277)
        (xy 103.579366 101.200276) (xy 103.495389 101.169711) (xy 103.399874 101.134946) (xy 103.399872 101.134946) (xy 102.971432 101.059401)
        (xy 102.92417 101.05) (xy 102.15 101.05) (xy 102.15 77.223945) (xy 104.173 77.223945) (xy 104.173 77.716055)
        (xy 104.361322 78.170704) (xy 104.709296 78.518678) (xy 105.163945 78.707) (xy 105.656055 78.707) (xy 105.830779 78.634627)
        (xy 105.681759 78.783647) (xy 105.656055 78.773) (xy 105.163945 78.773) (xy 104.709296 78.961322) (xy 104.361322 79.309296)
        (xy 104.173 79.763945) (xy 104.173 80.256055) (xy 104.361322 80.710704) (xy 104.709296 81.058678) (xy 105.163945 81.247)
        (xy 105.656055 81.247) (xy 105.830779 81.174627) (xy 105.681759 81.323647) (xy 105.656055 81.313) (xy 105.163945 81.313)
        (xy 104.709296 81.501322) (xy 104.361322 81.849296) (xy 104.173 82.303945) (xy 104.173 82.796055) (xy 104.361322 83.250704)
        (xy 104.709296 83.598678) (xy 105.163945 83.787) (xy 105.656055 83.787) (xy 105.830779 83.714627) (xy 105.681759 83.863647)
        (xy 105.656055 83.853) (xy 105.163945 83.853) (xy 104.709296 84.041322) (xy 104.361322 84.389296) (xy 104.173 84.843945)
        (xy 104.173 85.336055) (xy 104.361322 85.790704) (xy 104.709296 86.138678) (xy 105.163945 86.327) (xy 105.656055 86.327)
        (xy 105.830779 86.254627) (xy 105.681759 86.403647) (xy 105.656055 86.393) (xy 105.163945 86.393) (xy 104.709296 86.581322)
        (xy 104.361322 86.929296) (xy 104.173 87.383945) (xy 104.173 87.876055) (xy 104.361322 88.330704) (xy 104.709296 88.678678)
        (xy 105.163945 88.867) (xy 105.656055 88.867) (xy 105.830779 88.794627) (xy 105.681759 88.943647) (xy 105.656055 88.933)
        (xy 105.163945 88.933) (xy 104.709296 89.121322) (xy 104.361322 89.469296) (xy 104.173 89.923945) (xy 104.173 90.416055)
        (xy 104.361322 90.870704) (xy 104.709296 91.218678) (xy 105.163945 91.407) (xy 105.656055 91.407) (xy 105.83078 91.334626)
        (xy 105.68176 91.483647) (xy 105.656055 91.473) (xy 105.163945 91.473) (xy 104.709296 91.661322) (xy 104.361322 92.009296)
        (xy 104.173 92.463945) (xy 104.173 92.956055) (xy 104.361322 93.410704) (xy 104.709296 93.758678) (xy 105.163945 93.947)
        (xy 105.656055 93.947) (xy 106.110704 93.758678) (xy 106.458678 93.410704) (xy 106.647 92.956055) (xy 106.647 92.463945)
        (xy 106.636353 92.43824) (xy 108.483594 90.591) (xy 125.196407 90.591) (xy 126.475692 91.870286) (xy 126.513352 91.926648)
        (xy 126.736628 92.075836) (xy 126.933519 92.115) (xy 126.933523 92.115) (xy 126.996487 92.127524) (xy 126.862555 92.504768)
        (xy 126.891151 93.058996) (xy 127.048229 93.438216) (xy 127.28961 93.507957) (xy 128.087566 92.71) (xy 128.073424 92.695858)
        (xy 128.255858 92.513424) (xy 128.27 92.527566) (xy 128.284142 92.513424) (xy 128.466576 92.695858) (xy 128.452434 92.71)
        (xy 129.25039 93.507957) (xy 129.491771 93.438216) (xy 129.677445 92.915232) (xy 129.648849 92.361004) (xy 129.546951 92.115)
        (xy 136.880407 92.115) (xy 137.203647 92.438241) (xy 137.193 92.463945) (xy 137.193 92.956055) (xy 137.381322 93.410704)
        (xy 137.729296 93.758678) (xy 138.183945 93.947) (xy 138.676055 93.947) (xy 139.130704 93.758678) (xy 139.478678 93.410704)
        (xy 139.667 92.956055) (xy 139.667 92.463945) (xy 139.656353 92.438241) (xy 139.979595 92.115) (xy 160.020934 92.115)
        (xy 159.882555 92.504768) (xy 159.911151 93.058996) (xy 160.068229 93.438216) (xy 160.30961 93.507957) (xy 161.107566 92.71)
        (xy 161.093424 92.695858) (xy 161.275858 92.513424) (xy 161.29 92.527566) (xy 161.304142 92.513424) (xy 161.486576 92.695858)
        (xy 161.472434 92.71) (xy 162.27039 93.507957) (xy 162.511771 93.438216) (xy 162.697445 92.915232) (xy 162.668849 92.361004)
        (xy 162.566951 92.115) (xy 169.900407 92.115) (xy 170.223647 92.438241) (xy 170.213 92.463945) (xy 170.213 92.956055)
        (xy 170.401322 93.410704) (xy 170.749296 93.758678) (xy 171.203945 93.947) (xy 171.696055 93.947) (xy 172.150704 93.758678)
        (xy 172.498678 93.410704) (xy 172.687 92.956055) (xy 172.687 92.504768) (xy 192.902555 92.504768) (xy 192.931151 93.058996)
        (xy 193.088229 93.438216) (xy 193.32961 93.507957) (xy 194.127566 92.71) (xy 194.492434 92.71) (xy 195.29039 93.507957)
        (xy 195.531771 93.438216) (xy 195.717445 92.915232) (xy 195.688849 92.361004) (xy 195.531771 91.981784) (xy 195.29039 91.912043)
        (xy 194.492434 92.71) (xy 194.127566 92.71) (xy 193.32961 91.912043) (xy 193.088229 91.981784) (xy 192.902555 92.504768)
        (xy 172.687 92.504768) (xy 172.687 92.463945) (xy 172.498678 92.009296) (xy 172.150704 91.661322) (xy 171.696055 91.473)
        (xy 171.203945 91.473) (xy 171.178241 91.483647) (xy 171.02922 91.334626) (xy 171.203945 91.407) (xy 171.696055 91.407)
        (xy 172.150704 91.218678) (xy 172.498678 90.870704) (xy 172.687 90.416055) (xy 172.687 89.923945) (xy 193.073 89.923945)
        (xy 193.073 90.416055) (xy 193.261322 90.870704) (xy 193.609296 91.218678) (xy 193.920917 91.347756) (xy 193.581784 91.488229)
        (xy 193.512043 91.72961) (xy 194.31 92.527566) (xy 195.107957 91.72961) (xy 195.038216 91.488229) (xy 194.67299 91.358564)
        (xy 195.010704 91.218678) (xy 195.358678 90.870704) (xy 195.547 90.416055) (xy 195.547 89.923945) (xy 195.358678 89.469296)
        (xy 195.010704 89.121322) (xy 194.556055 88.933) (xy 194.063945 88.933) (xy 193.609296 89.121322) (xy 193.261322 89.469296)
        (xy 193.073 89.923945) (xy 172.687 89.923945) (xy 172.498678 89.469296) (xy 172.150704 89.121322) (xy 171.696055 88.933)
        (xy 171.203945 88.933) (xy 171.178241 88.943647) (xy 171.02922 88.794626) (xy 171.203945 88.867) (xy 171.696055 88.867)
        (xy 172.150704 88.678678) (xy 172.498678 88.330704) (xy 172.687 87.876055) (xy 172.687 87.383945) (xy 193.073 87.383945)
        (xy 193.073 87.876055) (xy 193.261322 88.330704) (xy 193.609296 88.678678) (xy 194.063945 88.867) (xy 194.556055 88.867)
        (xy 195.010704 88.678678) (xy 195.358678 88.330704) (xy 195.547 87.876055) (xy 195.547 87.383945) (xy 195.358678 86.929296)
        (xy 195.010704 86.581322) (xy 194.556055 86.393) (xy 194.063945 86.393) (xy 193.609296 86.581322) (xy 193.261322 86.929296)
        (xy 193.073 87.383945) (xy 172.687 87.383945) (xy 172.498678 86.929296) (xy 172.150704 86.581322) (xy 171.696055 86.393)
        (xy 171.203945 86.393) (xy 171.178241 86.403647) (xy 171.02922 86.254626) (xy 171.203945 86.327) (xy 171.696055 86.327)
        (xy 172.150704 86.138678) (xy 172.498678 85.790704) (xy 172.687 85.336055) (xy 172.687 84.843945) (xy 193.073 84.843945)
        (xy 193.073 85.336055) (xy 193.261322 85.790704) (xy 193.609296 86.138678) (xy 194.063945 86.327) (xy 194.556055 86.327)
        (xy 195.010704 86.138678) (xy 195.358678 85.790704) (xy 195.547 85.336055) (xy 195.547 84.843945) (xy 195.358678 84.389296)
        (xy 195.010704 84.041322) (xy 194.556055 83.853) (xy 194.063945 83.853) (xy 193.609296 84.041322) (xy 193.261322 84.389296)
        (xy 193.073 84.843945) (xy 172.687 84.843945) (xy 172.498678 84.389296) (xy 172.150704 84.041322) (xy 171.696055 83.853)
        (xy 171.203945 83.853) (xy 171.178241 83.863647) (xy 171.02922 83.714626) (xy 171.203945 83.787) (xy 171.696055 83.787)
        (xy 172.150704 83.598678) (xy 172.498678 83.250704) (xy 172.687 82.796055) (xy 172.687 82.303945) (xy 193.073 82.303945)
        (xy 193.073 82.796055) (xy 193.261322 83.250704) (xy 193.609296 83.598678) (xy 194.063945 83.787) (xy 194.556055 83.787)
        (xy 195.010704 83.598678) (xy 195.358678 83.250704) (xy 195.547 82.796055) (xy 195.547 82.303945) (xy 195.358678 81.849296)
        (xy 195.010704 81.501322) (xy 194.556055 81.313) (xy 194.063945 81.313) (xy 193.609296 81.501322) (xy 193.261322 81.849296)
        (xy 193.073 82.303945) (xy 172.687 82.303945) (xy 172.498678 81.849296) (xy 172.150704 81.501322) (xy 171.696055 81.313)
        (xy 171.203945 81.313) (xy 171.178241 81.323647) (xy 171.02922 81.174626) (xy 171.203945 81.247) (xy 171.696055 81.247)
        (xy 172.150704 81.058678) (xy 172.498678 80.710704) (xy 172.687 80.256055) (xy 172.687 79.763945) (xy 193.073 79.763945)
        (xy 193.073 80.256055) (xy 193.261322 80.710704) (xy 193.609296 81.058678) (xy 194.063945 81.247) (xy 194.556055 81.247)
        (xy 195.010704 81.058678) (xy 195.358678 80.710704) (xy 195.547 80.256055) (xy 195.547 79.763945) (xy 195.358678 79.309296)
        (xy 195.010704 78.961322) (xy 194.556055 78.773) (xy 194.063945 78.773) (xy 193.609296 78.961322) (xy 193.261322 79.309296)
        (xy 193.073 79.763945) (xy 172.687 79.763945) (xy 172.498678 79.309296) (xy 172.150704 78.961322) (xy 171.696055 78.773)
        (xy 171.203945 78.773) (xy 171.178241 78.783647) (xy 171.02922 78.634626) (xy 171.203945 78.707) (xy 171.696055 78.707)
        (xy 172.150704 78.518678) (xy 172.498678 78.170704) (xy 172.687 77.716055) (xy 172.687 77.223945) (xy 172.498678 76.769296)
        (xy 172.437382 76.708) (xy 193.063695 76.708) (xy 193.063695 78.232) (xy 193.100561 78.417335) (xy 193.205545 78.574455)
        (xy 193.362665 78.679439) (xy 193.548 78.716305) (xy 195.072 78.716305) (xy 195.257335 78.679439) (xy 195.414455 78.574455)
        (xy 195.519439 78.417335) (xy 195.556305 78.232) (xy 195.556305 76.708) (xy 195.519439 76.522665) (xy 195.414455 76.365545)
        (xy 195.257335 76.260561) (xy 195.072 76.223695) (xy 193.548 76.223695) (xy 193.362665 76.260561) (xy 193.205545 76.365545)
        (xy 193.100561 76.522665) (xy 193.063695 76.708) (xy 172.437382 76.708) (xy 172.150704 76.421322) (xy 171.696055 76.233)
        (xy 171.203945 76.233) (xy 171.178241 76.243647) (xy 170.704309 75.769716) (xy 170.666648 75.713352) (xy 170.443372 75.564164)
        (xy 170.246481 75.525) (xy 170.18 75.511776) (xy 170.113519 75.525) (xy 139.766479 75.525) (xy 139.699999 75.511776)
        (xy 139.633519 75.525) (xy 139.436628 75.564164) (xy 139.213352 75.713352) (xy 139.175694 75.769711) (xy 138.701759 76.243647)
        (xy 138.676055 76.233) (xy 138.183945 76.233) (xy 138.158241 76.243647) (xy 137.684309 75.769716) (xy 137.646648 75.713352)
        (xy 137.423372 75.564164) (xy 137.226481 75.525) (xy 137.16 75.511776) (xy 137.093519 75.525) (xy 106.746479 75.525)
        (xy 106.679999 75.511776) (xy 106.613519 75.525) (xy 106.416628 75.564164) (xy 106.193352 75.713352) (xy 106.155694 75.769711)
        (xy 105.681759 76.243647) (xy 105.656055 76.233) (xy 105.163945 76.233) (xy 104.709296 76.421322) (xy 104.361322 76.769296)
        (xy 104.173 77.223945) (xy 102.15 77.223945) (xy 102.15 74.277951) (xy 102.3809 74.835393) (xy 102.964607 75.4191)
        (xy 103.727257 75.735) (xy 104.552743 75.735) (xy 105.315393 75.4191) (xy 105.8991 74.835393) (xy 106.215 74.072743)
        (xy 106.215 73.247257) (xy 105.8991 72.484607) (xy 105.315393 71.9009) (xy 104.757951 71.67) (xy 194.962049 71.67)
      )
    )
  )
  (zone (net 7) (net_name /GND) (layer F.Cu) (tstamp 5DC19421) (hatch edge 0.508)
    (connect_pads (clearance 0.35))
    (min_thickness 0.25)
    (fill yes (arc_segments 16) (thermal_gap 0.508) (thermal_bridge_width 0.508))
    (polygon
      (pts
        (xy 101.6 71.12) (xy 198.12 71.12) (xy 198.12 106.68) (xy 101.6 106.68)
      )
    )
    (filled_polygon
      (pts
        (xy 194.404607 71.9009) (xy 193.8209 72.484607) (xy 193.505 73.247257) (xy 193.505 74.072743) (xy 193.8209 74.835393)
        (xy 194.404607 75.4191) (xy 195.167257 75.735) (xy 195.992743 75.735) (xy 196.755393 75.4191) (xy 197.3391 74.835393)
        (xy 197.570001 74.277949) (xy 197.57 103.522049) (xy 197.3391 102.964607) (xy 196.755393 102.3809) (xy 195.992743 102.065)
        (xy 195.167257 102.065) (xy 194.404607 102.3809) (xy 193.8209 102.964607) (xy 193.505 103.727257) (xy 193.505 104.552743)
        (xy 193.8209 105.315393) (xy 194.404607 105.8991) (xy 194.962049 106.13) (xy 109.837951 106.13) (xy 110.395393 105.8991)
        (xy 110.9791 105.315393) (xy 111.295 104.552743) (xy 111.295 103.727257) (xy 110.9791 102.964607) (xy 110.395393 102.3809)
        (xy 109.632743 102.065) (xy 108.807257 102.065) (xy 108.044607 102.3809) (xy 107.4609 102.964607) (xy 107.145 103.727257)
        (xy 107.145 104.552743) (xy 107.4609 105.315393) (xy 108.044607 105.8991) (xy 108.602049 106.13) (xy 104.69 106.13)
        (xy 104.69 102.81583) (xy 104.68529 102.792151) (xy 104.668613 102.601532) (xy 104.650016 102.532125) (xy 104.637537 102.461356)
        (xy 104.486683 102.046889) (xy 104.486683 102.046888) (xy 104.391176 101.881467) (xy 104.107664 101.543591) (xy 103.96134 101.42081)
        (xy 103.961338 101.420809) (xy 103.579367 101.200277) (xy 103.579366 101.200276) (xy 103.495389 101.169711) (xy 103.399874 101.134946)
        (xy 103.399872 101.134946) (xy 102.971432 101.059401) (xy 102.92417 101.05) (xy 102.15 101.05) (xy 102.15 100.083945)
        (xy 104.173 100.083945) (xy 104.173 100.576055) (xy 104.361322 101.030704) (xy 104.709296 101.378678) (xy 105.163945 101.567)
        (xy 105.656055 101.567) (xy 106.110704 101.378678) (xy 106.458678 101.030704) (xy 106.647 100.576055) (xy 106.647 100.083945)
        (xy 106.458678 99.629296) (xy 106.110704 99.281322) (xy 105.656055 99.093) (xy 105.163945 99.093) (xy 104.709296 99.281322)
        (xy 104.361322 99.629296) (xy 104.173 100.083945) (xy 102.15 100.083945) (xy 102.15 97.543945) (xy 104.173 97.543945)
        (xy 104.173 98.036055) (xy 104.361322 98.490704) (xy 104.709296 98.838678) (xy 105.163945 99.027) (xy 105.656055 99.027)
        (xy 106.110704 98.838678) (xy 106.458678 98.490704) (xy 106.647 98.036055) (xy 106.647 97.543945) (xy 106.458678 97.089296)
        (xy 106.110704 96.741322) (xy 105.656055 96.553) (xy 105.163945 96.553) (xy 104.709296 96.741322) (xy 104.361322 97.089296)
        (xy 104.173 97.543945) (xy 102.15 97.543945) (xy 102.15 95.003945) (xy 104.173 95.003945) (xy 104.173 95.496055)
        (xy 104.361322 95.950704) (xy 104.709296 96.298678) (xy 105.163945 96.487) (xy 105.656055 96.487) (xy 106.110704 96.298678)
        (xy 106.458678 95.950704) (xy 106.647 95.496055) (xy 106.647 95.003945) (xy 127.033 95.003945) (xy 127.033 95.496055)
        (xy 127.221322 95.950704) (xy 127.569296 96.298678) (xy 128.023945 96.487) (xy 128.516055 96.487) (xy 128.970704 96.298678)
        (xy 129.044382 96.225) (xy 129.335248 96.225) (xy 130.474124 97.363876) (xy 130.628225 97.466843) (xy 130.81 97.503)
        (xy 137.20996 97.503) (xy 137.193 97.543945) (xy 137.193 98.036055) (xy 137.337538 98.385) (xy 129.819595 98.385)
        (xy 129.496353 98.061759) (xy 129.507 98.036055) (xy 129.507 97.543945) (xy 129.318678 97.089296) (xy 128.970704 96.741322)
        (xy 128.516055 96.553) (xy 128.023945 96.553) (xy 127.569296 96.741322) (xy 127.221322 97.089296) (xy 127.033 97.543945)
        (xy 127.033 98.036055) (xy 127.221322 98.490704) (xy 127.569296 98.838678) (xy 128.023945 99.027) (xy 128.516055 99.027)
        (xy 128.541759 99.016353) (xy 128.690779 99.165373) (xy 128.516055 99.093) (xy 128.023945 99.093) (xy 127.569296 99.281322)
        (xy 127.221322 99.629296) (xy 127.033 100.083945) (xy 127.033 100.576055) (xy 127.221322 101.030704) (xy 127.569296 101.378678)
        (xy 128.023945 101.567) (xy 128.516055 101.567) (xy 128.541759 101.556353) (xy 129.015694 102.030289) (xy 129.053352 102.086648)
        (xy 129.276628 102.235836) (xy 129.473519 102.275) (xy 129.539999 102.288224) (xy 129.606479 102.275) (xy 159.953519 102.275)
        (xy 160.02 102.288224) (xy 160.086481 102.275) (xy 160.283372 102.235836) (xy 160.506648 102.086648) (xy 160.544309 102.030284)
        (xy 161.018241 101.556353) (xy 161.043945 101.567) (xy 161.536055 101.567) (xy 161.561759 101.556353) (xy 162.035694 102.030289)
        (xy 162.073352 102.086648) (xy 162.296628 102.235836) (xy 162.493519 102.275) (xy 162.559999 102.288224) (xy 162.626479 102.275)
        (xy 192.973519 102.275) (xy 193.04 102.288224) (xy 193.106481 102.275) (xy 193.303372 102.235836) (xy 193.526648 102.086648)
        (xy 193.564309 102.030284) (xy 194.038241 101.556353) (xy 194.063945 101.567) (xy 194.556055 101.567) (xy 195.010704 101.378678)
        (xy 195.358678 101.030704) (xy 195.547 100.576055) (xy 195.547 100.083945) (xy 195.358678 99.629296) (xy 195.010704 99.281322)
        (xy 194.556055 99.093) (xy 194.063945 99.093) (xy 193.88922 99.165374) (xy 194.038241 99.016353) (xy 194.063945 99.027)
        (xy 194.556055 99.027) (xy 195.010704 98.838678) (xy 195.358678 98.490704) (xy 195.547 98.036055) (xy 195.547 97.543945)
        (xy 195.358678 97.089296) (xy 195.010704 96.741322) (xy 194.556055 96.553) (xy 194.063945 96.553) (xy 193.609296 96.741322)
        (xy 193.261322 97.089296) (xy 193.073 97.543945) (xy 193.073 98.036055) (xy 193.083647 98.061759) (xy 192.760407 98.385)
        (xy 172.542462 98.385) (xy 172.687 98.036055) (xy 172.687 97.543945) (xy 172.67004 97.503) (xy 191.77 97.503)
        (xy 191.951775 97.466843) (xy 192.105876 97.363876) (xy 193.244752 96.225) (xy 193.535618 96.225) (xy 193.609296 96.298678)
        (xy 194.063945 96.487) (xy 194.556055 96.487) (xy 195.010704 96.298678) (xy 195.358678 95.950704) (xy 195.547 95.496055)
        (xy 195.547 95.003945) (xy 195.358678 94.549296) (xy 195.010704 94.201322) (xy 194.699083 94.072244) (xy 195.038216 93.931771)
        (xy 195.107957 93.69039) (xy 194.31 92.892434) (xy 193.512043 93.69039) (xy 193.581784 93.931771) (xy 193.94701 94.061436)
        (xy 193.609296 94.201322) (xy 193.535618 94.275) (xy 193.244752 94.275) (xy 192.105876 93.136124) (xy 191.951775 93.033157)
        (xy 191.77 92.997) (xy 173.99 92.997) (xy 173.808225 93.033157) (xy 173.654124 93.136124) (xy 172.369815 94.420433)
        (xy 172.150704 94.201322) (xy 171.696055 94.013) (xy 171.203945 94.013) (xy 170.749296 94.201322) (xy 170.530185 94.420433)
        (xy 169.245876 93.136124) (xy 169.091775 93.033157) (xy 168.91 92.997) (xy 163.83 92.997) (xy 163.648225 93.033157)
        (xy 163.494124 93.136124) (xy 162.363248 94.267) (xy 162.056382 94.267) (xy 161.990704 94.201322) (xy 161.679083 94.072244)
        (xy 162.018216 93.931771) (xy 162.087957 93.69039) (xy 161.29 92.892434) (xy 160.492043 93.69039) (xy 160.561784 93.931771)
        (xy 160.92701 94.061436) (xy 160.589296 94.201322) (xy 160.523618 94.267) (xy 160.216752 94.267) (xy 159.085876 93.136124)
        (xy 158.931775 93.033157) (xy 158.75 92.997) (xy 140.97 92.997) (xy 140.788225 93.033157) (xy 140.634124 93.136124)
        (xy 139.349815 94.420433) (xy 139.130704 94.201322) (xy 138.676055 94.013) (xy 138.183945 94.013) (xy 137.729296 94.201322)
        (xy 137.510185 94.420433) (xy 136.225876 93.136124) (xy 136.071775 93.033157) (xy 135.89 92.997) (xy 130.81 92.997)
        (xy 130.628225 93.033157) (xy 130.474124 93.136124) (xy 129.335248 94.275) (xy 129.044382 94.275) (xy 128.970704 94.201322)
        (xy 128.659083 94.072244) (xy 128.998216 93.931771) (xy 129.067957 93.69039) (xy 128.27 92.892434) (xy 127.472043 93.69039)
        (xy 127.541784 93.931771) (xy 127.90701 94.061436) (xy 127.569296 94.201322) (xy 127.221322 94.549296) (xy 127.033 95.003945)
        (xy 106.647 95.003945) (xy 106.458678 94.549296) (xy 106.110704 94.201322) (xy 105.656055 94.013) (xy 105.163945 94.013)
        (xy 104.709296 94.201322) (xy 104.361322 94.549296) (xy 104.173 95.003945) (xy 102.15 95.003945) (xy 102.15 92.463945)
        (xy 104.173 92.463945) (xy 104.173 92.956055) (xy 104.361322 93.410704) (xy 104.709296 93.758678) (xy 105.163945 93.947)
        (xy 105.656055 93.947) (xy 106.110704 93.758678) (xy 106.458678 93.410704) (xy 106.647 92.956055) (xy 106.647 92.504768)
        (xy 126.862555 92.504768) (xy 126.891151 93.058996) (xy 127.048229 93.438216) (xy 127.28961 93.507957) (xy 128.087566 92.71)
        (xy 128.452434 92.71) (xy 129.25039 93.507957) (xy 129.491771 93.438216) (xy 129.677445 92.915232) (xy 129.654161 92.463945)
        (xy 137.193 92.463945) (xy 137.193 92.956055) (xy 137.381322 93.410704) (xy 137.729296 93.758678) (xy 138.183945 93.947)
        (xy 138.676055 93.947) (xy 139.130704 93.758678) (xy 139.478678 93.410704) (xy 139.667 92.956055) (xy 139.667 92.504768)
        (xy 159.882555 92.504768) (xy 159.911151 93.058996) (xy 160.068229 93.438216) (xy 160.30961 93.507957) (xy 161.107566 92.71)
        (xy 161.472434 92.71) (xy 162.27039 93.507957) (xy 162.511771 93.438216) (xy 162.697445 92.915232) (xy 162.674161 92.463945)
        (xy 170.213 92.463945) (xy 170.213 92.956055) (xy 170.401322 93.410704) (xy 170.749296 93.758678) (xy 171.203945 93.947)
        (xy 171.696055 93.947) (xy 172.150704 93.758678) (xy 172.498678 93.410704) (xy 172.687 92.956055) (xy 172.687 92.504768)
        (xy 192.902555 92.504768) (xy 192.931151 93.058996) (xy 193.088229 93.438216) (xy 193.32961 93.507957) (xy 194.127566 92.71)
        (xy 194.492434 92.71) (xy 195.29039 93.507957) (xy 195.531771 93.438216) (xy 195.717445 92.915232) (xy 195.688849 92.361004)
        (xy 195.531771 91.981784) (xy 195.29039 91.912043) (xy 194.492434 92.71) (xy 194.127566 92.71) (xy 193.32961 91.912043)
        (xy 193.088229 91.981784) (xy 192.902555 92.504768) (xy 172.687 92.504768) (xy 172.687 92.463945) (xy 172.498678 92.009296)
        (xy 172.150704 91.661322) (xy 171.696055 91.473) (xy 171.203945 91.473) (xy 170.749296 91.661322) (xy 170.401322 92.009296)
        (xy 170.213 92.463945) (xy 162.674161 92.463945) (xy 162.668849 92.361004) (xy 162.511771 91.981784) (xy 162.27039 91.912043)
        (xy 161.472434 92.71) (xy 161.107566 92.71) (xy 160.30961 91.912043) (xy 160.068229 91.981784) (xy 159.882555 92.504768)
        (xy 139.667 92.504768) (xy 139.667 92.463945) (xy 139.478678 92.009296) (xy 139.130704 91.661322) (xy 138.676055 91.473)
        (xy 138.183945 91.473) (xy 137.729296 91.661322) (xy 137.381322 92.009296) (xy 137.193 92.463945) (xy 129.654161 92.463945)
        (xy 129.648849 92.361004) (xy 129.491771 91.981784) (xy 129.25039 91.912043) (xy 128.452434 92.71) (xy 128.087566 92.71)
        (xy 127.28961 91.912043) (xy 127.048229 91.981784) (xy 126.862555 92.504768) (xy 106.647 92.504768) (xy 106.647 92.463945)
        (xy 106.458678 92.009296) (xy 106.110704 91.661322) (xy 105.656055 91.473) (xy 105.163945 91.473) (xy 104.709296 91.661322)
        (xy 104.361322 92.009296) (xy 104.173 92.463945) (xy 102.15 92.463945) (xy 102.15 89.923945) (xy 104.173 89.923945)
        (xy 104.173 90.416055) (xy 104.361322 90.870704) (xy 104.709296 91.218678) (xy 105.163945 91.407) (xy 105.656055 91.407)
        (xy 106.110704 91.218678) (xy 106.458678 90.870704) (xy 106.647 90.416055) (xy 106.647 89.923945) (xy 106.458678 89.469296)
        (xy 106.110704 89.121322) (xy 105.656055 88.933) (xy 105.163945 88.933) (xy 104.709296 89.121322) (xy 104.361322 89.469296)
        (xy 104.173 89.923945) (xy 102.15 89.923945) (xy 102.15 87.383945) (xy 104.173 87.383945) (xy 104.173 87.876055)
        (xy 104.361322 88.330704) (xy 104.709296 88.678678) (xy 105.163945 88.867) (xy 105.656055 88.867) (xy 106.110704 88.678678)
        (xy 106.458678 88.330704) (xy 106.647 87.876055) (xy 106.647 87.383945) (xy 106.458678 86.929296) (xy 106.110704 86.581322)
        (xy 105.656055 86.393) (xy 105.163945 86.393) (xy 104.709296 86.581322) (xy 104.361322 86.929296) (xy 104.173 87.383945)
        (xy 102.15 87.383945) (xy 102.15 84.843945) (xy 104.173 84.843945) (xy 104.173 85.336055) (xy 104.361322 85.790704)
        (xy 104.709296 86.138678) (xy 105.163945 86.327) (xy 105.656055 86.327) (xy 106.110704 86.138678) (xy 106.458678 85.790704)
        (xy 106.647 85.336055) (xy 106.647 84.843945) (xy 106.458678 84.389296) (xy 106.110704 84.041322) (xy 105.656055 83.853)
        (xy 105.163945 83.853) (xy 104.709296 84.041322) (xy 104.361322 84.389296) (xy 104.173 84.843945) (xy 102.15 84.843945)
        (xy 102.15 82.303945) (xy 104.173 82.303945) (xy 104.173 82.796055) (xy 104.361322 83.250704) (xy 104.709296 83.598678)
        (xy 105.163945 83.787) (xy 105.656055 83.787) (xy 106.110704 83.598678) (xy 106.458678 83.250704) (xy 106.647 82.796055)
        (xy 106.647 82.303945) (xy 106.458678 81.849296) (xy 106.110704 81.501322) (xy 105.656055 81.313) (xy 105.163945 81.313)
        (xy 104.709296 81.501322) (xy 104.361322 81.849296) (xy 104.173 82.303945) (xy 102.15 82.303945) (xy 102.15 79.763945)
        (xy 104.173 79.763945) (xy 104.173 80.256055) (xy 104.361322 80.710704) (xy 104.709296 81.058678) (xy 105.163945 81.247)
        (xy 105.656055 81.247) (xy 106.110704 81.058678) (xy 106.458678 80.710704) (xy 106.647 80.256055) (xy 106.647 79.763945)
        (xy 106.458678 79.309296) (xy 106.110704 78.961322) (xy 105.656055 78.773) (xy 105.163945 78.773) (xy 104.709296 78.961322)
        (xy 104.361322 79.309296) (xy 104.173 79.763945) (xy 102.15 79.763945) (xy 102.15 77.223945) (xy 104.173 77.223945)
        (xy 104.173 77.716055) (xy 104.361322 78.170704) (xy 104.709296 78.518678) (xy 105.163945 78.707) (xy 105.656055 78.707)
        (xy 106.110704 78.518678) (xy 106.458678 78.170704) (xy 106.647 77.716055) (xy 106.647 77.223945) (xy 106.458678 76.769296)
        (xy 106.397382 76.708) (xy 127.023695 76.708) (xy 127.023695 78.232) (xy 127.060561 78.417335) (xy 127.165545 78.574455)
        (xy 127.322665 78.679439) (xy 127.508 78.716305) (xy 128.609101 78.716305) (xy 128.541759 78.783647) (xy 128.516055 78.773)
        (xy 128.023945 78.773) (xy 127.569296 78.961322) (xy 127.221322 79.309296) (xy 127.033 79.763945) (xy 127.033 80.256055)
        (xy 127.221322 80.710704) (xy 127.569296 81.058678) (xy 128.023945 81.247) (xy 128.516055 81.247) (xy 128.690779 81.174627)
        (xy 128.541759 81.323647) (xy 128.516055 81.313) (xy 128.023945 81.313) (xy 127.569296 81.501322) (xy 127.221322 81.849296)
        (xy 127.033 82.303945) (xy 127.033 82.796055) (xy 127.221322 83.250704) (xy 127.569296 83.598678) (xy 128.023945 83.787)
        (xy 128.516055 83.787) (xy 128.690779 83.714627) (xy 128.541759 83.863647) (xy 128.516055 83.853) (xy 128.023945 83.853)
        (xy 127.569296 84.041322) (xy 127.221322 84.389296) (xy 127.033 84.843945) (xy 127.033 85.336055) (xy 127.221322 85.790704)
        (xy 127.569296 86.138678) (xy 128.023945 86.327) (xy 128.516055 86.327) (xy 128.69078 86.254626) (xy 128.601715 86.343692)
        (xy 128.60171 86.343695) (xy 128.541758 86.403647) (xy 128.516055 86.393) (xy 128.023945 86.393) (xy 127.569296 86.581322)
        (xy 127.221322 86.929296) (xy 127.033 87.383945) (xy 127.033 87.876055) (xy 127.221322 88.330704) (xy 127.569296 88.678678)
        (xy 128.023945 88.867) (xy 128.516055 88.867) (xy 128.690779 88.794627) (xy 128.541759 88.943647) (xy 128.516055 88.933)
        (xy 128.023945 88.933) (xy 127.569296 89.121322) (xy 127.221322 89.469296) (xy 127.033 89.923945) (xy 127.033 90.416055)
        (xy 127.221322 90.870704) (xy 127.569296 91.218678) (xy 127.880917 91.347756) (xy 127.541784 91.488229) (xy 127.472043 91.72961)
        (xy 128.27 92.527566) (xy 129.067957 91.72961) (xy 128.998216 91.488229) (xy 128.63299 91.358564) (xy 128.970704 91.218678)
        (xy 129.318678 90.870704) (xy 129.507 90.416055) (xy 129.507 89.923945) (xy 129.496353 89.898241) (xy 129.819595 89.575)
        (xy 137.337538 89.575) (xy 137.193 89.923945) (xy 137.193 90.416055) (xy 137.381322 90.870704) (xy 137.729296 91.218678)
        (xy 138.183945 91.407) (xy 138.676055 91.407) (xy 139.130704 91.218678) (xy 139.478678 90.870704) (xy 139.667 90.416055)
        (xy 139.667 89.923945) (xy 139.522462 89.575) (xy 159.740407 89.575) (xy 160.063647 89.898241) (xy 160.053 89.923945)
        (xy 160.053 90.416055) (xy 160.241322 90.870704) (xy 160.589296 91.218678) (xy 160.900917 91.347756) (xy 160.561784 91.488229)
        (xy 160.492043 91.72961) (xy 161.29 92.527566) (xy 162.087957 91.72961) (xy 162.018216 91.488229) (xy 161.65299 91.358564)
        (xy 161.990704 91.218678) (xy 162.338678 90.870704) (xy 162.527 90.416055) (xy 162.527 89.923945) (xy 162.516353 89.898241)
        (xy 162.839595 89.575) (xy 170.357538 89.575) (xy 170.213 89.923945) (xy 170.213 90.416055) (xy 170.401322 90.870704)
        (xy 170.749296 91.218678) (xy 171.203945 91.407) (xy 171.696055 91.407) (xy 172.150704 91.218678) (xy 172.498678 90.870704)
        (xy 172.687 90.416055) (xy 172.687 89.923945) (xy 172.542462 89.575) (xy 192.760407 89.575) (xy 193.083647 89.898241)
        (xy 193.073 89.923945) (xy 193.073 90.416055) (xy 193.261322 90.870704) (xy 193.609296 91.218678) (xy 193.920917 91.347756)
        (xy 193.581784 91.488229) (xy 193.512043 91.72961) (xy 194.31 92.527566) (xy 195.107957 91.72961) (xy 195.038216 91.488229)
        (xy 194.67299 91.358564) (xy 195.010704 91.218678) (xy 195.358678 90.870704) (xy 195.547 90.416055) (xy 195.547 89.923945)
        (xy 195.358678 89.469296) (xy 195.010704 89.121322) (xy 194.556055 88.933) (xy 194.063945 88.933) (xy 194.038241 88.943647)
        (xy 193.88922 88.794626) (xy 194.063945 88.867) (xy 194.556055 88.867) (xy 195.010704 88.678678) (xy 195.358678 88.330704)
        (xy 195.547 87.876055) (xy 195.547 87.383945) (xy 195.358678 86.929296) (xy 195.010704 86.581322) (xy 194.556055 86.393)
        (xy 194.063945 86.393) (xy 194.038241 86.403647) (xy 193.88922 86.254626) (xy 194.063945 86.327) (xy 194.556055 86.327)
        (xy 195.010704 86.138678) (xy 195.358678 85.790704) (xy 195.547 85.336055) (xy 195.547 84.843945) (xy 195.358678 84.389296)
        (xy 195.010704 84.041322) (xy 194.556055 83.853) (xy 194.063945 83.853) (xy 194.038241 83.863647) (xy 193.88922 83.714626)
        (xy 194.063945 83.787) (xy 194.556055 83.787) (xy 195.010704 83.598678) (xy 195.358678 83.250704) (xy 195.547 82.796055)
        (xy 195.547 82.303945) (xy 195.358678 81.849296) (xy 195.010704 81.501322) (xy 194.556055 81.313) (xy 194.063945 81.313)
        (xy 194.038241 81.323647) (xy 193.88922 81.174626) (xy 194.063945 81.247) (xy 194.556055 81.247) (xy 195.010704 81.058678)
        (xy 195.358678 80.710704) (xy 195.547 80.256055) (xy 195.547 79.763945) (xy 195.358678 79.309296) (xy 195.010704 78.961322)
        (xy 194.556055 78.773) (xy 194.063945 78.773) (xy 194.038241 78.783647) (xy 193.970899 78.716305) (xy 195.072 78.716305)
        (xy 195.257335 78.679439) (xy 195.414455 78.574455) (xy 195.519439 78.417335) (xy 195.556305 78.232) (xy 195.556305 76.708)
        (xy 195.519439 76.522665) (xy 195.414455 76.365545) (xy 195.257335 76.260561) (xy 195.072 76.223695) (xy 193.548 76.223695)
        (xy 193.362665 76.260561) (xy 193.205545 76.365545) (xy 193.100561 76.522665) (xy 193.091718 76.567123) (xy 192.294309 75.769716)
        (xy 192.256648 75.713352) (xy 192.033372 75.564164) (xy 191.836481 75.525) (xy 191.77 75.511776) (xy 191.703519 75.525)
        (xy 164.150479 75.525) (xy 164.083999 75.511776) (xy 164.017519 75.525) (xy 163.820628 75.564164) (xy 163.597352 75.713352)
        (xy 163.559694 75.769711) (xy 162.536305 76.793102) (xy 162.536305 76.708) (xy 162.499439 76.522665) (xy 162.394455 76.365545)
        (xy 162.237335 76.260561) (xy 162.052 76.223695) (xy 160.528 76.223695) (xy 160.342665 76.260561) (xy 160.185545 76.365545)
        (xy 160.080561 76.522665) (xy 160.043695 76.708) (xy 160.043695 76.7931) (xy 159.020309 75.769716) (xy 158.982648 75.713352)
        (xy 158.759372 75.564164) (xy 158.562481 75.525) (xy 158.496 75.511776) (xy 158.429519 75.525) (xy 131.892479 75.525)
        (xy 131.825999 75.511776) (xy 131.759519 75.525) (xy 131.562628 75.564164) (xy 131.339352 75.713352) (xy 131.301694 75.769711)
        (xy 130.276407 76.795) (xy 129.516305 76.795) (xy 129.516305 76.708) (xy 129.479439 76.522665) (xy 129.374455 76.365545)
        (xy 129.217335 76.260561) (xy 129.032 76.223695) (xy 127.508 76.223695) (xy 127.322665 76.260561) (xy 127.165545 76.365545)
        (xy 127.060561 76.522665) (xy 127.023695 76.708) (xy 106.397382 76.708) (xy 106.110704 76.421322) (xy 105.656055 76.233)
        (xy 105.163945 76.233) (xy 104.709296 76.421322) (xy 104.361322 76.769296) (xy 104.173 77.223945) (xy 102.15 77.223945)
        (xy 102.15 74.277951) (xy 102.3809 74.835393) (xy 102.964607 75.4191) (xy 103.727257 75.735) (xy 104.552743 75.735)
        (xy 105.315393 75.4191) (xy 105.8991 74.835393) (xy 106.215 74.072743) (xy 106.215 73.247257) (xy 105.8991 72.484607)
        (xy 105.315393 71.9009) (xy 104.757951 71.67) (xy 194.962049 71.67)
      )
    )
  )
  (zone (net 8) (net_name /5V) (layer F.Cu) (tstamp 5DC1941B) (hatch edge 0.508)
    (priority 1)
    (connect_pads (clearance 0.35))
    (min_thickness 0.25)
    (fill yes (arc_segments 16) (thermal_gap 0.508) (thermal_bridge_width 0.508))
    (polygon
      (pts
        (xy 129.54 94.742) (xy 130.81 93.472) (xy 135.89 93.472) (xy 137.668 95.25) (xy 139.192 95.25)
        (xy 140.97 93.472) (xy 158.75 93.472) (xy 160.02 94.742) (xy 162.56 94.742) (xy 163.83 93.472)
        (xy 168.91 93.472) (xy 170.688 95.25) (xy 172.212 95.25) (xy 173.99 93.472) (xy 191.77 93.472)
        (xy 193.04 94.742) (xy 193.04 95.758) (xy 191.77 97.028) (xy 163.83 97.028) (xy 162.56 95.758)
        (xy 160.02 95.758) (xy 158.75 97.028) (xy 130.81 97.028) (xy 129.54 95.758)
      )
    )
    (filled_polygon
      (pts
        (xy 170.22828 94.967056) (xy 170.213 95.003945) (xy 170.213 95.496055) (xy 170.401322 95.950704) (xy 170.749296 96.298678)
        (xy 171.203945 96.487) (xy 171.696055 96.487) (xy 172.150704 96.298678) (xy 172.498678 95.950704) (xy 172.687 95.496055)
        (xy 172.687 95.003945) (xy 172.67172 94.967056) (xy 174.041776 93.597) (xy 191.718224 93.597) (xy 192.915 94.793776)
        (xy 192.915 95.009714) (xy 192.902555 95.044768) (xy 192.915 95.285968) (xy 192.915 95.706224) (xy 191.718224 96.903)
        (xy 172.312382 96.903) (xy 172.150704 96.741322) (xy 171.696055 96.553) (xy 171.203945 96.553) (xy 170.749296 96.741322)
        (xy 170.587618 96.903) (xy 163.881776 96.903) (xy 162.648388 95.669612) (xy 162.626521 95.655001) (xy 162.697445 95.455232)
        (xy 162.668849 94.901004) (xy 162.641504 94.834988) (xy 162.648388 94.830388) (xy 163.881776 93.597) (xy 168.858224 93.597)
      )
    )
    (filled_polygon
      (pts
        (xy 137.20828 94.967056) (xy 137.193 95.003945) (xy 137.193 95.496055) (xy 137.381322 95.950704) (xy 137.729296 96.298678)
        (xy 138.183945 96.487) (xy 138.676055 96.487) (xy 139.130704 96.298678) (xy 139.478678 95.950704) (xy 139.667 95.496055)
        (xy 139.667 95.003945) (xy 139.65172 94.967056) (xy 141.021776 93.597) (xy 158.698224 93.597) (xy 159.931612 94.830388)
        (xy 159.953479 94.844999) (xy 159.882555 95.044768) (xy 159.911151 95.598996) (xy 159.938496 95.665012) (xy 159.931612 95.669612)
        (xy 158.698224 96.903) (xy 139.292382 96.903) (xy 139.130704 96.741322) (xy 138.676055 96.553) (xy 138.183945 96.553)
        (xy 137.729296 96.741322) (xy 137.567618 96.903) (xy 130.861776 96.903) (xy 129.665 95.706224) (xy 129.665 95.490286)
        (xy 129.677445 95.455232) (xy 129.665 95.214032) (xy 129.665 94.793776) (xy 130.861776 93.597) (xy 135.838224 93.597)
      )
    )
    (filled_polygon
      (pts
        (xy 161.486576 95.235858) (xy 161.472434 95.25) (xy 161.486576 95.264142) (xy 161.304142 95.446576) (xy 161.29 95.432434)
        (xy 161.275858 95.446576) (xy 161.093424 95.264142) (xy 161.107566 95.25) (xy 161.093424 95.235858) (xy 161.275858 95.053424)
        (xy 161.29 95.067566) (xy 161.304142 95.053424)
      )
    )
  )
  (zone (net 13) (net_name /3V3) (layer B.Cu) (tstamp 0) (hatch edge 0.508)
    (priority 1)
    (connect_pads (clearance 0.35))
    (min_thickness 0.25)
    (fill yes (arc_segments 16) (thermal_gap 0.508) (thermal_bridge_width 0.508))
    (polygon
      (pts
        (xy 170.18 94.742) (xy 168.91 93.472) (xy 163.83 93.472) (xy 162.052 95.25) (xy 160.528 95.25)
        (xy 158.75 93.472) (xy 140.97 93.472) (xy 139.192 95.25) (xy 137.668 95.25) (xy 135.89 93.472)
        (xy 130.81 93.472) (xy 129.032 95.25) (xy 127.508 95.25) (xy 125.73 93.472) (xy 108.204 93.472)
        (xy 107.95 93.472) (xy 106.68 94.742) (xy 106.68 95.758) (xy 107.95 97.028) (xy 168.91 97.028)
        (xy 170.18 95.758)
      )
    )
    (filled_polygon
      (pts
        (xy 127.04828 94.967056) (xy 127.033 95.003945) (xy 127.033 95.496055) (xy 127.221322 95.950704) (xy 127.569296 96.298678)
        (xy 128.023945 96.487) (xy 128.516055 96.487) (xy 128.970704 96.298678) (xy 129.318678 95.950704) (xy 129.507 95.496055)
        (xy 129.507 95.003945) (xy 129.49172 94.967056) (xy 130.861776 93.597) (xy 135.838224 93.597) (xy 137.091578 94.850354)
        (xy 137.022555 95.044768) (xy 137.051151 95.598996) (xy 137.208229 95.978216) (xy 137.44961 96.047957) (xy 138.122566 95.375)
        (xy 138.737434 95.375) (xy 139.41039 96.047957) (xy 139.651771 95.978216) (xy 139.837445 95.455232) (xy 139.808849 94.901004)
        (xy 139.782173 94.836603) (xy 141.021776 93.597) (xy 158.698224 93.597) (xy 160.06828 94.967056) (xy 160.053 95.003945)
        (xy 160.053 95.496055) (xy 160.241322 95.950704) (xy 160.589296 96.298678) (xy 161.043945 96.487) (xy 161.536055 96.487)
        (xy 161.990704 96.298678) (xy 162.338678 95.950704) (xy 162.527 95.496055) (xy 162.527 95.003945) (xy 162.51172 94.967056)
        (xy 163.881776 93.597) (xy 168.858224 93.597) (xy 170.055 94.793776) (xy 170.055 95.009714) (xy 170.042555 95.044768)
        (xy 170.055 95.285968) (xy 170.055 95.706224) (xy 168.858224 96.903) (xy 162.152382 96.903) (xy 161.990704 96.741322)
        (xy 161.536055 96.553) (xy 161.043945 96.553) (xy 160.589296 96.741322) (xy 160.427618 96.903) (xy 139.292382 96.903)
        (xy 139.130704 96.741322) (xy 138.819083 96.612244) (xy 139.158216 96.471771) (xy 139.227957 96.23039) (xy 138.43 95.432434)
        (xy 137.632043 96.23039) (xy 137.701784 96.471771) (xy 138.06701 96.601436) (xy 137.729296 96.741322) (xy 137.567618 96.903)
        (xy 129.132382 96.903) (xy 128.970704 96.741322) (xy 128.516055 96.553) (xy 128.023945 96.553) (xy 127.569296 96.741322)
        (xy 127.407618 96.903) (xy 108.001776 96.903) (xy 106.805 95.706224) (xy 106.805 95.490286) (xy 106.817445 95.455232)
        (xy 106.805 95.214032) (xy 106.805 94.793776) (xy 108.001776 93.597) (xy 125.678224 93.597)
      )
    )
  )
)
