id;x;y;name;bem;valide;fs_hac;fs_had;fs_flt;grab_hac;grab_had;grab_flt;Kimmig 1983;Brun 1997;Reinhard 2004;krause 2008
1;3500950;5574879;Glauberg (Buedingen);Befestigung ab Wende Ha D2/D3 bis Lt B;1;0;0;1;0;0;2;;;1;1
2;3565435;5516010;Marienberg (Wuerzburg);Ha D2-D3, flt;1;0;1;1;0;0;0;1;1;1;
3;3436670;5481900;Heidenmauer (Bad Duerkheim);Heidenmauer ab Ha D;1;0;0;1;0;0;1;;;1;1
4;3333365;5468940;Limberg (Wallerfangen);Befestigung datiert hauptsächlich in Ha C und ist in Ha D nicht ganz gesichert;1;1;1;0;0;1;0;;;1;
5;3367800;5445550;Homerich (Reinheim);nur FLT;1;0;0;1;0;0;1;;;1;
6;3425730;5425730;Hexenberg (Leutenheim);Befestigung Bronze Finale IIIb;0;0;0;0;4;5;4;;-1;1;
7;3509880;5418960;Hohenaspereg (Asperg);ab had2;1;0;1;1;0;8;1;1;-1;1;1
8;3599250;5415480;Ipf (Bopfingen);;1;1;1;1;1;0;0;1;;1;1
9;3530750;5328900;Heuneburg (Hundersingen);;1;?;1;0;8;5;0;1;1;1;1
10;3455320;5326450;Kapf (Villingen);;1;0;1;0;0;1;0;1;1;1;
11;3394125;5322357;"Muensterberg (Breisach)
";;1;0;1;1;0;1;2;1;1;1;1
12;3370500;5283050;Britzgyberg (Illfurth);Ha C2-LtA, Importe Ha D;1;1;1;1;1;0;0;1;1;1;1
13;3310550;5422750;Mont de Tincry (Tincry) ;L. Olivier?: L'enceinte de Tincry (Moselle)?: un nouveau centre de pouvoir hallstattien li? ? l'exploitation du sel de la haute Seille?? Antiquit?s nationales , 34 (2002), 2003, p. 119-133.  Ha C und Ha D;1;1;1;0;0;0;0;;;1;
14;3284025;5369075;Cote de Sion (Saxon-Sion);Ha c-d;1;1;1;0;4;4;0;;1;1;
15;3242600;5261400;Gray;;1;0;1;0;0;4;2;1;1;1;
16;3237825;5253800;Mont Guerin;Befestigt in Ha C/D1, Import in Ha D;1;?;1;0;0;0;0;;;1;
17;3257300;5220691;Camp du Chateau (Salins);;1;?;1;1;0;2;1;1;1;1;1
18;3461250;5245000;Uetliberg (Zuerich);;1;0;1;1;0;5;4;1;1;1;1
19;2990413;5256326;Bourges;;1;;;;;;;;;1;
20;3166140;5317409;Mont Lassois;;1;;1;;;1;;1;1;1;1
21;3135748;5364246;Troyes;;0;;;;;;;;;;
22;3063979;5645258;Kemmelberg;Ha C;1;1;;;1;;;;;1;
23;3101284;5294697;???;;0;;;;;;;;;;
24;3183750;5312760;Camp de Chassey;;1;;;;;;;;;1;
25;3358600;5186338;Chatillon-sur-Glan;;1;;;;;;;;;1;
26;3365750;5209610;Schiffenen;;0;;;;;;;;;1;
27;;;Montmorot;;0;;;;;;;;;1;
28;;;Larina / Lyon;;0;;;;;;;;;1;
