<?xml version="1.0" encoding="UTF-8" standalone="no"?>
<!-- Created with Inkscape (http://www.inkscape.org/) -->

<svg
   xmlns:dc="http://purl.org/dc/elements/1.1/"
   xmlns:cc="http://creativecommons.org/ns#"
   xmlns:rdf="http://www.w3.org/1999/02/22-rdf-syntax-ns#"
   xmlns:svg="http://www.w3.org/2000/svg"
   xmlns="http://www.w3.org/2000/svg"
   xmlns:xlink="http://www.w3.org/1999/xlink"
   xmlns:sodipodi="http://sodipodi.sourceforge.net/DTD/sodipodi-0.dtd"
   xmlns:inkscape="http://www.inkscape.org/namespaces/inkscape"
   width="228.60001mm"
   height="101.6mm"
   viewBox="0 0 228.60001 101.6"
   version="1.1"
   id="svg8"
   inkscape:version="0.92.3 (2405546, 2018-03-11)"
   sodipodi:docname="fig1.svg"
   inkscape:export-filename="/home/fon/daten/pub/EZurb/4result/fig1/fig1.png"
   inkscape:export-xdpi="600"
   inkscape:export-ydpi="600">
  <defs
     id="defs2" />
  <sodipodi:namedview
     id="base"
     pagecolor="#ffffff"
     bordercolor="#666666"
     borderopacity="1.0"
     inkscape:pageopacity="0.0"
     inkscape:pageshadow="2"
     inkscape:zoom="1.979899"
     inkscape:cx="334.66831"
     inkscape:cy="165.12882"
     inkscape:document-units="mm"
     inkscape:current-layer="layer2"
     showgrid="false"
     fit-margin-top="0"
     fit-margin-left="0"
     fit-margin-right="0"
     fit-margin-bottom="0"
     inkscape:window-width="1916"
     inkscape:window-height="1024"
     inkscape:window-x="0"
     inkscape:window-y="26"
     inkscape:window-maximized="0" />
  <metadata
     id="metadata5">
    <rdf:RDF>
      <cc:Work
         rdf:about="">
        <dc:format>image/svg+xml</dc:format>
        <dc:type
           rdf:resource="http://purl.org/dc/dcmitype/StillImage" />
        <dc:title></dc:title>
      </cc:Work>
    </rdf:RDF>
  </metadata>
  <g
     inkscape:label="Ebene 1"
     inkscape:groupmode="layer"
     id="layer1"
     transform="translate(16.404165,-36.045235)"
     sodipodi:insensitive="true">
    <image
       sodipodi:absref="/home/fon/daten/pub/EZurb/4result/fig1/f1a.png"
       xlink:href="f1a.png"
       width="228.60001"
       height="101.6"
       preserveAspectRatio="none"
       id="image823"
       x="-16.404165"
       y="36.045235" />
  </g>
  <g
     inkscape:groupmode="layer"
     id="layer2"
     inkscape:label="Text">
    <text
       xml:space="preserve"
       style="font-style:normal;font-weight:normal;font-size:10.58333302px;line-height:1.25;font-family:sans-serif;letter-spacing:0px;word-spacing:0px;fill:#000000;fill-opacity:1;stroke:none;stroke-width:0.26458332"
       x="-59.100132"
       y="52.2929"
       id="text848"
       transform="rotate(-69.740213)"
       inkscape:transform-center-x="1.737252"
       inkscape:transform-center-y="3.2072329"><tspan
         sodipodi:role="line"
         id="tspan846"
         x="-59.100132"
         y="52.2929"
         style="font-style:italic;font-variant:normal;font-weight:normal;font-stretch:normal;font-size:4.23333311px;font-family:FreeSans;-inkscape-font-specification:'FreeSans Italic';stroke-width:0.26458332">Rhine</tspan></text>
    <text
       xml:space="preserve"
       style="font-style:normal;font-weight:normal;font-size:10.58333302px;line-height:1.25;font-family:sans-serif;letter-spacing:0px;word-spacing:0px;fill:#000000;fill-opacity:1;stroke:none;stroke-width:0.26458332"
       x="45.038322"
       y="51.511345"
       id="text848-9"><tspan
         sodipodi:role="line"
         id="tspan846-8"
         x="45.038322"
         y="51.511345"
         style="font-style:normal;font-variant:normal;font-weight:normal;font-stretch:normal;font-size:4.23333311px;font-family:FreeSans;-inkscape-font-specification:FreeSans;stroke-width:0.26458332">Hohenasperg</tspan></text>
    <text
       xml:space="preserve"
       style="font-style:normal;font-weight:normal;font-size:10.58333302px;line-height:1.25;font-family:sans-serif;letter-spacing:0px;word-spacing:0px;fill:#000000;fill-opacity:1;stroke:none;stroke-width:0.26458332"
       x="11.635118"
       y="82.2658"
       id="text848-6"
       transform="rotate(-24.704071)"><tspan
         sodipodi:role="line"
         id="tspan846-7"
         x="11.635118"
         y="82.2658"
         style="font-style:italic;font-variant:normal;font-weight:normal;font-stretch:normal;font-size:4.23333311px;font-family:FreeSans;-inkscape-font-specification:'FreeSans Italic';stroke-width:0.26458332">Neckar</tspan></text>
    <text
       xml:space="preserve"
       style="font-style:normal;font-weight:normal;font-size:10.58333302px;line-height:1.25;font-family:sans-serif;letter-spacing:0px;word-spacing:0px;fill:#000000;fill-opacity:1;stroke:none;stroke-width:0.26458332"
       x="14.203675"
       y="97.473541"
       id="text848-0"
       transform="rotate(-28.353141)"
       inkscape:transform-center-x="1.4699824"
       inkscape:transform-center-y="-1.7372535"><tspan
         sodipodi:role="line"
         id="tspan846-4"
         x="14.203675"
         y="97.473541"
         style="font-style:italic;font-variant:normal;font-weight:normal;font-stretch:normal;font-size:4.23333311px;font-family:FreeSans;-inkscape-font-specification:'FreeSans Italic';stroke-width:0.26458332">Danube</tspan></text>
    <text
       xml:space="preserve"
       style="font-style:normal;font-weight:normal;font-size:10.58333302px;line-height:1.25;font-family:sans-serif;letter-spacing:0px;word-spacing:0px;fill:#000000;fill-opacity:1;stroke:none;stroke-width:0.26458332"
       x="33.279919"
       y="79.696434"
       id="text848-9-8"><tspan
         sodipodi:role="line"
         id="tspan846-8-4"
         x="33.279919"
         y="79.696434"
         style="font-style:normal;font-variant:normal;font-weight:normal;font-stretch:normal;font-size:4.23333311px;font-family:FreeSans;-inkscape-font-specification:FreeSans;stroke-width:0.26458332">Kapf</tspan></text>
    <text
       xml:space="preserve"
       style="font-style:normal;font-weight:normal;font-size:10.58333302px;line-height:1.25;font-family:sans-serif;letter-spacing:0px;word-spacing:0px;fill:#000000;fill-opacity:1;stroke:none;stroke-width:0.26458332"
       x="51.32061"
       y="88.115425"
       id="text848-9-81"><tspan
         sodipodi:role="line"
         id="tspan846-8-6"
         x="51.32061"
         y="88.115425"
         style="font-style:normal;font-variant:normal;font-weight:normal;font-stretch:normal;font-size:4.23333311px;font-family:FreeSans;-inkscape-font-specification:FreeSans;stroke-width:0.26458332">Heuneburg</tspan></text>
  </g>
</svg>
