B31114
B311141
B3111411
B3111412
B3111413
B3111414
B3111415
B3111416
B3111419
B311142
B3111421
B3111422
B3111423
B3111424
B3111425
B3111426
B3111429
B311143
B3111431
B3111432
B3111433
B3111434
B3111435
B3111436
B3111439
B311144
B3111441
B3111442
B3111443
B3111444
B3111445
B3111446
B3111449
B311145
B3111451
B3111452
B3111453
B3111454
B3111455
B3111456
B3111459
B311146
B3111461
B3111462
B3111463
B3111464
B3111465
B3111466
B3111469
B311147
B3111471
B3111472
B3111473
B3111474
B3111475
B3111476
B3111479
B311149
B3111491
B3111492
B3111493
B3111494
B3111495
B3111496
B3111499
B3112
B31121
B311211
B3112111
B3112112
B3112113
B3112114
B3112115
B3112116
B3112119
B311212
B3112121
B3112122
B3112123
B3112124
B3112125
B3112126
B3112129
B311213
B3112131
B3112132
B3112133
B3112134
B3112135
B3112136
B3112139
B311214
B3112141
B3112142
B3112143
B3112144
B3112145
B3112146
B3112149
B311215
B3112151
B3112152
B3112153
B3112154
B3112155
B3112156
B3112159
B311216
B3112161
B3112162
B3112163
B3112164
B3112165
B3112166
B3112169
B311217
B3112171
B3112172
B3112173
B3112174
B3112175
B3112176
B3112179
B311219
B3112191
B3112192
B3112193
B3112194
B3112195
B3112196
B3112199
B31122
B311221
B3112211
B3112212
B3112213
B3112214
B3112215
B3112216
B3112219
B311222
B3112221
B3112222
B3112223
B3112224
B3112225
B3112226
B3112229
B311223
B3112231
B3112232
B3112233
B3112234
B3112235
B3112236
B3112239
B311224
B3112241
B3112242
B3112243
B3112244
B3112245
B3112246
B3112249
B311225
B3112251
B3112252
B3112253
B3112254
B3112255
B3112256
B3112259
B311226
B3112261
B3112262
B3112263
B3112264
B3112265
B3112266
B3112269
B311227
B3112271
B3112272
B3112273
B3112274
B3112275
B3112276
B3112279
B311229
B3112291
B3112292
B3112293
B3112294
B3112295
B3112296
B3112299
B31123
B311231
B3112311
B3112312
B3112313
B3112314
B3112315
B3112316
B3112319
B311232
B3112321
B3112322
B3112323
B3112324
B3112325
B3112326
B3112329
B311233
B3112331
B3112332
B3112333
B3112334
B3112335
B3112336
B3112339
B311234
B3112341
B3112342
B3112343
B3112344
B3112345
B3112346
B3112349
B311235
B3112351
B3112352
B3112353
B3112354
B3112355
B3112356
B3112359
B311236
B3112361
B3112362
B3112363
B3112364
B3112365
B3112366
B3112369
B311237
B3112371
B3112372
B3112373
B3112374
B3112375
B3112376
B3112379
B311239
B3112391
B3112392
B3112393
B3112394
B3112395
B3112396
B3112399
B3113
B31131
B311311
B3113111
B3113112
B3113113
B3113114
B3113115
B3113116
B3113119
B311312
B3113121
B3113122
B3113123
B3113124
B3113125
B3113126
B3113129
B311313
B3113131
B3113132
B3113133
B3113134
B3113135
B3113136
B3113139
B311314
B3113141
B3113142
B3113143
B3113144
B3113145
B3113146
B3113149
B311315
B3113151
B3113152
B3113153
B3113154
B3113155
B3113156
B3113159
B311316
B3113161
B3113162
B3113163
B3113164
B3113165
B3113166
B3113169
B311317
B3113171
B3113172
B3113173
B3113174
B3113175
B3113176
B3113179
B311319
B3113191
B3113192
B3113193
B3113194
B3113195
B3113196
B3113199
B31132
B311321
B3113211
B3113212
B3113213
B3113214
B3113215
B3113216
B3113219
B311322
B3113221
B3113222
B3113223
B3113224
B3113225
B3113226
B3113229
B311323
B3113231
B3113232
B3113233
B3113234
B3113235
B3113236
B3113239
B311324
B3113241
B3113242
B3113243
B3113244
B3113245
B3113246
B3113249
B311325
B3113251
B3113252
B3113253
B3113254
B3113255
B3113256
B3113259
B311326
B3113261
B3113262
B3113263
B3113264
B3113265
B3113266
B3113269
B311327
B3113271
B3113272
B3113273
B3113274
B3113275
B3113276
B3113279
B311329
B3113291
B3113292
B3113293
B3113294
B3113295
B3113296
B3113299
B31133
B311331
B3113311
B3113312
B3113313
B3113314
B3113315
B3113316
B3113319
B311332
B3113321
B3113322
B3113323
B3113324
B3113325
B3113326
B3113329
B311333
B3113331
B3113332
B3113333
B3113334
B3113335
B3113336
B3113339
B311334
B3113341
B3113342
B3113343
B3113344
B3113345
B3113346
B3113349
B311335
B3113351
B3113352
B3113353
B3113354
B3113355
B3113356
B3113359
B311336
B3113361
B3113362
B3113363
B3113364
B3113365
B3113366
B3113369
B311337
B3113371
B3113372
B3113373
B3113374
B3113375
B3113376
B3113379
B311339
B3113391
B3113392
B3113393
B3113394
B3113395
B3113396
B3113399

