<?xml version="1.0" encoding="UTF-8" standalone="no"?>
<!-- Created with Inkscape (http://www.inkscape.org/) -->

<svg
   xmlns:dc="http://purl.org/dc/elements/1.1/"
   xmlns:cc="http://creativecommons.org/ns#"
   xmlns:rdf="http://www.w3.org/1999/02/22-rdf-syntax-ns#"
   xmlns:svg="http://www.w3.org/2000/svg"
   xmlns="http://www.w3.org/2000/svg"
   xmlns:sodipodi="http://sodipodi.sourceforge.net/DTD/sodipodi-0.dtd"
   xmlns:inkscape="http://www.inkscape.org/namespaces/inkscape"
   width="250"
   height="50"
   viewBox="0 0 66.14583 13.229167"
   version="1.1"
   id="svg8"
   inkscape:version="0.92.3 (2405546, 2018-03-11)"
   sodipodi:docname="orientierung.svg">
  <title
     id="title4522">icon</title>
  <defs
     id="defs2" />
  <sodipodi:namedview
     id="base"
     pagecolor="#ffffff"
     bordercolor="#666666"
     borderopacity="1.0"
     inkscape:pageopacity="0.0"
     inkscape:pageshadow="2"
     inkscape:zoom="2.8"
     inkscape:cx="-44.247953"
     inkscape:cy="32.614084"
     inkscape:document-units="mm"
     inkscape:current-layer="layer1"
     showgrid="true"
     units="px"
     inkscape:window-width="1916"
     inkscape:window-height="1032"
     inkscape:window-x="0"
     inkscape:window-y="22"
     inkscape:window-maximized="0"
     gridtolerance="1"
     guidetolerance="1"
     objecttolerance="1">
    <inkscape:grid
       type="xygrid"
       id="grid815"
       spacingx="2.6458333"
       spacingy="2.6458333"
       dotted="true" />
    <inkscape:grid
       type="xygrid"
       id="grid4520" />
  </sodipodi:namedview>
  <metadata
     id="metadata5">
    <rdf:RDF>
      <cc:Work
         rdf:about="">
        <dc:format>image/svg+xml</dc:format>
        <dc:type
           rdf:resource="http://purl.org/dc/dcmitype/StillImage" />
        <dc:title>icon</dc:title>
        <dc:creator>
          <cc:Agent>
            <dc:title>Oliver Nakoinz</dc:title>
          </cc:Agent>
        </dc:creator>
        <cc:license
           rdf:resource="http://creativecommons.org/licenses/by/4.0/" />
        <dc:date>2020</dc:date>
      </cc:Work>
      <cc:License
         rdf:about="http://creativecommons.org/licenses/by/4.0/">
        <cc:permits
           rdf:resource="http://creativecommons.org/ns#Reproduction" />
        <cc:permits
           rdf:resource="http://creativecommons.org/ns#Distribution" />
        <cc:requires
           rdf:resource="http://creativecommons.org/ns#Notice" />
        <cc:requires
           rdf:resource="http://creativecommons.org/ns#Attribution" />
        <cc:permits
           rdf:resource="http://creativecommons.org/ns#DerivativeWorks" />
      </cc:License>
    </rdf:RDF>
  </metadata>
  <g
     inkscape:label="Ebene 1"
     inkscape:groupmode="layer"
     id="layer1"
     transform="translate(0,-283.77082)">
    <text
       xml:space="preserve"
       style="font-style:normal;font-weight:normal;font-size:9.8777771px;line-height:125%;font-family:sans-serif;letter-spacing:0px;word-spacing:0px;fill:#000000;fill-opacity:1;stroke:none;stroke-width:0.26458332px;stroke-linecap:butt;stroke-linejoin:miter;stroke-opacity:1"
       x="3.9006252"
       y="276.49457"
       id="text853-3"><tspan
         sodipodi:role="line"
         id="tspan851-6"
         x="3.9006252"
         y="276.49457"
         style="stroke-width:0.26458332px">Vorstellung</tspan></text>
    <text
       xml:space="preserve"
       style="font-style:normal;font-weight:normal;font-size:9.8777771px;line-height:125%;font-family:sans-serif;letter-spacing:0px;word-spacing:0px;fill:#000000;fill-opacity:1;stroke:none;stroke-width:0.26458332px;stroke-linecap:butt;stroke-linejoin:miter;stroke-opacity:1"
       x="31.429968"
       y="261.98315"
       id="text853-37"><tspan
         sodipodi:role="line"
         id="tspan851-4"
         x="31.429968"
         y="261.98315"
         style="font-style:normal;font-variant:normal;font-weight:normal;font-stretch:normal;font-family:Purisa;-inkscape-font-specification:Purisa;stroke-width:0.26458332px">Hinweis</tspan></text>
    <text
       xml:space="preserve"
       style="font-style:normal;font-weight:normal;font-size:9.8777771px;line-height:125%;font-family:sans-serif;letter-spacing:0px;word-spacing:0px;fill:#000000;fill-opacity:1;stroke:none;stroke-width:0.26458332px;stroke-linecap:butt;stroke-linejoin:miter;stroke-opacity:1"
       x="-5.8131123"
       y="264.05902"
       id="text901"><tspan
         sodipodi:role="line"
         id="tspan899"
         x="-5.8131123"
         y="264.05902"
         style="font-style:normal;font-variant:normal;font-weight:normal;font-stretch:normal;font-family:'EB Garamond';-inkscape-font-specification:'EB Garamond';stroke-width:0.26458332px">Hinweis</tspan></text>
    <g
       id="g973"
       transform="matrix(1.0060891,0,0,1,-64.287152,22.88761)">
      <path
         sodipodi:nodetypes="ccccc"
         inkscape:connector-curvature="0"
         id="path923"
         d="m 11.211699,296.80707 0.818997,-11.90513 53.589944,-0.78815 -3.113018,11.64929 z"
         style="fill:#fff6d5;fill-rule:evenodd;stroke:none;stroke-width:0.1570743;stroke-linecap:butt;stroke-linejoin:miter;stroke-miterlimit:4;stroke-dasharray:none;stroke-opacity:1" />
      <path
         sodipodi:nodetypes="ccccccccsc"
         inkscape:connector-curvature="0"
         id="rect903"
         d="m 65.620664,284.03999 c -0.45215,0.0875 -2.237553,3.00151 -3.037504,4.62447 l -1.553358,3.94382 c -6.059241,3.51747 -40.876374,0.32603 -49.886542,4.32684 l 52.063698,-0.31127 0.002,-0.0249 c 1.04e-4,10e-6 0.01378,0.002 0.01378,0.002 l 2.420054,-10.83799 c 0.269131,-1.30051 0.214697,-1.76849 -0.02215,-1.72264 z"
         style="opacity:1;fill:#000000;fill-opacity:1;stroke:none;stroke-width:0.42860475;stroke-linejoin:round;stroke-miterlimit:4;stroke-dasharray:none;stroke-dashoffset:0;stroke-opacity:1" />
    </g>
    <path
       style="opacity:1;fill:#000000;fill-opacity:1;stroke:none;stroke-width:0.44305104;stroke-linejoin:round;stroke-miterlimit:4;stroke-dasharray:none;stroke-dashoffset:0;stroke-opacity:1"
       d="m 65.308761,285.09056 c -0.529794,0.0798 -2.621789,2.7372 -3.559111,4.21725 l -1.820106,3.59656 c -7.09975,3.20774 -47.89577,0.29732 -58.4531878,3.94584 l 61.0042068,-0.28386 0.0024,-0.0227 c 1.23e-4,10e-6 0.01615,0.002 0.01615,0.002 l 2.835728,-9.88365 c 0.315345,-1.186 0.251566,-1.61277 -0.02596,-1.57096 z"
       id="rect903-7"
       inkscape:connector-curvature="0"
       sodipodi:nodetypes="ccccccccsc" />
    <g
       id="g969"
       transform="translate(-2.976372,-6.42967)">
      <path
         sodipodi:nodetypes="ccccc"
         inkscape:connector-curvature="0"
         id="path923-1"
         d="M 7.2429489,338.86948 8.0619459,326.96435 61.65189,326.1762 58.538872,337.82549 Z"
         style="fill:#fff6d5;fill-rule:evenodd;stroke:#000000;stroke-width:0.1570743;stroke-linecap:butt;stroke-linejoin:miter;stroke-miterlimit:4;stroke-dasharray:none;stroke-opacity:1" />
      <path
         sodipodi:nodetypes="ccccccccsc"
         inkscape:connector-curvature="0"
         id="rect903-1"
         d="m 61.651914,326.1024 c -0.452149,0.0875 -2.237552,3.00151 -3.037504,4.62447 l -1.553358,3.94382 c -6.059241,3.51747 -40.876374,0.32603 -49.8865421,4.32684 l 52.0636981,-0.31127 0.0021,-0.0249 c 1.04e-4,10e-6 0.01378,0.002 0.01378,0.002 l 2.420054,-10.83799 c 0.269132,-1.30051 0.214699,-1.76849 -0.02215,-1.72264 z"
         style="opacity:1;fill:#000000;fill-opacity:1;stroke:none;stroke-width:0.42860475;stroke-linejoin:round;stroke-miterlimit:4;stroke-dasharray:none;stroke-dashoffset:0;stroke-opacity:1" />
    </g>
    <g
       aria-label="Orientierung"
       style="font-style:normal;font-weight:normal;font-size:9.8777771px;line-height:125%;font-family:sans-serif;letter-spacing:0px;word-spacing:0px;fill:#000000;fill-opacity:1;stroke:none;stroke-width:0.26458332px;stroke-linecap:butt;stroke-linejoin:miter;stroke-opacity:1"
       id="text853">
      <path
         d="m 20.973836,287.55529 c 0,-1.2446 -0.572911,-1.92617 -1.629833,-1.92617 -0.819856,0 -1.8669,0.41487 -2.548467,0.99766 -0.790222,0.69144 -1.234722,1.78788 -1.234722,3.03248 0,1.26435 0.582789,1.93604 1.679222,1.93604 0.898878,0 1.886656,-0.42474 2.627489,-1.13594 0.7112,-0.69145 1.106311,-1.71874 1.106311,-2.90407 z m -1.3335,2.45957 c -0.424744,0.75071 -1.096433,1.18533 -1.827389,1.18533 -0.908755,0 -1.442155,-0.7112 -1.442155,-1.92617 0,-1.82739 1.056922,-3.25966 2.4003,-3.25966 0.879122,0 1.392766,0.69144 1.392766,1.83726 0,0.75071 -0.207433,1.6002 -0.523522,2.16324 z"
         style="font-style:normal;font-variant:normal;font-weight:normal;font-stretch:normal;font-family:'TeX Gyre Chorus';-inkscape-font-specification:'TeX Gyre Chorus';stroke-width:0.26458332px"
         id="path835" />
      <path
         d="m 24.496344,287.48614 c -0.187678,-0.0593 -0.2667,-0.079 -0.365478,-0.079 -0.1778,0 -0.385233,0.0889 -0.651933,0.27658 l -0.582789,0.42474 c 0.0099,-0.079 0.02963,-0.12841 0.02963,-0.15804 0.07902,-0.32597 0.0889,-0.38523 0.0889,-0.43462 0,-0.0593 -0.05927,-0.10866 -0.128411,-0.10866 -0.128411,0 -0.997655,0.42475 -1.6002,0.79022 l -0.02963,0.2667 c 0.5334,-0.27657 0.592667,-0.29633 0.7112,-0.29633 0.128411,0 0.187678,0.0691 0.187678,0.20743 0,0.13829 -0.09878,0.60255 -0.217311,1.02729 l -0.592667,2.16324 0.760589,-0.28646 0.740833,-2.81517 c 0.335845,-0.24694 0.563034,-0.34572 0.829733,-0.34572 0.217312,0 0.345723,0.079 0.523523,0.30621 z"
         style="font-style:normal;font-variant:normal;font-weight:normal;font-stretch:normal;font-family:'TeX Gyre Chorus';-inkscape-font-specification:'TeX Gyre Chorus';stroke-width:0.26458332px"
         id="path837" />
      <path
         d="m 26.662664,290.57789 0.03951,-0.29633 c -0.484011,0.29633 -0.968022,0.54327 -1.056922,0.54327 -0.108655,0 -0.187678,-0.11853 -0.187678,-0.27657 0,-0.3556 0.118534,-0.73096 0.207434,-1.10632 l 0.306211,-1.25447 c 0.04939,-0.20744 0.128411,-0.52353 0.128411,-0.64206 0,-0.079 -0.02963,-0.12841 -0.118533,-0.12841 -0.227189,0 -1.254478,0.67169 -1.550811,0.86924 l -0.0099,0.28646 c 0.227189,-0.12841 0.582789,-0.36548 0.721078,-0.36548 0.108655,0 0.118533,0.10866 0.118533,0.19756 0,0.21731 -0.217311,0.94826 -0.325967,1.40264 -0.108655,0.45438 -0.286455,0.91864 -0.286455,1.36314 0,0.25682 0.09878,0.41486 0.256822,0.41486 0.167922,0 0.345722,-0.0889 0.918633,-0.46425 0.158045,-0.10866 0.237067,-0.16793 0.839611,-0.54328 z m 0.06914,-4.58329 c -0.1778,-0.28646 -0.187678,-0.31609 -0.286456,-0.54328 -0.0099,-0.0395 -0.02963,-0.0889 -0.04939,-0.12841 -0.05927,0.0494 -0.09878,0.079 -0.138289,0.10866 -0.2667,0.22719 -0.286455,0.23706 -0.543277,0.41486 0.07902,0.23707 0.148166,0.3556 0.375355,0.69145 l 0.325967,-0.29634 c 0.05927,-0.0395 0.0889,-0.0691 0.316089,-0.24694 z"
         style="font-style:normal;font-variant:normal;font-weight:normal;font-stretch:normal;font-family:'TeX Gyre Chorus';-inkscape-font-specification:'TeX Gyre Chorus';stroke-width:0.26458332px"
         id="path839" />
      <path
         d="m 29.766601,290.41984 v -0.28645 c -0.365478,0.29633 -1.0668,0.89888 -1.570567,0.89888 -0.553155,0 -0.602544,-0.59267 -0.592666,-0.9779 0.227188,-0.10866 1.195211,-0.83961 1.392766,-0.98778 0.365478,-0.29633 0.632178,-0.61242 0.632178,-1.07668 0,-0.32597 -0.197556,-0.57291 -0.563033,-0.57291 -0.3556,0 -0.661811,0.1778 -1.017411,0.45438 -0.869245,0.67169 -1.175456,1.778 -1.175456,2.70651 0,0.60254 0.246945,1.02729 0.849489,1.02729 0.760589,0 1.639711,-0.78035 2.0447,-1.18534 z m -0.869245,-2.15335 c 0,0.7112 -0.809977,1.11619 -1.284111,1.48167 0.03951,-0.49389 0.414867,-1.89654 0.9779,-1.89654 0.217311,0 0.306211,0.19756 0.306211,0.41487 z"
         style="font-style:normal;font-variant:normal;font-weight:normal;font-stretch:normal;font-family:'TeX Gyre Chorus';-inkscape-font-specification:'TeX Gyre Chorus';stroke-width:0.26458332px"
         id="path841" />
      <path
         d="m 34.486635,290.20253 c -0.987778,0.56304 -1.027289,0.58279 -1.126066,0.58279 -0.09878,0 -0.158045,-0.10865 -0.158045,-0.2667 0,-0.20743 0.06915,-0.5334 0.256822,-1.21496 0.464256,-1.65947 0.464256,-1.65947 0.464256,-1.72862 0,-0.10865 -0.06915,-0.16792 -0.197556,-0.16792 -0.148166,0 -0.365477,0.0889 -0.721077,0.31609 l -1.353256,0.83961 c 0.0889,-0.32596 0.237067,-0.94826 0.237067,-1.02729 0,-0.0691 -0.05927,-0.12841 -0.128411,-0.12841 -0.108656,0 -0.819856,0.36548 -1.550811,0.8001 l -0.05927,0.25682 c 0.632178,-0.28645 0.671689,-0.29633 0.760589,-0.29633 0.06914,0 0.118533,0.0593 0.118533,0.13829 0,0.20743 -0.187678,1.02729 -0.434622,1.92617 l -0.227189,0.8001 -0.138289,0.5334 0.740834,-0.28646 0.582788,-2.32128 c 1.234723,-0.78034 1.264356,-0.79022 1.402645,-0.79022 0.06914,0 0.108655,0.0494 0.108655,0.12841 0,0.14817 -0.07902,0.52352 -0.365477,1.64959 -0.217312,0.87912 -0.256823,1.04705 -0.256823,1.23472 0,0.13829 0.03951,0.2667 0.148167,0.4445 0.454378,-0.20743 1.135944,-0.63217 1.827389,-1.14582 z"
         style="font-style:normal;font-variant:normal;font-weight:normal;font-stretch:normal;font-family:'TeX Gyre Chorus';-inkscape-font-specification:'TeX Gyre Chorus';stroke-width:0.26458332px"
         id="path843" />
      <path
         d="m 37.469106,290.46923 0.01976,-0.24694 c -0.750711,0.4445 -1.0668,0.61242 -1.205089,0.61242 -0.128411,0 -0.286455,-0.25682 -0.286455,-0.46425 0,-0.13829 0.167922,-0.89888 0.424744,-1.93605 0.138289,-0.01 0.237067,-0.01 0.286455,-0.01 l 0.395112,-0.01 c 0.03951,0 0.138288,-0.01 0.296333,-0.0296 l 0.375355,-0.28645 h -1.264355 l 0.395111,-1.6002 c -0.187678,0.0988 -0.2667,0.12841 -0.414867,0.19755 -0.06914,0.0395 -0.148166,0.0691 -0.227189,0.10866 -0.03951,0.0197 -0.0889,0.0395 -0.138288,0.0593 l -0.276578,1.23473 c -0.0889,0.01 -0.148167,0.01 -0.1778,0.01 h -0.237067 c 0,0 -0.06914,0 -0.148166,0.01 -0.108656,0.0692 -0.118534,0.0692 -0.286456,0.20744 -0.02963,0.0197 -0.07902,0.0593 -0.148167,0.10865 h 0.237067 0.454378 0.217311 c -0.523522,2.19287 -0.523522,2.19287 -0.523522,2.49908 0,0.31609 0.207433,0.66181 0.395111,0.66181 0.217311,0 0.889,-0.41487 1.837266,-1.12607 z"
         style="font-style:normal;font-variant:normal;font-weight:normal;font-stretch:normal;font-family:'TeX Gyre Chorus';-inkscape-font-specification:'TeX Gyre Chorus';stroke-width:0.26458332px"
         id="path845" />
      <path
         d="m 40.109559,290.57789 0.03951,-0.29633 c -0.484011,0.29633 -0.968022,0.54327 -1.056922,0.54327 -0.108656,0 -0.187678,-0.11853 -0.187678,-0.27657 0,-0.3556 0.118533,-0.73096 0.207433,-1.10632 l 0.306211,-1.25447 c 0.04939,-0.20744 0.128412,-0.52353 0.128412,-0.64206 0,-0.079 -0.02963,-0.12841 -0.118534,-0.12841 -0.227189,0 -1.254477,0.67169 -1.550811,0.86924 l -0.0099,0.28646 c 0.227189,-0.12841 0.582789,-0.36548 0.721078,-0.36548 0.108656,0 0.118534,0.10866 0.118534,0.19756 0,0.21731 -0.217312,0.94826 -0.325967,1.40264 -0.108656,0.45438 -0.286456,0.91864 -0.286456,1.36314 0,0.25682 0.09878,0.41486 0.256823,0.41486 0.167922,0 0.345722,-0.0889 0.918633,-0.46425 0.158044,-0.10866 0.237066,-0.16793 0.839611,-0.54328 z m 0.06914,-4.58329 c -0.1778,-0.28646 -0.187677,-0.31609 -0.286455,-0.54328 -0.0099,-0.0395 -0.02963,-0.0889 -0.04939,-0.12841 -0.05927,0.0494 -0.09878,0.079 -0.138289,0.10866 -0.2667,0.22719 -0.286456,0.23706 -0.543278,0.41486 0.07902,0.23707 0.148167,0.3556 0.375356,0.69145 l 0.325966,-0.29634 c 0.05927,-0.0395 0.0889,-0.0691 0.316089,-0.24694 z"
         style="font-style:normal;font-variant:normal;font-weight:normal;font-stretch:normal;font-family:'TeX Gyre Chorus';-inkscape-font-specification:'TeX Gyre Chorus';stroke-width:0.26458332px"
         id="path847" />
      <path
         d="m 43.213496,290.41984 v -0.28645 c -0.365477,0.29633 -1.0668,0.89888 -1.570566,0.89888 -0.553156,0 -0.602545,-0.59267 -0.592667,-0.9779 0.227189,-0.10866 1.195211,-0.83961 1.392767,-0.98778 0.365478,-0.29633 0.632178,-0.61242 0.632178,-1.07668 0,-0.32597 -0.197556,-0.57291 -0.563034,-0.57291 -0.3556,0 -0.661811,0.1778 -1.017411,0.45438 -0.869244,0.67169 -1.175455,1.778 -1.175455,2.70651 0,0.60254 0.246944,1.02729 0.849489,1.02729 0.760588,0 1.639711,-0.78035 2.044699,-1.18534 z m -0.869244,-2.15335 c 0,0.7112 -0.809978,1.11619 -1.284111,1.48167 0.03951,-0.49389 0.414867,-1.89654 0.9779,-1.89654 0.217311,0 0.306211,0.19756 0.306211,0.41487 z"
         style="font-style:normal;font-variant:normal;font-weight:normal;font-stretch:normal;font-family:'TeX Gyre Chorus';-inkscape-font-specification:'TeX Gyre Chorus';stroke-width:0.26458332px"
         id="path849" />
      <path
         d="m 46.837098,287.48614 c -0.187678,-0.0593 -0.2667,-0.079 -0.365478,-0.079 -0.1778,0 -0.385234,0.0889 -0.651933,0.27658 l -0.582789,0.42474 c 0.0099,-0.079 0.02963,-0.12841 0.02963,-0.15804 0.07902,-0.32597 0.0889,-0.38523 0.0889,-0.43462 0,-0.0593 -0.05927,-0.10866 -0.128411,-0.10866 -0.128411,0 -0.997656,0.42475 -1.6002,0.79022 l -0.02963,0.2667 c 0.5334,-0.27657 0.592666,-0.29633 0.7112,-0.29633 0.128411,0 0.187677,0.0691 0.187677,0.20743 0,0.13829 -0.09878,0.60255 -0.217311,1.02729 l -0.592666,2.16324 0.760588,-0.28646 0.740834,-2.81517 c 0.335844,-0.24694 0.563033,-0.34572 0.829733,-0.34572 0.217311,0 0.345722,0.079 0.523522,0.30621 z"
         style="font-style:normal;font-variant:normal;font-weight:normal;font-stretch:normal;font-family:'TeX Gyre Chorus';-inkscape-font-specification:'TeX Gyre Chorus';stroke-width:0.26458332px"
         id="path851" />
      <path
         d="m 50.845314,290.39021 -0.04939,-0.0889 c -0.1778,0.11853 -0.859367,0.57291 -1.007534,0.57291 -0.128411,0 -0.138289,-0.1778 -0.138289,-0.31609 0,-0.5334 0.503767,-2.47932 0.740834,-3.16089 -0.138289,0.079 -0.701323,0.3556 -0.819856,0.41487 l -0.503766,2.20275 c -0.01976,0.0691 -0.217312,0.24694 -0.237067,0.30621 -0.167922,0.10865 -0.849489,0.56303 -1.017411,0.56303 -0.167922,0 -0.207433,-0.21731 -0.207433,-0.3556 0,-0.39511 0.306211,-1.48167 0.474133,-2.12372 0.05927,-0.25682 0.1778,-0.72108 0.1778,-0.83961 0,-0.0889 -0.03951,-0.13829 -0.128411,-0.13829 -0.1778,0 -1.254478,0.66181 -1.540934,0.81985 l -0.01975,0.2667 c 0.197555,-0.0988 0.523522,-0.28645 0.691444,-0.28645 0.09878,0 0.128411,0.10865 0.128411,0.18768 0,0.55315 -0.523522,1.92616 -0.523522,2.69663 0,0.22719 0.05927,0.49389 0.325967,0.49389 0.246944,0 1.590322,-0.91864 1.768122,-1.04705 -0.02963,0.19756 -0.09878,0.64206 -0.09878,0.82974 0,0.10865 0.06914,0.20743 0.197556,0.20743 0.256822,0 1.284111,-0.70132 1.659466,-0.98778 0.04939,-0.0296 0.108656,-0.19755 0.128411,-0.21731 z"
         style="font-style:normal;font-variant:normal;font-weight:normal;font-stretch:normal;font-family:'TeX Gyre Chorus';-inkscape-font-specification:'TeX Gyre Chorus';stroke-width:0.26458332px"
         id="path853" />
      <path
         d="m 55.457617,290.20253 c -0.987778,0.56304 -1.027289,0.58279 -1.126067,0.58279 -0.09878,0 -0.158044,-0.10865 -0.158044,-0.2667 0,-0.20743 0.06914,-0.5334 0.256822,-1.21496 0.464256,-1.65947 0.464256,-1.65947 0.464256,-1.72862 0,-0.10865 -0.06914,-0.16792 -0.197556,-0.16792 -0.148167,0 -0.365478,0.0889 -0.721078,0.31609 l -1.353255,0.83961 c 0.0889,-0.32596 0.237066,-0.94826 0.237066,-1.02729 0,-0.0691 -0.05927,-0.12841 -0.128411,-0.12841 -0.108655,0 -0.819855,0.36548 -1.550811,0.8001 l -0.05927,0.25682 c 0.632177,-0.28645 0.671689,-0.29633 0.760588,-0.29633 0.06914,0 0.118534,0.0593 0.118534,0.13829 0,0.20743 -0.187678,1.02729 -0.434622,1.92617 l -0.227189,0.8001 -0.138289,0.5334 0.740833,-0.28646 0.582789,-2.32128 c 1.234722,-0.78034 1.264355,-0.79022 1.402644,-0.79022 0.06914,0 0.108656,0.0494 0.108656,0.12841 0,0.14817 -0.07902,0.52352 -0.365478,1.64959 -0.217311,0.87912 -0.256822,1.04705 -0.256822,1.23472 0,0.13829 0.03951,0.2667 0.148167,0.4445 0.454377,-0.20743 1.135944,-0.63217 1.827388,-1.14582 z"
         style="font-style:normal;font-variant:normal;font-weight:normal;font-stretch:normal;font-family:'TeX Gyre Chorus';-inkscape-font-specification:'TeX Gyre Chorus';stroke-width:0.26458332px"
         id="path855" />
      <path
         d="m 59.625423,287.417 -1.145822,0.0198 c -0.602544,0.01 -0.770467,0.0395 -1.0668,0.21731 -0.474133,0.29633 -0.809978,0.57291 -1.017411,0.83961 -0.296333,0.38523 -0.651933,1.58044 -0.651933,2.18299 0,0.24694 0.05927,0.42474 0.217311,0.64205 l -1.135945,0.9779 c -0.493888,0.43462 -0.721077,0.76059 -0.721077,1.03717 0,0.36548 0.434622,0.57291 1.185333,0.57291 0.908755,0 1.619955,-0.25682 2.281766,-0.82973 0.424745,-0.36548 0.523523,-0.57291 0.730956,-1.55081 l 0.493889,-2.2225 c 0.03951,-0.21732 0.0889,-0.40499 0.128411,-0.56304 l 0.148167,-0.55315 c 0.01975,-0.0889 0.03951,-0.15805 0.04939,-0.21731 0.1778,-0.0494 0.187678,-0.0494 0.503767,-0.55316 z m -2.123722,4.59317 c -0.128411,0.59266 -0.217311,0.81985 -0.395111,1.00753 -0.217311,0.24694 -0.6223,0.37535 -1.205089,0.37535 -0.642055,0 -0.987778,-0.1778 -0.987778,-0.49388 0,-0.40499 0.2667,-0.65194 3.012722,-2.7559 z m 1.471789,-4.04989 c -0.04939,0.0395 -0.108656,0.0889 -0.158045,0.11853 -0.316089,0.22719 -0.385233,0.31609 -0.474133,0.55316 l -0.325967,1.1557 c -0.197555,0.12841 -0.434622,0.30621 -1.264355,0.92851 -0.1778,-0.1778 -0.246945,-0.33585 -0.246945,-0.57291 0,-0.33585 0.237067,-1.19521 0.4445,-1.66935 0.197556,-0.40499 0.404989,-0.50376 1.126067,-0.50376 0.06914,0 0.187678,0 0.316089,-0.01 h 0.2667 c 0.108655,0 0.207433,0 0.316089,0 z"
         style="font-style:normal;font-variant:normal;font-weight:normal;font-stretch:normal;font-family:'TeX Gyre Chorus';-inkscape-font-specification:'TeX Gyre Chorus';stroke-width:0.26458332px"
         id="path857" />
    </g>
    <rect
       style="opacity:1;fill:#000000;fill-opacity:1;stroke:none;stroke-width:3.45033288;stroke-linejoin:round;stroke-miterlimit:4;stroke-dasharray:none;stroke-dashoffset:0;stroke-opacity:1"
       id="rect5954"
       width="1.2361215"
       height="10.893319"
       x="4.9335794"
       y="285.42419" />
    <rect
       style="opacity:1;fill:#000000;fill-opacity:1;stroke:none;stroke-width:3.39647245;stroke-linejoin:round;stroke-miterlimit:4;stroke-dasharray:none;stroke-dashoffset:0;stroke-opacity:1"
       id="rect5954-3"
       width="2.1158257"
       height="6.1670251"
       x="317.66757"
       y="-150.6479"
       transform="matrix(-0.43583898,0.90002466,-1,0,0,0)" />
    <rect
       style="opacity:1;fill:#000000;fill-opacity:1;stroke:none;stroke-width:3.80130363;stroke-linejoin:round;stroke-miterlimit:4;stroke-dasharray:none;stroke-dashoffset:0;stroke-opacity:1"
       id="rect5954-3-6"
       width="2.2036982"
       height="7.4167299"
       x="333.83752"
       y="-181.42508"
       transform="matrix(-0.50325792,0.86413625,-1,0,0,0)" />
    <rect
       style="opacity:1;fill:#000000;fill-opacity:1;stroke:none;stroke-width:0.86692399;stroke-linejoin:round;stroke-miterlimit:4;stroke-dasharray:none;stroke-dashoffset:0;stroke-opacity:1"
       id="rect5954-1"
       width="0.92305058"
       height="0.92094976"
       x="-190.65338"
       y="193.5751"
       transform="matrix(0.66154201,-0.74990811,0.67702815,0.73595712,0,0)" />
    <rect
       style="opacity:1;fill:#000000;fill-opacity:1;stroke:none;stroke-width:2.68106818;stroke-linejoin:round;stroke-miterlimit:4;stroke-dasharray:none;stroke-dashoffset:0;stroke-opacity:1"
       id="rect5954-3-0"
       width="1.9990511"
       height="4.0671597"
       x="305.40158"
       y="-91.939919"
       transform="matrix(0.30422686,0.95259961,1,0,0,0)" />
  </g>
</svg>
