digraph G {
   
   // Daten/Zustände
   HDB_scan     [shape=box, label='HDB scan', fontname='FreeSans', fontsize=30, style=filled, fillcolor=White, tooltip ='goal']
   Spatial_analysis     [shape=circle, label='Spatial data', fontname='FreeSans', fontsize=25, style=filled, fillcolor=Turquoise, tooltip='specific kind of data', URL='#hdbscan-spatial']
   Binary_data     [shape=circle, label='Binary data', fontname='FreeSans', fontsize=25, style=filled, fillcolor=Turquoise, tooltip='specific kind of data', URL='#hdbscan-binary']
   Metric_data     [shape=circle, label='Metric data', fontname='FreeSans', fontsize=25, style=filled, fillcolor=Turquoise, tooltip='specific kind of data', URL='#hdbscan-metric-data']
   Categorical_data     [shape=circle, label='Categorical data', fontname='FreeSans', fontsize=25, style=filled, fillcolor=Turquoise, tooltip='specific kind of data', URL='#hdbscan-categorical-data']
   Ranked_analysis     [shape=circle, label='Ranked data', fontname='FreeSans', fontsize=25, style=filled, fillcolor=Turquoise, tooltip='specific kind of data', URL='#hdbscan-ranked-data']
   Michelsberg     [shape=circle, label='Michelsberg', fontname='FreeSans', fontsize=25, style=filled, fillcolor=Turquoise, tooltip='dataframe']
   PitHouse     [shape=circle, label='PitHouse', fontname='FreeSans', fontsize=25, style=filled, fillcolor=Turquoise, tooltip='dataframe']
   Fibulae     [shape=circle, label='Fibulae', fontname='FreeSans', fontsize=25, style=filled, fillcolor=Turquoise, tooltip='dataframe']
   Fibulae_HDB     [shape=diamond, label='HDB scan result', fontname='FreeSans', fontsize=30, style=filled, fillcolor=White, tooltip='HDB result']
   DartPoints     [shape=circle, label='DartPoints', fontname='FreeSans', fontsize=25, style=filled, fillcolor=Turquoise, tooltip='dataframe']
   newdf1     [shape=circle, label='newdf', fontname='FreeSans', fontsize=25, style=filled, fillcolor=Turquoise, tooltip='dataframe']
   newdf2     [shape=circle, label='newdf', fontname='FreeSans', fontsize=25, style=filled, fillcolor=Turquoise, tooltip='dataframe']
   newdf3     [shape=circle, label='newdf', fontname='FreeSans', fontsize=25, style=filled, fillcolor=Turquoise, tooltip='dataframe']
   newdf4     [shape=circle, label='newdf', fontname='FreeSans', fontsize=25, style=filled, fillcolor=Turquoise, tooltip='dataframe']
   newdf5     [shape=circle, label='newdf', fontname='FreeSans', fontsize=25, style=filled, fillcolor=Turquoise, tooltip='dataframe']
   Michel_SM     [shape=circle, label='Michelsberg_simplematching', fontname='FreeSans', fontsize=25, style=filled, fillcolor=Turquoise, tooltip='Simple matching result']
   Michel_Jacc     [shape=circle, label='Michelsberg_Jaccard_coeff', fontname='FreeSans', fontsize=25, style=filled, fillcolor=Turquoise, tooltip='Jaccard coefficient result']
   Michel_Och     [shape=circle, label='Michelsberg_Ochiai_index', fontname='FreeSans', fontsize=25, style=filled, fillcolor=Turquoise, tooltip='Ochiai index result']
   DartPoints_hamming     [shape=circle, label='DartPoints_hamming', fontname='FreeSans', fontsize=25, style=filled, fillcolor=Turquoise, tooltip='Hamming distance result', URL='#hdbscan-categorical-hamming']
   PitHouse_gower     [shape=circle, label='PitHouse_gower', fontname='FreeSans', fontsize=25, style=filled, fillcolor=Turquoise, tooltip='Gower distance result', URL='#hdbscan-ranked-gower']
   Fibulae_Euclidean     [shape=circle, label='Fibulae_Euclidean', fontname='FreeSans', fontsize=25, style=filled, fillcolor=Turquoise, tooltip='Gower distance result', URL='#hdbscan-metric-euclidean']

   // Prozess/Methoden
   insert     [shape=oval, label='choose example data', fontname='FreeSans', fontsize=25, style=filled, fillcolor=orange, tooltip='directly insert data and make a dataframe']
   transform2coordinates     [shape=oval, label='transform into a coordinate dataset', fontname='FreeSans', fontsize=25, style=filled, fillcolor=orange, tooltip = 'extract spatial information']
   remove_duplicates     [shape=oval, label='remove duplicates', fontname='FreeSans', fontsize=25, style=filled, fillcolor=orange, tooltip='remove duplicate values']
   HDB_hierarchy     [shape=oval, label='generate HDB dendrogram', fontname='FreeSans', fontsize=25, style=filled, fillcolor=orange, tooltip = 'examine hierarchy of dataframe']
   HDB_clusters     [shape=oval, label='cluster selection', fontname='FreeSans', fontsize=25, style=filled, fillcolor=orange, tooltip = 'select the most suitable clusters']
   HDB_application     [shape=oval, label= 'apply clustering', fontname='FreeSans', fontsize=25, style=filled, fillcolor=orange, tooltip = 'apply the classification to the dataset']
   transform2binary        [shape=oval, label= 'transform into \n a binary dataset', fontname='FreeSans',fontsize=25, style=filled, fillcolor=orange, tooltip = 'modify all count values into presence values = 1']
   transform2categorical        [shape=oval, label= 'transform into a categorical dataset', fontname='FreeSans',fontsize=25, style=filled, fillcolor=orange, tooltip = 'remove all metric values']
   transform2ranked        [shape=oval, label= 'transform into a ranked dataset', fontname='FreeSans',fontsize=25, style=filled, fillcolor=orange, tooltip = 'from categorical to ranked']
   scale_variables        [shape=oval, label= 'scale variables', fontname='FreeSans',fontsize=25, style=filled, fillcolor=orange, tooltip = 'scale the variables']
   calculate_ca            [shape=oval, label= 'calculate correspondence analysis', fontname='FreeSans',fontsize=25, style=filled, fillcolor=orange, tooltip = 'Correspondence Analysis']
   extract_coordinates     [shape=oval, label= 'extract CA coordinates', fontname='FreeSans',fontsize=25, style=filled, fillcolor=orange, tooltip = 'using the xy for further analyses']
   calculate_simplematching     [shape=oval, label= 'calculate \n simple matching', fontname='FreeSans',fontsize=25, style=filled, fillcolor=orange, tooltip = 'simple matching alogorithm', URL='#hdbscan-binary-simple-matching-distance']
   calculate_HDB     [shape=oval, label= 'calculate HDB', fontname='FreeSans',fontsize=25, style=filled, fillcolor=orange, tooltip = 'HDB scan']
   calculate_hierarchy     [shape=oval, label= 'calculate hierarchy', fontname='FreeSans',fontsize=25, style=filled, fillcolor=orange, tooltip = 'HDB scan']
   apply_classification     [shape=oval, label= 'apply classification', fontname='FreeSans',fontsize=25, style=filled, fillcolor=orange, tooltip = 'CA with HDB classification']
   calculate_jaccardindex     [shape=oval, label= 'calculate \n Jaccard coeff', fontname='FreeSans',fontsize=25, style=filled, fillcolor=orange, tooltip = '', URL='#hdbscan-binary-jaccard']
   calculate_ochiaiindex     [shape=oval, label= 'calculate \n Ochiai index', fontname='FreeSans',fontsize=25, style=filled, fillcolor=orange, tooltip = '', URL='#hdbscan-binary-ochiai']
   calculate_hamming     [shape=oval, label= 'calculate Hamming distance', fontname='FreeSans',fontsize=25, style=filled, fillcolor=orange, tooltip = '']
   calculate_gower     [shape=oval, label= 'calculate Gower distance', fontname='FreeSans',fontsize=25, style=filled, fillcolor=orange, tooltip = '']
   calculate_euclidean     [shape=oval, label= 'calculate Euclidean distance', fontname='FreeSans',fontsize=25, style=filled, fillcolor=orange, tooltip = '']

   // KantenDatenfluss
   HDB_scan -> Spatial_analysis
   HDB_scan -> Binary_data
   HDB_scan -> Categorical_data
   HDB_scan -> Ranked_analysis
   HDB_scan -> Metric_data
   Metric_data -> insert
   Spatial_analysis -> insert
   Binary_data -> insert
   Categorical_data -> insert
   Ranked_analysis -> insert
   insert -> Michelsberg
   insert -> DartPoints
   insert -> PitHouse
   insert -> Fibulae
   Fibulae -> scale_variables
   scale_variables -> newdf5
   newdf5 -> calculate_euclidean
   calculate_euclidean -> Fibulae_Euclidean
   Fibulae_Euclidean -> calculate_HDB
   Michelsberg -> transform2coordinates
   DartPoints -> transform2categorical
   PitHouse -> transform2ranked
   transform2ranked -> newdf4
   newdf4 -> calculate_gower
   calculate_gower -> PitHouse_gower
   PitHouse_gower -> calculate_HDB
   transform2categorical  -> newdf3
   newdf3 -> calculate_hamming
   calculate_hamming -> DartPoints_hamming
   DartPoints_hamming -> calculate_HDB
   transform2coordinates -> remove_duplicates
   remove_duplicates -> newdf1
   newdf1 -> HDB_hierarchy
   HDB_hierarchy -> HDB_clusters
   HDB_clusters -> HDB_application
   HDB_application -> Fibulae_HDB
   Michelsberg -> transform2binary
   transform2binary -> newdf2
   newdf2 -> calculate_ca
   calculate_ca -> extract_coordinates
   extract_coordinates -> calculate_simplematching
   calculate_simplematching -> Michel_SM
   Michel_SM -> calculate_HDB
   calculate_HDB -> calculate_hierarchy
   calculate_hierarchy -> apply_classification
   apply_classification -> Fibulae_HDB
   newdf2 -> calculate_jaccardindex
   calculate_jaccardindex -> Michel_Jacc
   Michel_Jacc -> calculate_HDB
   calculate_HDB -> calculate_hierarchy
   calculate_hierarchy -> apply_classification
   apply_classification -> Fibulae_HDB
   newdf2 -> calculate_ochiaiindex
   calculate_ochiaiindex -> Michel_Och
   Michel_Och -> calculate_HDB
   calculate_HDB -> calculate_hierarchy
   calculate_hierarchy -> apply_classification
   apply_classification -> Fibulae_HDB
   calculate_HDB -> calculate_hierarchy
   calculate_hierarchy -> apply_classification

      
   // subgraph
   subgraph {rank = same; Spatial_analysis;Binary_data;Categorical_data;Ranked_analysis}
   subgraph {rank = same; insert;}
   subgraph {rank = same; Michelsberg;DartPoints;PitHouse}
   subgraph {rank = same; transform2coordinates;transform2binary;transform2categorical;transform2ranked}
   subgraph {rank = same; newdf1;newdf2;newdf3;newdf4; newdf5}
   subgraph {rank = same; calculate_simplematching; calculate_jaccardindex; calculate_ochiaiindex;calculate_hamming;calculate_gower; calculate_euclidean}
   subgraph {rank = same; Michel_SM;Michel_Jacc;Michel_Och; PitHouse_gower; Fibulae_Euclidean}
   
      }