c_system;id;p_id;c_level;c_order;datstring;name_short;name_long;start;end;description
fortNE;1;0;1;1;fortNE_Vorg;Vorg;Vorgeschichte;-1800;1050;
fortNE;2;1;2;1;fortNE_Vorg>BZ;BZ;Bronzezeit;-1800;-950;
fortNE;3;2;3;1;fortNE_Vorg>BZ>aeltereBZ;aeltereBZ;;-1800;-1100;
fortNE;4;3;4;1;fortNE_Vorg>BZ>aeltereBZ>PerI;PerI;Periode I;-1800;-1500;
fortNE;5;3;4;2;fortNE_Vorg>BZ>aeltereBZ>PerII;PerII;Periode II;-1500;-1300;
fortNE;6;3;4;3;fortNE_Vorg>BZ>aeltereBZ>PerIII;PerIII;Periode III;-1300;-1100;
fortNE;7;2;3;2;fortNE_Vorg>BZ>PerI>juengereBZ;juengereBZ;;-1100;-750;
fortNE;8;7;4;4;fortNE_Vorg>BZ>PerI>juengereBZ>PerIV;PerIV;Periode IV;-1100;-950;Ha B1-Ha B2 
fortNE;9;7;4;5;fortNE_Vorg>BZ>PerI>juengereBZ>PerV;PerV;Periode V;-950;-750;Ha B3 Kneisel B3-C1 850-725 
fortNE;10;1;2;2;fortNE_Vorg>EZ;EZ;Eisenzeit;-750;1050;
fortNE;11;10;3;1;fortNE_Vorg>EZ>PRIA;PRIA;Pre-Roman Iron Age ;-750;0;
fortNE;12;11;4;1;fortNE_Vorg>EZ>PRIA>PRIA-I;PRIA-I;PRIA_I;-750;-250;
fortNE;13;12;5;1;fortNE_Vorg>EZ>PRIA>PRIA-I>PerVI;PerVI;Periode VI;-750;-525; = ha c ha D1, Hingst Ia, Nortmann Horizont 1, wessenstedt kneisel
fortNE;14;12;5;2;fortNE_Vorg>EZ>PRIA>PRIA-I>PRIA-IA;PRIA-IA;PRIA_IA ;-525;-450;"Hingst Ib-Ic1; Ha D2-Ha D3; Nortmann Horizont 2; lt Eichfeld: Harck 1a = Heynowski Wendelring d = Ha D1 und Harck 1b = Ha D2 und Harck 1c = Ha D3 und Lt A"
fortNE;15;12;5;3;fortNE_Vorg>EZ>PRIA>PRIA-I>PRIA-IB;PRIA-IB;PRIA_IB;-450;-250;"Hingst Ic2-Id; Nortmann Horizont 3-4; lt Eichfeld: Harck 1d = Lt B"
fortNE;16;15;6;1;fortNE_Vorg>EZ>PRIA>PRIA-I>PRIA-IB>aelterPRIA-Ib;PRIA-Ibaelter;Ältere PRIA_IB;-450;-350;"Martens/Hingst; = Hingst Ic-Id; Lt A-LtB1 "
fortNE;17;15;6;2;fortNE_Vorg>EZ>PRIA>PRIA-I>PRIA-IB>juengerPRIA-Ib;PRIA-Ibjuenger;Jüngere PRIA_IB ;-350;-250;"Martens/Hingst; = Hingst Id; Lt B1-B2 "
fortNE;18;11;4;2;fortNE_Vorg>EZ>PRIA>PRIA-II;PRIA-II;PRIA_II;-250;0;"Hingst II; Nortmann Horizont 5"
fortNE;19;18;5;1;fortNE_Vorg>EZ>PRIA>PRIA-II>PRIA-IIA;PRIA-IIA;PRIA_IIA ;-250;-200;Hingst IIa, Hingst = Lt C1 
fortNE;20;18;5;2;fortNE_Vorg>EZ>PRIA>PRIA-II>PRIA-IIB;PRIA-IIB;PRIA_IIB ;-200;-80;Hingst IIb, Hingst = Lt C2- 200-80 
fortNE;21;18;5;3;fortNE_Vorg>EZ>PRIA>PRIA-II>PRIA-IIC;PRIA-IIC;PRIA_IIC ;-80;-50;Hingst IIc, 
fortNE;22;18;5;4;fortNE_Vorg>EZ>PRIA>PRIA-II>PRIA-IID;PRIA-IID;PRIA_IID ;-50;0;Hingst IId, 
fortNE;23;10;3;3;fortNE_Vorg>EZ>RKZ;RKZ;Römische Kaiserzeit;0;375;
