<?xml version="1.0" encoding="UTF-8" standalone="no"?>
<!-- Created with Inkscape (http://www.inkscape.org/) -->

<svg
   xmlns:dc="http://purl.org/dc/elements/1.1/"
   xmlns:cc="http://creativecommons.org/ns#"
   xmlns:rdf="http://www.w3.org/1999/02/22-rdf-syntax-ns#"
   xmlns:svg="http://www.w3.org/2000/svg"
   xmlns="http://www.w3.org/2000/svg"
   xmlns:sodipodi="http://sodipodi.sourceforge.net/DTD/sodipodi-0.dtd"
   xmlns:inkscape="http://www.inkscape.org/namespaces/inkscape"
   width="399.70447"
   height="258.57172"
   id="svg3275"
   sodipodi:version="0.32"
   inkscape:version="0.48.4 r9939"
   sodipodi:docname="pyramide3.svg"
   inkscape:output_extension="org.inkscape.output.svg.inkscape"
   version="1.1"
   inkscape:export-filename="/home/fon/daten/bilder/chrono/pyramide3.png"
   inkscape:export-xdpi="300"
   inkscape:export-ydpi="300">
  <defs
     id="defs3277">
    <inkscape:perspective
       sodipodi:type="inkscape:persp3d"
       inkscape:vp_x="0 : 526.18109 : 1"
       inkscape:vp_y="0 : 1000 : 0"
       inkscape:vp_z="744.09448 : 526.18109 : 1"
       inkscape:persp3d-origin="372.04724 : 350.78739 : 1"
       id="perspective3283" />
    <inkscape:perspective
       id="perspective3403"
       inkscape:persp3d-origin="372.04724 : 350.78739 : 1"
       inkscape:vp_z="744.09448 : 526.18109 : 1"
       inkscape:vp_y="0 : 1000 : 0"
       inkscape:vp_x="0 : 526.18109 : 1"
       sodipodi:type="inkscape:persp3d" />
  </defs>
  <sodipodi:namedview
     id="base"
     pagecolor="#ffffff"
     bordercolor="#666666"
     borderopacity="1.0"
     inkscape:pageopacity="0.0"
     inkscape:pageshadow="2"
     inkscape:zoom="0.97071711"
     inkscape:cx="169.15642"
     inkscape:cy="-1.9511373"
     inkscape:document-units="px"
     inkscape:current-layer="layer1"
     showgrid="false"
     showguides="true"
     inkscape:guide-bbox="true"
     inkscape:window-width="1064"
     inkscape:window-height="732"
     inkscape:window-x="8"
     inkscape:window-y="27"
     inkscape:window-maximized="0"
     fit-margin-top="0"
     fit-margin-left="0"
     fit-margin-right="0"
     fit-margin-bottom="0" />
  <metadata
     id="metadata3280">
    <rdf:RDF>
      <cc:Work
         rdf:about="">
        <dc:format>image/svg+xml</dc:format>
        <dc:type
           rdf:resource="http://purl.org/dc/dcmitype/StillImage" />
        <dc:title></dc:title>
      </cc:Work>
    </rdf:RDF>
  </metadata>
  <g
     inkscape:label="Ebene 1"
     inkscape:groupmode="layer"
     id="layer1"
     transform="translate(-189.55058,-43.829426)">
    <rect
       style="fill:#ffffff"
       id="rect5195"
       width="399.70447"
       height="258.57172"
       x="189.55058"
       y="43.829426" />
    <rect
       style="font-weight:bold;fill:#e6e6e6;fill-opacity:1;stroke:#000000;stroke-width:1.75902581;stroke-linecap:round;stroke-miterlimit:4;stroke-opacity:1;stroke-dasharray:none;-inkscape-font-specification:Bitstream Vera Sans Bold"
       id="rect4964"
       width="35.581223"
       height="22.939196"
       x="214.05742"
       y="264.54443" />
    <rect
       style="font-weight:bold;fill:#e6e6e6;fill-opacity:1;stroke:#000000;stroke-width:1.75902581;stroke-linecap:round;stroke-miterlimit:4;stroke-opacity:1;stroke-dasharray:none;-inkscape-font-specification:Bitstream Vera Sans Bold"
       id="rect4966"
       width="35.581223"
       height="22.939196"
       x="249.29195"
       y="264.54443" />
    <rect
       style="font-weight:bold;fill:#e6e6e6;fill-opacity:1;stroke:#000000;stroke-width:1.75902581;stroke-linecap:round;stroke-miterlimit:4;stroke-opacity:1;stroke-dasharray:none;-inkscape-font-specification:Bitstream Vera Sans Bold"
       id="rect4968"
       width="35.581223"
       height="22.939196"
       x="284.52643"
       y="264.54443" />
    <rect
       style="font-weight:bold;fill:#e6e6e6;fill-opacity:1;stroke:#000000;stroke-width:1.75902581;stroke-linecap:round;stroke-miterlimit:4;stroke-opacity:1;stroke-dasharray:none;-inkscape-font-specification:Bitstream Vera Sans Bold"
       id="rect4970"
       width="35.581223"
       height="22.939196"
       x="319.76096"
       y="264.54443" />
    <rect
       style="font-weight:bold;fill:#e6e6e6;fill-opacity:1;stroke:#000000;stroke-width:1.75902581;stroke-linecap:round;stroke-miterlimit:4;stroke-opacity:1;stroke-dasharray:none;-inkscape-font-specification:Bitstream Vera Sans Bold"
       id="rect4972"
       width="35.581223"
       height="22.939196"
       x="354.99551"
       y="264.54443" />
    <rect
       style="font-weight:bold;fill:#e6e6e6;fill-opacity:1;stroke:#000000;stroke-width:1.75902581;stroke-linecap:round;stroke-miterlimit:4;stroke-opacity:1;stroke-dasharray:none;-inkscape-font-specification:Bitstream Vera Sans Bold"
       id="rect4974"
       width="35.581223"
       height="22.939196"
       x="390.23004"
       y="264.54443" />
    <rect
       style="font-weight:bold;fill:#e6e6e6;fill-opacity:1;stroke:#000000;stroke-width:1.75902581;stroke-linecap:round;stroke-miterlimit:4;stroke-opacity:1;stroke-dasharray:none;-inkscape-font-specification:Bitstream Vera Sans Bold"
       id="rect4976"
       width="35.581223"
       height="22.939196"
       x="425.46454"
       y="264.54443" />
    <rect
       style="font-weight:bold;fill:#e6e6e6;fill-opacity:1;stroke:#000000;stroke-width:1.75902581;stroke-linecap:round;stroke-miterlimit:4;stroke-opacity:1;stroke-dasharray:none;-inkscape-font-specification:Bitstream Vera Sans Bold"
       id="rect4978"
       width="35.581223"
       height="22.939196"
       x="460.69913"
       y="264.54443" />
    <rect
       style="font-weight:bold;fill:#e6e6e6;fill-opacity:1;stroke:#000000;stroke-width:1.75902581;stroke-linecap:round;stroke-miterlimit:4;stroke-opacity:1;stroke-dasharray:none;-inkscape-font-specification:Bitstream Vera Sans Bold"
       id="rect4980"
       width="35.581223"
       height="22.939196"
       x="495.93362"
       y="264.54443" />
    <text
       xml:space="preserve"
       style="font-size:10px;font-style:normal;font-weight:bold;fill:#000000;fill-opacity:1;stroke:none;font-family:Bitstream Vera Sans;-inkscape-font-specification:Bitstream Vera Sans Bold"
       x="217.28966"
       y="280.38309"
       id="text4982"><tspan
         sodipodi:role="line"
         id="tspan4984"
         x="217.28966"
         y="280.38309">HaC0</tspan></text>
    <text
       xml:space="preserve"
       style="font-size:10px;font-style:normal;font-weight:bold;fill:#000000;fill-opacity:1;stroke:none;font-family:Bitstream Vera Sans;-inkscape-font-specification:Bitstream Vera Sans Bold"
       x="252.30379"
       y="280.38309"
       id="text4986"><tspan
         sodipodi:role="line"
         id="tspan4988"
         x="252.30379"
         y="280.38309">HaC1</tspan></text>
    <text
       xml:space="preserve"
       style="font-size:10px;font-style:normal;font-weight:bold;fill:#000000;fill-opacity:1;stroke:none;font-family:Bitstream Vera Sans;-inkscape-font-specification:Bitstream Vera Sans Bold"
       x="287.61578"
       y="280.38309"
       id="text4990"><tspan
         sodipodi:role="line"
         id="tspan4992"
         x="287.61578"
         y="280.38309">HaC2</tspan></text>
    <text
       xml:space="preserve"
       style="font-size:10px;font-style:normal;font-weight:bold;fill:#000000;fill-opacity:1;stroke:none;font-family:Bitstream Vera Sans;-inkscape-font-specification:Bitstream Vera Sans Bold"
       x="322.36871"
       y="280.38309"
       id="text4994"><tspan
         sodipodi:role="line"
         id="tspan4996"
         x="322.36871"
         y="280.38309">HaD1</tspan></text>
    <text
       xml:space="preserve"
       style="font-size:10px;font-style:normal;font-weight:bold;fill:#000000;fill-opacity:1;stroke:none;font-family:Bitstream Vera Sans;-inkscape-font-specification:Bitstream Vera Sans Bold"
       x="357.55133"
       y="280.38309"
       id="text4998"><tspan
         sodipodi:role="line"
         id="tspan5000"
         x="357.55133"
         y="280.38309">HaD2</tspan></text>
    <text
       xml:space="preserve"
       style="font-size:10px;font-style:normal;font-weight:bold;fill:#000000;fill-opacity:1;stroke:none;font-family:Bitstream Vera Sans;-inkscape-font-specification:Bitstream Vera Sans Bold"
       x="392.59479"
       y="280.38309"
       id="text5002"><tspan
         sodipodi:role="line"
         id="tspan5004"
         x="392.59479"
         y="280.38309">HaD3</tspan></text>
    <text
       xml:space="preserve"
       style="font-size:10px;font-style:normal;font-weight:bold;fill:#000000;fill-opacity:1;stroke:none;font-family:Bitstream Vera Sans;-inkscape-font-specification:Bitstream Vera Sans Bold"
       x="430.30914"
       y="280.52469"
       id="text5006"><tspan
         sodipodi:role="line"
         id="tspan5008"
         x="430.30914"
         y="280.52469">LtA1</tspan></text>
    <text
       xml:space="preserve"
       style="font-size:10px;font-style:normal;font-weight:bold;fill:#000000;fill-opacity:1;stroke:none;font-family:Bitstream Vera Sans;-inkscape-font-specification:Bitstream Vera Sans Bold"
       x="465.49176"
       y="280.52469"
       id="text5010"><tspan
         sodipodi:role="line"
         id="tspan5012"
         x="465.49176"
         y="280.52469">LtA2</tspan></text>
    <text
       xml:space="preserve"
       style="font-size:10px;font-style:normal;font-weight:bold;fill:#000000;fill-opacity:1;stroke:none;font-family:Bitstream Vera Sans;-inkscape-font-specification:Bitstream Vera Sans Bold"
       x="500.58652"
       y="280.52469"
       id="text5014"><tspan
         sodipodi:role="line"
         id="tspan5016"
         x="500.58652"
         y="280.52469">LtB1</tspan></text>
    <rect
       style="font-weight:bold;fill:#e6e6e6;fill-opacity:1;stroke:#000000;stroke-width:1.75902581;stroke-linecap:round;stroke-miterlimit:4;stroke-opacity:1;stroke-dasharray:none;-inkscape-font-specification:Bitstream Vera Sans Bold"
       id="rect5018"
       width="35.581223"
       height="22.939196"
       x="531.2464"
       y="264.43951" />
    <text
       xml:space="preserve"
       style="font-size:10px;font-style:normal;font-weight:bold;fill:#000000;fill-opacity:1;stroke:none;font-family:Bitstream Vera Sans;-inkscape-font-specification:Bitstream Vera Sans Bold"
       x="535.7691"
       y="280.52469"
       id="text5020"><tspan
         sodipodi:role="line"
         id="tspan5022"
         x="535.7691"
         y="280.52469">LtB2</tspan></text>
    <rect
       style="font-size:8px;fill:none;stroke:#000000;stroke-width:1.75902581;stroke-linecap:round;stroke-miterlimit:4;stroke-opacity:1;stroke-dasharray:none"
       id="rect5024"
       width="35.581223"
       height="22.939196"
       x="231.8719"
       y="241.54895" />
    <rect
       style="font-size:8px;fill:none;stroke:#000000;stroke-width:1.75902581;stroke-linecap:round;stroke-miterlimit:4;stroke-opacity:1;stroke-dasharray:none"
       id="rect5026"
       width="35.581223"
       height="22.939196"
       x="267.10641"
       y="241.54895" />
    <rect
       style="font-size:8px;fill:none;stroke:#000000;stroke-width:1.75902581;stroke-linecap:round;stroke-miterlimit:4;stroke-opacity:1;stroke-dasharray:none"
       id="rect5028"
       width="35.581223"
       height="22.939196"
       x="302.34091"
       y="241.54895" />
    <rect
       style="font-size:8px;fill:none;stroke:#000000;stroke-width:1.75902581;stroke-linecap:round;stroke-miterlimit:4;stroke-opacity:1;stroke-dasharray:none"
       id="rect5030"
       width="35.581223"
       height="22.939196"
       x="337.57544"
       y="241.54895" />
    <rect
       style="font-size:8px;fill:none;stroke:#000000;stroke-width:1.75902581;stroke-linecap:round;stroke-miterlimit:4;stroke-opacity:1;stroke-dasharray:none"
       id="rect5032"
       width="35.581223"
       height="22.939196"
       x="372.81"
       y="241.54895" />
    <rect
       style="font-size:8px;fill:none;stroke:#000000;stroke-width:1.75902581;stroke-linecap:round;stroke-miterlimit:4;stroke-opacity:1;stroke-dasharray:none"
       id="rect5034"
       width="35.581223"
       height="22.939196"
       x="408.04453"
       y="241.54895" />
    <rect
       style="font-size:8px;fill:#e6e6e6;fill-opacity:1;stroke:#000000;stroke-width:1.75902581;stroke-linecap:round;stroke-miterlimit:4;stroke-opacity:1;stroke-dasharray:none"
       id="rect5036"
       width="35.581223"
       height="22.939196"
       x="443.27902"
       y="241.54895" />
    <rect
       style="font-size:8px;fill:none;stroke:#000000;stroke-width:1.75902581;stroke-linecap:round;stroke-miterlimit:4;stroke-opacity:1;stroke-dasharray:none"
       id="rect5038"
       width="35.581223"
       height="22.939196"
       x="478.51361"
       y="241.54895" />
    <rect
       style="font-size:8px;fill:#e6e6e6;fill-opacity:1;stroke:#000000;stroke-width:1.75902581;stroke-linecap:round;stroke-miterlimit:4;stroke-opacity:1;stroke-dasharray:none"
       id="rect5040"
       width="35.581223"
       height="22.939196"
       x="513.74811"
       y="241.54895" />
    <text
       xml:space="preserve"
       style="font-size:8px;font-style:normal;font-weight:normal;fill:#000000;fill-opacity:1;stroke:none;font-family:Bitstream Vera Sans"
       x="239.10414"
       y="251.38757"
       id="text5042"><tspan
         sodipodi:role="line"
         id="tspan5044"
         x="239.10414"
         y="251.38757">HaC0</tspan></text>
    <text
       xml:space="preserve"
       style="font-size:8px;font-style:normal;font-weight:normal;fill:#000000;fill-opacity:1;stroke:none;font-family:Bitstream Vera Sans"
       x="274.11826"
       y="251.38757"
       id="text5046"><tspan
         sodipodi:role="line"
         id="tspan5048"
         x="274.11826"
         y="251.38757">HaC1</tspan></text>
    <text
       xml:space="preserve"
       style="font-size:8px;font-style:normal;font-weight:normal;fill:#000000;fill-opacity:1;stroke:none;font-family:Bitstream Vera Sans"
       x="309.43027"
       y="251.38757"
       id="text5050"><tspan
         sodipodi:role="line"
         id="tspan5052"
         x="309.43027"
         y="251.38757">HaC2</tspan></text>
    <text
       xml:space="preserve"
       style="font-size:8px;font-style:normal;font-weight:normal;fill:#000000;fill-opacity:1;stroke:none;font-family:Bitstream Vera Sans"
       x="344.1832"
       y="251.38757"
       id="text5054"><tspan
         sodipodi:role="line"
         id="tspan5056"
         x="344.1832"
         y="251.38757">HaD1</tspan></text>
    <text
       xml:space="preserve"
       style="font-size:8px;font-style:normal;font-weight:normal;fill:#000000;fill-opacity:1;stroke:none;font-family:Bitstream Vera Sans"
       x="379.36581"
       y="251.38757"
       id="text5058"><tspan
         sodipodi:role="line"
         id="tspan5060"
         x="379.36581"
         y="251.38757">HaD2</tspan></text>
    <text
       xml:space="preserve"
       style="font-size:8px;font-style:normal;font-weight:normal;fill:#000000;fill-opacity:1;stroke:none;font-family:Bitstream Vera Sans"
       x="414.40927"
       y="251.38757"
       id="text5062"><tspan
         sodipodi:role="line"
         id="tspan5064"
         x="414.40927"
         y="251.38757">HaD3</tspan></text>
    <text
       xml:space="preserve"
       style="font-size:8px;font-style:normal;font-weight:normal;fill:#000000;fill-opacity:1;stroke:none;font-family:Bitstream Vera Sans"
       x="452.12363"
       y="251.52917"
       id="text5066"><tspan
         sodipodi:role="line"
         id="tspan5068"
         x="452.12363"
         y="251.52917"
         style="font-weight:bold;-inkscape-font-specification:Bitstream Vera Sans Bold">LtA1</tspan></text>
    <text
       xml:space="preserve"
       style="font-size:8px;font-style:normal;font-weight:normal;fill:#000000;fill-opacity:1;stroke:none;font-family:Bitstream Vera Sans"
       x="487.30624"
       y="251.52917"
       id="text5070"><tspan
         sodipodi:role="line"
         id="tspan5072"
         x="487.30624"
         y="251.52917">LtA2</tspan></text>
    <text
       xml:space="preserve"
       style="font-size:8px;font-style:normal;font-weight:normal;fill:#000000;fill-opacity:1;stroke:none;font-family:Bitstream Vera Sans"
       x="522.401"
       y="251.52917"
       id="text5074"><tspan
         sodipodi:role="line"
         id="tspan5076"
         x="522.401"
         y="251.52917"
         style="font-weight:bold;-inkscape-font-specification:Bitstream Vera Sans Bold">LtB1</tspan></text>
    <text
       xml:space="preserve"
       style="font-size:8px;font-style:normal;font-weight:normal;fill:#000000;fill-opacity:1;stroke:none;font-family:Bitstream Vera Sans"
       x="239.03726"
       y="259.78149"
       id="text5078"><tspan
         sodipodi:role="line"
         id="tspan5080"
         x="239.03726"
         y="259.78149">+1</tspan></text>
    <text
       xml:space="preserve"
       style="font-size:8px;font-style:normal;font-weight:normal;fill:#000000;fill-opacity:1;stroke:none;font-family:Bitstream Vera Sans"
       x="274.05139"
       y="259.78149"
       id="text5082"><tspan
         sodipodi:role="line"
         id="tspan5084"
         x="274.05139"
         y="259.78149">+1</tspan></text>
    <text
       xml:space="preserve"
       style="font-size:8px;font-style:normal;font-weight:normal;fill:#000000;fill-opacity:1;stroke:none;font-family:Bitstream Vera Sans"
       x="309.3634"
       y="259.78149"
       id="text5086"><tspan
         sodipodi:role="line"
         id="tspan5088"
         x="309.3634"
         y="259.78149">+1</tspan></text>
    <text
       xml:space="preserve"
       style="font-size:8px;font-style:normal;font-weight:normal;fill:#000000;fill-opacity:1;stroke:none;font-family:Bitstream Vera Sans"
       x="344.11633"
       y="259.78149"
       id="text5090"><tspan
         sodipodi:role="line"
         id="tspan5092"
         x="344.11633"
         y="259.78149">+1</tspan></text>
    <text
       xml:space="preserve"
       style="font-size:8px;font-style:normal;font-weight:normal;fill:#000000;fill-opacity:1;stroke:none;font-family:Bitstream Vera Sans"
       x="379.29895"
       y="259.78149"
       id="text5094"><tspan
         sodipodi:role="line"
         id="tspan5096"
         x="379.29895"
         y="259.78149">+1</tspan></text>
    <text
       xml:space="preserve"
       style="font-size:8px;font-style:normal;font-weight:normal;fill:#000000;fill-opacity:1;stroke:none;font-family:Bitstream Vera Sans"
       x="414.34241"
       y="259.78149"
       id="text5098"><tspan
         sodipodi:role="line"
         id="tspan5100"
         x="414.34241"
         y="259.78149">+1</tspan></text>
    <text
       xml:space="preserve"
       style="font-size:8px;font-style:normal;font-weight:normal;fill:#000000;fill-opacity:1;stroke:none;font-family:Bitstream Vera Sans"
       x="452.05676"
       y="259.9231"
       id="text5102"><tspan
         sodipodi:role="line"
         id="tspan5104"
         x="452.05676"
         y="259.9231"
         style="font-weight:bold;-inkscape-font-specification:Bitstream Vera Sans Bold">+1</tspan></text>
    <text
       xml:space="preserve"
       style="font-size:8px;font-style:normal;font-weight:normal;fill:#000000;fill-opacity:1;stroke:none;font-family:Bitstream Vera Sans"
       x="487.23935"
       y="259.9231"
       id="text5106"><tspan
         sodipodi:role="line"
         id="tspan5108"
         x="487.23935"
         y="259.9231">+1</tspan></text>
    <rect
       style="font-size:8px;fill:#e6e6e6;fill-opacity:1;stroke:#000000;stroke-width:1.75902581;stroke-linecap:round;stroke-miterlimit:4;stroke-opacity:1;stroke-dasharray:none"
       id="rect5110"
       width="35.581223"
       height="22.939196"
       x="249.08681"
       y="218.49377" />
    <rect
       style="font-size:8px;fill:none;stroke:#000000;stroke-width:1.75902581;stroke-linecap:round;stroke-miterlimit:4;stroke-opacity:1;stroke-dasharray:none"
       id="rect5112"
       width="35.581223"
       height="22.939196"
       x="284.32132"
       y="218.49377" />
    <rect
       style="font-size:8px;fill:none;stroke:#000000;stroke-width:1.75902581;stroke-linecap:round;stroke-miterlimit:4;stroke-opacity:1;stroke-dasharray:none"
       id="rect5114"
       width="35.581223"
       height="22.939196"
       x="319.55582"
       y="218.49377" />
    <rect
       style="font-size:8px;fill:#e6e6e6;fill-opacity:1;stroke:#000000;stroke-width:1.75902581;stroke-linecap:round;stroke-miterlimit:4;stroke-opacity:1;stroke-dasharray:none"
       id="rect5116"
       width="35.581223"
       height="22.939196"
       x="354.79034"
       y="218.49377" />
    <rect
       style="font-size:8px;fill:none;stroke:#000000;stroke-width:1.75902581;stroke-linecap:round;stroke-miterlimit:4;stroke-opacity:1;stroke-dasharray:none"
       id="rect5118"
       width="35.581223"
       height="22.939196"
       x="390.0249"
       y="218.49377" />
    <rect
       style="font-size:8px;fill:none;stroke:#000000;stroke-width:1.75902581;stroke-linecap:round;stroke-miterlimit:4;stroke-opacity:1;stroke-dasharray:none"
       id="rect5120"
       width="35.581223"
       height="22.939196"
       x="425.25943"
       y="218.49377" />
    <rect
       style="font-size:8px;fill:none;stroke:#000000;stroke-width:1.75902581;stroke-linecap:round;stroke-miterlimit:4;stroke-opacity:1;stroke-dasharray:none"
       id="rect5122"
       width="35.581223"
       height="22.939196"
       x="460.49393"
       y="218.49377" />
    <rect
       style="font-size:8px;fill:none;stroke:#000000;stroke-width:1.75902581;stroke-linecap:round;stroke-miterlimit:4;stroke-opacity:1;stroke-dasharray:none"
       id="rect5124"
       width="35.581223"
       height="22.939196"
       x="495.72852"
       y="218.49377" />
    <text
       xml:space="preserve"
       style="font-size:8px;font-style:normal;font-weight:bold;fill:#000000;fill-opacity:1;stroke:none;font-family:Bitstream Vera Sans;-inkscape-font-specification:Bitstream Vera Sans Bold"
       x="256.31903"
       y="228.3324"
       id="text5126"><tspan
         sodipodi:role="line"
         id="tspan5128"
         x="256.31903"
         y="228.3324">HaC0</tspan></text>
    <text
       xml:space="preserve"
       style="font-size:8px;font-style:normal;font-weight:normal;fill:#000000;fill-opacity:1;stroke:none;font-family:Bitstream Vera Sans"
       x="291.33316"
       y="228.3324"
       id="text5130"><tspan
         sodipodi:role="line"
         id="tspan5132"
         x="291.33316"
         y="228.3324">HaC1</tspan></text>
    <text
       xml:space="preserve"
       style="font-size:8px;font-style:normal;font-weight:normal;fill:#000000;fill-opacity:1;stroke:none;font-family:Bitstream Vera Sans"
       x="326.64517"
       y="228.3324"
       id="text5134"><tspan
         sodipodi:role="line"
         id="tspan5136"
         x="326.64517"
         y="228.3324">HaC2</tspan></text>
    <text
       xml:space="preserve"
       style="font-size:8px;font-style:normal;font-weight:normal;fill:#000000;fill-opacity:1;stroke:none;font-family:Bitstream Vera Sans"
       x="361.3981"
       y="228.3324"
       id="text5138"><tspan
         sodipodi:role="line"
         id="tspan5140"
         x="361.3981"
         y="228.3324"
         style="font-weight:bold;-inkscape-font-specification:Bitstream Vera Sans Bold">HaD1</tspan></text>
    <text
       xml:space="preserve"
       style="font-size:8px;font-style:normal;font-weight:normal;fill:#000000;fill-opacity:1;stroke:none;font-family:Bitstream Vera Sans"
       x="396.58072"
       y="228.3324"
       id="text5142"><tspan
         sodipodi:role="line"
         id="tspan5144"
         x="396.58072"
         y="228.3324">HaD2</tspan></text>
    <text
       xml:space="preserve"
       style="font-size:8px;font-style:normal;font-weight:normal;fill:#000000;fill-opacity:1;stroke:none;font-family:Bitstream Vera Sans"
       x="431.62418"
       y="228.3324"
       id="text5146"><tspan
         sodipodi:role="line"
         id="tspan5148"
         x="431.62418"
         y="228.3324">HaD3</tspan></text>
    <text
       xml:space="preserve"
       style="font-size:8px;font-style:normal;font-weight:normal;fill:#000000;fill-opacity:1;stroke:none;font-family:Bitstream Vera Sans"
       x="469.33853"
       y="228.474"
       id="text5150"><tspan
         sodipodi:role="line"
         id="tspan5152"
         x="469.33853"
         y="228.474">LtA1</tspan></text>
    <text
       xml:space="preserve"
       style="font-size:8px;font-style:normal;font-weight:normal;fill:#000000;fill-opacity:1;stroke:none;font-family:Bitstream Vera Sans"
       x="504.52115"
       y="228.474"
       id="text5154"><tspan
         sodipodi:role="line"
         id="tspan5156"
         x="504.52115"
         y="228.474">LtA2</tspan></text>
    <text
       xml:space="preserve"
       style="font-size:8px;font-style:normal;font-weight:bold;fill:#000000;fill-opacity:1;stroke:none;font-family:Bitstream Vera Sans;-inkscape-font-specification:Bitstream Vera Sans Bold"
       x="256.25217"
       y="236.72632"
       id="text5158"><tspan
         sodipodi:role="line"
         id="tspan5160"
         x="256.25217"
         y="236.72632">+2</tspan></text>
    <text
       xml:space="preserve"
       style="font-size:8px;font-style:normal;font-weight:normal;fill:#000000;fill-opacity:1;stroke:none;font-family:Bitstream Vera Sans"
       x="291.2663"
       y="236.72632"
       id="text5162"><tspan
         sodipodi:role="line"
         id="tspan5164"
         x="291.2663"
         y="236.72632">+2</tspan></text>
    <text
       xml:space="preserve"
       style="font-size:8px;font-style:normal;font-weight:normal;fill:#000000;fill-opacity:1;stroke:none;font-family:Bitstream Vera Sans"
       x="326.57831"
       y="236.72632"
       id="text5166"><tspan
         sodipodi:role="line"
         id="tspan5168"
         x="326.57831"
         y="236.72632">+2</tspan></text>
    <text
       xml:space="preserve"
       style="font-size:8px;font-style:normal;font-weight:normal;fill:#000000;fill-opacity:1;stroke:none;font-family:Bitstream Vera Sans"
       x="361.33124"
       y="236.72632"
       id="text5170"><tspan
         sodipodi:role="line"
         id="tspan5172"
         x="361.33124"
         y="236.72632"
         style="font-weight:bold;-inkscape-font-specification:Bitstream Vera Sans Bold">+2</tspan></text>
    <text
       xml:space="preserve"
       style="font-size:8px;font-style:normal;font-weight:normal;fill:#000000;fill-opacity:1;stroke:none;font-family:Bitstream Vera Sans"
       x="396.51385"
       y="236.72632"
       id="text5174"><tspan
         sodipodi:role="line"
         id="tspan5176"
         x="396.51385"
         y="236.72632">+2</tspan></text>
    <text
       xml:space="preserve"
       style="font-size:8px;font-style:normal;font-weight:normal;fill:#000000;fill-opacity:1;stroke:none;font-family:Bitstream Vera Sans"
       x="431.55731"
       y="236.72632"
       id="text5178"><tspan
         sodipodi:role="line"
         id="tspan5180"
         x="431.55731"
         y="236.72632">+2</tspan></text>
    <text
       xml:space="preserve"
       style="font-size:8px;font-style:normal;font-weight:normal;fill:#000000;fill-opacity:1;stroke:none;font-family:Bitstream Vera Sans"
       x="469.27167"
       y="236.86792"
       id="text5182"><tspan
         sodipodi:role="line"
         id="tspan5184"
         x="469.27167"
         y="236.86792">+2</tspan></text>
    <text
       xml:space="preserve"
       style="font-size:8px;font-style:normal;font-weight:normal;fill:#000000;fill-opacity:1;stroke:none;font-family:Bitstream Vera Sans"
       x="504.45425"
       y="236.86792"
       id="text5186"><tspan
         sodipodi:role="line"
         id="tspan5188"
         x="504.45425"
         y="236.86792">+2</tspan></text>
    <text
       xml:space="preserve"
       style="font-size:8px;font-style:normal;font-weight:normal;fill:#000000;fill-opacity:1;stroke:none;font-family:Bitstream Vera Sans"
       x="522.76349"
       y="259.85657"
       id="text5190"><tspan
         sodipodi:role="line"
         id="tspan5192"
         x="522.76349"
         y="259.85657"
         style="font-weight:bold;-inkscape-font-specification:Bitstream Vera Sans Bold">+1</tspan></text>
    <rect
       style="font-size:8px;fill:none;stroke:#000000;stroke-width:1.75902581;stroke-linecap:round;stroke-miterlimit:4;stroke-opacity:1;stroke-dasharray:none"
       id="rect5194"
       width="35.581223"
       height="22.939196"
       x="266.75409"
       y="195.3584" />
    <rect
       style="font-size:8px;fill:none;stroke:#000000;stroke-width:1.75902581;stroke-linecap:round;stroke-miterlimit:4;stroke-opacity:1;stroke-dasharray:none"
       id="rect5196"
       width="35.581223"
       height="22.939196"
       x="301.98862"
       y="195.3584" />
    <rect
       style="font-size:8px;fill:none;stroke:#000000;stroke-width:1.75902581;stroke-linecap:round;stroke-miterlimit:4;stroke-opacity:1;stroke-dasharray:none"
       id="rect5198"
       width="35.581223"
       height="22.939196"
       x="337.22311"
       y="195.3584" />
    <rect
       style="font-size:8px;fill:none;stroke:#000000;stroke-width:1.75902581;stroke-linecap:round;stroke-miterlimit:4;stroke-opacity:1;stroke-dasharray:none"
       id="rect5200"
       width="35.581223"
       height="22.939196"
       x="372.45764"
       y="195.3584" />
    <rect
       style="font-size:8px;fill:none;stroke:#000000;stroke-width:1.75902581;stroke-linecap:round;stroke-miterlimit:4;stroke-opacity:1;stroke-dasharray:none"
       id="rect5202"
       width="35.581223"
       height="22.939196"
       x="407.6922"
       y="195.3584" />
    <rect
       style="font-size:8px;fill:none;stroke:#000000;stroke-width:1.75902581;stroke-linecap:round;stroke-miterlimit:4;stroke-opacity:1;stroke-dasharray:none"
       id="rect5204"
       width="35.581223"
       height="22.939196"
       x="442.92673"
       y="195.3584" />
    <rect
       style="font-size:8px;fill:#e6e6e6;fill-opacity:1;stroke:#000000;stroke-width:1.75902581;stroke-linecap:round;stroke-miterlimit:4;stroke-opacity:1;stroke-dasharray:none"
       id="rect5206"
       width="35.581223"
       height="22.939196"
       x="478.16122"
       y="195.3584" />
    <text
       xml:space="preserve"
       style="font-size:8px;font-style:normal;font-weight:normal;fill:#000000;fill-opacity:1;stroke:none;font-family:Bitstream Vera Sans"
       x="273.98633"
       y="205.19702"
       id="text5208"><tspan
         sodipodi:role="line"
         id="tspan5210"
         x="273.98633"
         y="205.19702">HaC0</tspan></text>
    <text
       xml:space="preserve"
       style="font-size:8px;font-style:normal;font-weight:normal;fill:#000000;fill-opacity:1;stroke:none;font-family:Bitstream Vera Sans"
       x="309.00046"
       y="205.19702"
       id="text5212"><tspan
         sodipodi:role="line"
         id="tspan5214"
         x="309.00046"
         y="205.19702">HaC1</tspan></text>
    <text
       xml:space="preserve"
       style="font-size:8px;font-style:normal;font-weight:normal;fill:#000000;fill-opacity:1;stroke:none;font-family:Bitstream Vera Sans"
       x="344.31247"
       y="205.19702"
       id="text5216"><tspan
         sodipodi:role="line"
         id="tspan5218"
         x="344.31247"
         y="205.19702">HaC2</tspan></text>
    <text
       xml:space="preserve"
       style="font-size:8px;font-style:normal;font-weight:normal;fill:#000000;fill-opacity:1;stroke:none;font-family:Bitstream Vera Sans"
       x="379.0654"
       y="205.19702"
       id="text5220"><tspan
         sodipodi:role="line"
         id="tspan5222"
         x="379.0654"
         y="205.19702">HaD1</tspan></text>
    <text
       xml:space="preserve"
       style="font-size:8px;font-style:normal;font-weight:normal;fill:#000000;fill-opacity:1;stroke:none;font-family:Bitstream Vera Sans"
       x="414.24802"
       y="205.19702"
       id="text5224"><tspan
         sodipodi:role="line"
         id="tspan5226"
         x="414.24802"
         y="205.19702">HaD2</tspan></text>
    <text
       xml:space="preserve"
       style="font-size:8px;font-style:normal;font-weight:normal;fill:#000000;fill-opacity:1;stroke:none;font-family:Bitstream Vera Sans"
       x="449.29147"
       y="205.19702"
       id="text5228"><tspan
         sodipodi:role="line"
         id="tspan5230"
         x="449.29147"
         y="205.19702">HaD3</tspan></text>
    <text
       xml:space="preserve"
       style="font-size:8px;font-style:normal;font-weight:normal;fill:#000000;fill-opacity:1;stroke:none;font-family:Bitstream Vera Sans"
       x="487.00583"
       y="205.33862"
       id="text5232"><tspan
         sodipodi:role="line"
         id="tspan5234"
         x="487.00583"
         y="205.33862"
         style="font-weight:bold;-inkscape-font-specification:Bitstream Vera Sans Bold">LtA1</tspan></text>
    <text
       xml:space="preserve"
       style="font-size:8px;font-style:normal;font-weight:normal;fill:#000000;fill-opacity:1;stroke:none;font-family:Bitstream Vera Sans"
       x="274.02625"
       y="213.59094"
       id="text5236"><tspan
         sodipodi:role="line"
         id="tspan5238"
         x="274.02625"
         y="213.59094">+3</tspan></text>
    <text
       xml:space="preserve"
       style="font-size:8px;font-style:normal;font-weight:normal;fill:#000000;fill-opacity:1;stroke:none;font-family:Bitstream Vera Sans"
       x="309.33826"
       y="213.59094"
       id="text5240"><tspan
         sodipodi:role="line"
         id="tspan5242"
         x="309.33826"
         y="213.59094">+3</tspan></text>
    <text
       xml:space="preserve"
       style="font-size:8px;font-style:normal;font-weight:normal;fill:#000000;fill-opacity:1;stroke:none;font-family:Bitstream Vera Sans"
       x="344.09119"
       y="213.59094"
       id="text5244"><tspan
         sodipodi:role="line"
         id="tspan5246"
         x="344.09119"
         y="213.59094">+3</tspan></text>
    <text
       xml:space="preserve"
       style="font-size:8px;font-style:normal;font-weight:normal;fill:#000000;fill-opacity:1;stroke:none;font-family:Bitstream Vera Sans"
       x="379.2738"
       y="213.59094"
       id="text5248"><tspan
         sodipodi:role="line"
         id="tspan5250"
         x="379.2738"
         y="213.59094">+3</tspan></text>
    <text
       xml:space="preserve"
       style="font-size:8px;font-style:normal;font-weight:normal;fill:#000000;fill-opacity:1;stroke:none;font-family:Bitstream Vera Sans"
       x="414.31726"
       y="213.59094"
       id="text5252"><tspan
         sodipodi:role="line"
         id="tspan5254"
         x="414.31726"
         y="213.59094">+3</tspan></text>
    <text
       xml:space="preserve"
       style="font-size:8px;font-style:normal;font-weight:normal;fill:#000000;fill-opacity:1;stroke:none;font-family:Bitstream Vera Sans"
       x="449.30319"
       y="213.73254"
       id="text5256"><tspan
         sodipodi:role="line"
         id="tspan5258"
         x="449.30319"
         y="213.73254">+3</tspan></text>
    <text
       xml:space="preserve"
       style="font-size:8px;font-style:normal;font-weight:normal;fill:#000000;fill-opacity:1;stroke:none;font-family:Bitstream Vera Sans"
       x="487.21417"
       y="213.73254"
       id="text5260"><tspan
         sodipodi:role="line"
         id="tspan5262"
         x="487.21417"
         y="213.73254"
         style="font-weight:bold;-inkscape-font-specification:Bitstream Vera Sans Bold">+3</tspan></text>
    <rect
       style="font-size:8px;fill:none;stroke:#000000;stroke-width:1.75902581;stroke-linecap:round;stroke-miterlimit:4;stroke-opacity:1;stroke-dasharray:none"
       id="rect5264"
       width="35.581223"
       height="22.939196"
       x="284.22244"
       y="172.172" />
    <rect
       style="font-size:8px;fill:none;stroke:#000000;stroke-width:1.75902581;stroke-linecap:round;stroke-miterlimit:4;stroke-opacity:1;stroke-dasharray:none"
       id="rect5266"
       width="35.581223"
       height="22.939196"
       x="319.45697"
       y="172.172" />
    <rect
       style="font-size:8px;fill:none;stroke:#000000;stroke-width:1.75902581;stroke-linecap:round;stroke-miterlimit:4;stroke-opacity:1;stroke-dasharray:none"
       id="rect5268"
       width="35.581223"
       height="22.939196"
       x="354.69147"
       y="172.172" />
    <rect
       style="font-size:8px;fill:none;stroke:#000000;stroke-width:1.75902581;stroke-linecap:round;stroke-miterlimit:4;stroke-opacity:1;stroke-dasharray:none"
       id="rect5270"
       width="35.581223"
       height="22.939196"
       x="389.92599"
       y="172.172" />
    <rect
       style="font-size:8px;fill:none;stroke:#000000;stroke-width:1.75902581;stroke-linecap:round;stroke-miterlimit:4;stroke-opacity:1;stroke-dasharray:none"
       id="rect5272"
       width="35.581223"
       height="22.939196"
       x="425.16055"
       y="172.172" />
    <rect
       style="font-size:8px;fill:none;stroke:#000000;stroke-width:1.75902581;stroke-linecap:round;stroke-miterlimit:4;stroke-opacity:1;stroke-dasharray:none"
       id="rect5274"
       width="35.581223"
       height="22.939196"
       x="460.39508"
       y="172.172" />
    <text
       xml:space="preserve"
       style="font-size:8px;font-style:normal;font-weight:normal;fill:#000000;fill-opacity:1;stroke:none;font-family:Bitstream Vera Sans"
       x="291.45468"
       y="182.01056"
       id="text5276"><tspan
         sodipodi:role="line"
         id="tspan5278"
         x="291.45468"
         y="182.01056">HaC0</tspan></text>
    <text
       xml:space="preserve"
       style="font-size:8px;font-style:normal;font-weight:normal;fill:#000000;fill-opacity:1;stroke:none;font-family:Bitstream Vera Sans"
       x="326.46881"
       y="182.01056"
       id="text5280"><tspan
         sodipodi:role="line"
         id="tspan5282"
         x="326.46881"
         y="182.01056">HaC1</tspan></text>
    <text
       xml:space="preserve"
       style="font-size:8px;font-style:normal;font-weight:normal;fill:#000000;fill-opacity:1;stroke:none;font-family:Bitstream Vera Sans"
       x="361.78082"
       y="182.01056"
       id="text5284"><tspan
         sodipodi:role="line"
         id="tspan5286"
         x="361.78082"
         y="182.01056">HaC2</tspan></text>
    <text
       xml:space="preserve"
       style="font-size:8px;font-style:normal;font-weight:normal;fill:#000000;fill-opacity:1;stroke:none;font-family:Bitstream Vera Sans"
       x="396.53375"
       y="182.01056"
       id="text5288"><tspan
         sodipodi:role="line"
         id="tspan5290"
         x="396.53375"
         y="182.01056">HaD1</tspan></text>
    <text
       xml:space="preserve"
       style="font-size:8px;font-style:normal;font-weight:normal;fill:#000000;fill-opacity:1;stroke:none;font-family:Bitstream Vera Sans"
       x="431.71637"
       y="182.01056"
       id="text5292"><tspan
         sodipodi:role="line"
         id="tspan5294"
         x="431.71637"
         y="182.01056">HaD2</tspan></text>
    <text
       xml:space="preserve"
       style="font-size:8px;font-style:normal;font-weight:normal;fill:#000000;fill-opacity:1;stroke:none;font-family:Bitstream Vera Sans"
       x="466.75983"
       y="182.01056"
       id="text5296"><tspan
         sodipodi:role="line"
         id="tspan5298"
         x="466.75983"
         y="182.01056">HaD3</tspan></text>
    <text
       xml:space="preserve"
       style="font-size:8px;font-style:normal;font-weight:normal;fill:#000000;fill-opacity:1;stroke:none;font-family:Bitstream Vera Sans"
       x="290.80661"
       y="190.40448"
       id="text5300"><tspan
         sodipodi:role="line"
         id="tspan5302"
         x="290.80661"
         y="190.40448">+4</tspan></text>
    <text
       xml:space="preserve"
       style="font-size:8px;font-style:normal;font-weight:normal;fill:#000000;fill-opacity:1;stroke:none;font-family:Bitstream Vera Sans"
       x="325.55954"
       y="190.40448"
       id="text5304"><tspan
         sodipodi:role="line"
         id="tspan5306"
         x="325.55954"
         y="190.40448">+4</tspan></text>
    <text
       xml:space="preserve"
       style="font-size:8px;font-style:normal;font-weight:normal;fill:#000000;fill-opacity:1;stroke:none;font-family:Bitstream Vera Sans"
       x="360.74216"
       y="190.40448"
       id="text5308"><tspan
         sodipodi:role="line"
         id="tspan5310"
         x="360.74216"
         y="190.40448">+4</tspan></text>
    <text
       xml:space="preserve"
       style="font-size:8px;font-style:normal;font-weight:normal;fill:#000000;fill-opacity:1;stroke:none;font-family:Bitstream Vera Sans"
       x="395.78561"
       y="190.40448"
       id="text5312"><tspan
         sodipodi:role="line"
         id="tspan5314"
         x="395.78561"
         y="190.40448">+4</tspan></text>
    <text
       xml:space="preserve"
       style="font-size:8px;font-style:normal;font-weight:normal;fill:#000000;fill-opacity:1;stroke:none;font-family:Bitstream Vera Sans"
       x="430.77155"
       y="190.54608"
       id="text5316"><tspan
         sodipodi:role="line"
         id="tspan5318"
         x="430.77155"
         y="190.54608">+4</tspan></text>
    <text
       xml:space="preserve"
       style="font-size:8px;font-style:normal;font-weight:normal;fill:#000000;fill-opacity:1;stroke:none;font-family:Bitstream Vera Sans"
       x="468.68253"
       y="190.54608"
       id="text5320"><tspan
         sodipodi:role="line"
         id="tspan5322"
         x="468.68253"
         y="190.54608">+4</tspan></text>
    <rect
       style="font-size:8px;fill:#e6e6e6;fill-opacity:1;stroke:#000000;stroke-width:1.75902581;stroke-linecap:round;stroke-miterlimit:4;stroke-opacity:1;stroke-dasharray:none"
       id="rect5324"
       width="35.581223"
       height="22.939196"
       x="301.65564"
       y="149.31268" />
    <rect
       style="font-size:8px;fill:none;stroke:#000000;stroke-width:1.75902581;stroke-linecap:round;stroke-miterlimit:4;stroke-opacity:1;stroke-dasharray:none"
       id="rect5326"
       width="35.581223"
       height="22.939196"
       x="336.89017"
       y="149.31268" />
    <rect
       style="font-size:8px;fill:none;stroke:#000000;stroke-width:1.75902581;stroke-linecap:round;stroke-miterlimit:4;stroke-opacity:1;stroke-dasharray:none"
       id="rect5328"
       width="35.581223"
       height="22.939196"
       x="372.12466"
       y="149.31268" />
    <rect
       style="font-size:8px;fill:none;stroke:#000000;stroke-width:1.75902581;stroke-linecap:round;stroke-miterlimit:4;stroke-opacity:1;stroke-dasharray:none"
       id="rect5330"
       width="35.581223"
       height="22.939196"
       x="407.35919"
       y="149.31268" />
    <rect
       style="font-size:8px;fill:none;stroke:#000000;stroke-width:1.75902581;stroke-linecap:round;stroke-miterlimit:4;stroke-opacity:1;stroke-dasharray:none"
       id="rect5332"
       width="35.581223"
       height="22.939196"
       x="442.59375"
       y="149.31268" />
    <text
       xml:space="preserve"
       style="font-size:8px;font-style:normal;font-weight:normal;fill:#000000;fill-opacity:1;stroke:none;font-family:Bitstream Vera Sans"
       x="308.88788"
       y="159.15125"
       id="text5334"><tspan
         sodipodi:role="line"
         id="tspan5336"
         x="308.88788"
         y="159.15125"
         style="font-weight:bold;-inkscape-font-specification:Bitstream Vera Sans Bold">HaC0</tspan></text>
    <text
       xml:space="preserve"
       style="font-size:8px;font-style:normal;font-weight:normal;fill:#000000;fill-opacity:1;stroke:none;font-family:Bitstream Vera Sans"
       x="343.90201"
       y="159.15125"
       id="text5338"><tspan
         sodipodi:role="line"
         id="tspan5340"
         x="343.90201"
         y="159.15125">HaC1</tspan></text>
    <text
       xml:space="preserve"
       style="font-size:8px;font-style:normal;font-weight:normal;fill:#000000;fill-opacity:1;stroke:none;font-family:Bitstream Vera Sans"
       x="379.21402"
       y="159.15125"
       id="text5342"><tspan
         sodipodi:role="line"
         id="tspan5344"
         x="379.21402"
         y="159.15125">HaC2</tspan></text>
    <text
       xml:space="preserve"
       style="font-size:8px;font-style:normal;font-weight:normal;fill:#000000;fill-opacity:1;stroke:none;font-family:Bitstream Vera Sans"
       x="413.96695"
       y="159.15125"
       id="text5346"><tspan
         sodipodi:role="line"
         id="tspan5348"
         x="413.96695"
         y="159.15125">HaD1</tspan></text>
    <text
       xml:space="preserve"
       style="font-size:8px;font-style:normal;font-weight:normal;fill:#000000;fill-opacity:1;stroke:none;font-family:Bitstream Vera Sans"
       x="449.14957"
       y="159.15125"
       id="text5350"><tspan
         sodipodi:role="line"
         id="tspan5352"
         x="449.14957"
         y="159.15125">HaD2</tspan></text>
    <text
       xml:space="preserve"
       style="font-size:8px;font-style:normal;font-weight:normal;fill:#000000;fill-opacity:1;stroke:none;font-family:Bitstream Vera Sans"
       x="308.99274"
       y="167.54517"
       id="text5354"><tspan
         sodipodi:role="line"
         id="tspan5356"
         x="308.99274"
         y="167.54517"
         style="font-weight:bold;-inkscape-font-specification:Bitstream Vera Sans Bold">+5</tspan></text>
    <text
       xml:space="preserve"
       style="font-size:8px;font-style:normal;font-weight:normal;fill:#000000;fill-opacity:1;stroke:none;font-family:Bitstream Vera Sans"
       x="344.17535"
       y="167.54517"
       id="text5358"><tspan
         sodipodi:role="line"
         id="tspan5360"
         x="344.17535"
         y="167.54517">+5</tspan></text>
    <text
       xml:space="preserve"
       style="font-size:8px;font-style:normal;font-weight:normal;fill:#000000;fill-opacity:1;stroke:none;font-family:Bitstream Vera Sans"
       x="379.21881"
       y="167.54517"
       id="text5362"><tspan
         sodipodi:role="line"
         id="tspan5364"
         x="379.21881"
         y="167.54517">+5</tspan></text>
    <text
       xml:space="preserve"
       style="font-size:8px;font-style:normal;font-weight:normal;fill:#000000;fill-opacity:1;stroke:none;font-family:Bitstream Vera Sans"
       x="414.20474"
       y="167.68677"
       id="text5366"><tspan
         sodipodi:role="line"
         id="tspan5368"
         x="414.20474"
         y="167.68677">+5</tspan></text>
    <text
       xml:space="preserve"
       style="font-size:8px;font-style:normal;font-weight:normal;fill:#000000;fill-opacity:1;stroke:none;font-family:Bitstream Vera Sans"
       x="452.11572"
       y="167.68677"
       id="text5370"><tspan
         sodipodi:role="line"
         id="tspan5372"
         x="452.11572"
         y="167.68677">+5</tspan></text>
    <rect
       style="font-size:8px;fill:none;stroke:#000000;stroke-width:1.75902581;stroke-linecap:round;stroke-miterlimit:4;stroke-opacity:1;stroke-dasharray:none"
       id="rect5374"
       width="35.581223"
       height="22.939196"
       x="319.35339"
       y="126.51476" />
    <rect
       style="font-size:8px;fill:none;stroke:#000000;stroke-width:1.75902581;stroke-linecap:round;stroke-miterlimit:4;stroke-opacity:1;stroke-dasharray:none"
       id="rect5376"
       width="35.581223"
       height="22.939196"
       x="354.58795"
       y="126.51476" />
    <rect
       style="font-size:8px;fill:none;stroke:#000000;stroke-width:1.75902581;stroke-linecap:round;stroke-miterlimit:4;stroke-opacity:1;stroke-dasharray:none"
       id="rect5378"
       width="35.581223"
       height="22.939196"
       x="389.82245"
       y="126.51476" />
    <rect
       style="font-size:8px;fill:none;stroke:#000000;stroke-width:1.75902581;stroke-linecap:round;stroke-miterlimit:4;stroke-opacity:1;stroke-dasharray:none"
       id="rect5380"
       width="35.581223"
       height="22.939196"
       x="425.05698"
       y="126.51476" />
    <text
       xml:space="preserve"
       style="font-size:8px;font-style:normal;font-weight:normal;fill:#000000;fill-opacity:1;stroke:none;font-family:Bitstream Vera Sans"
       x="326.58563"
       y="136.35338"
       id="text5382"><tspan
         sodipodi:role="line"
         id="tspan5384"
         x="326.58563"
         y="136.35338">HaC0</tspan></text>
    <text
       xml:space="preserve"
       style="font-size:8px;font-style:normal;font-weight:normal;fill:#000000;fill-opacity:1;stroke:none;font-family:Bitstream Vera Sans"
       x="361.59979"
       y="136.35338"
       id="text5386"><tspan
         sodipodi:role="line"
         id="tspan5388"
         x="361.59979"
         y="136.35338">HaC1</tspan></text>
    <text
       xml:space="preserve"
       style="font-size:8px;font-style:normal;font-weight:normal;fill:#000000;fill-opacity:1;stroke:none;font-family:Bitstream Vera Sans"
       x="396.9118"
       y="136.35338"
       id="text5390"><tspan
         sodipodi:role="line"
         id="tspan5392"
         x="396.9118"
         y="136.35338">HaC2</tspan></text>
    <text
       xml:space="preserve"
       style="font-size:8px;font-style:normal;font-weight:normal;fill:#000000;fill-opacity:1;stroke:none;font-family:Bitstream Vera Sans"
       x="431.66473"
       y="136.35338"
       id="text5394"><tspan
         sodipodi:role="line"
         id="tspan5396"
         x="431.66473"
         y="136.35338">HaD1</tspan></text>
    <text
       xml:space="preserve"
       style="font-size:8px;font-style:normal;font-weight:normal;fill:#000000;fill-opacity:1;stroke:none;font-family:Bitstream Vera Sans"
       x="325.87314"
       y="144.74731"
       id="text5398"><tspan
         sodipodi:role="line"
         id="tspan5400"
         x="325.87314"
         y="144.74731">+6</tspan></text>
    <text
       xml:space="preserve"
       style="font-size:8px;font-style:normal;font-weight:normal;fill:#000000;fill-opacity:1;stroke:none;font-family:Bitstream Vera Sans"
       x="360.9166"
       y="144.74731"
       id="text5402"><tspan
         sodipodi:role="line"
         id="tspan5404"
         x="360.9166"
         y="144.74731">+6</tspan></text>
    <text
       xml:space="preserve"
       style="font-size:8px;font-style:normal;font-weight:normal;fill:#000000;fill-opacity:1;stroke:none;font-family:Bitstream Vera Sans"
       x="395.90253"
       y="144.88892"
       id="text5406"><tspan
         sodipodi:role="line"
         id="tspan5408"
         x="395.90253"
         y="144.88892">+6</tspan></text>
    <text
       xml:space="preserve"
       style="font-size:8px;font-style:normal;font-weight:normal;fill:#000000;fill-opacity:1;stroke:none;font-family:Bitstream Vera Sans"
       x="433.81351"
       y="144.88892"
       id="text5410"><tspan
         sodipodi:role="line"
         id="tspan5412"
         x="433.81351"
         y="144.88892">+6</tspan></text>
    <rect
       style="font-size:8px;fill:none;stroke:#000000;stroke-width:1.75902581;stroke-linecap:round;stroke-miterlimit:4;stroke-opacity:1;stroke-dasharray:none"
       id="rect5414"
       width="35.581223"
       height="22.939196"
       x="336.83685"
       y="103.53679" />
    <rect
       style="font-size:8px;fill:none;stroke:#000000;stroke-width:1.75902581;stroke-linecap:round;stroke-miterlimit:4;stroke-opacity:1;stroke-dasharray:none"
       id="rect5416"
       width="35.581223"
       height="22.939196"
       x="372.07141"
       y="103.53679" />
    <rect
       style="font-size:8px;fill:none;stroke:#000000;stroke-width:1.75902581;stroke-linecap:round;stroke-miterlimit:4;stroke-opacity:1;stroke-dasharray:none"
       id="rect5418"
       width="35.581223"
       height="22.939196"
       x="407.30591"
       y="103.53679" />
    <text
       xml:space="preserve"
       style="font-size:8px;font-style:normal;font-weight:normal;fill:#000000;fill-opacity:1;stroke:none;font-family:Bitstream Vera Sans"
       x="344.06909"
       y="113.37535"
       id="text5420"><tspan
         sodipodi:role="line"
         id="tspan5422"
         x="344.06909"
         y="113.37535">HaC0</tspan></text>
    <text
       xml:space="preserve"
       style="font-size:8px;font-style:normal;font-weight:normal;fill:#000000;fill-opacity:1;stroke:none;font-family:Bitstream Vera Sans"
       x="379.08325"
       y="113.37535"
       id="text5424"><tspan
         sodipodi:role="line"
         id="tspan5426"
         x="379.08325"
         y="113.37535">HaC1</tspan></text>
    <text
       xml:space="preserve"
       style="font-size:8px;font-style:normal;font-weight:normal;fill:#000000;fill-opacity:1;stroke:none;font-family:Bitstream Vera Sans"
       x="414.39526"
       y="113.37535"
       id="text5428"><tspan
         sodipodi:role="line"
         id="tspan5430"
         x="414.39526"
         y="113.37535">HaC2</tspan></text>
    <text
       xml:space="preserve"
       style="font-size:8px;font-style:normal;font-weight:normal;fill:#000000;fill-opacity:1;stroke:none;font-family:Bitstream Vera Sans"
       x="344.40005"
       y="121.76927"
       id="text5432"><tspan
         sodipodi:role="line"
         id="tspan5434"
         x="344.40005"
         y="121.76927">+7</tspan></text>
    <text
       xml:space="preserve"
       style="font-size:8px;font-style:normal;font-weight:normal;fill:#000000;fill-opacity:1;stroke:none;font-family:Bitstream Vera Sans"
       x="379.38599"
       y="121.91087"
       id="text5436"><tspan
         sodipodi:role="line"
         id="tspan5438"
         x="379.38599"
         y="121.91087">+7</tspan></text>
    <text
       xml:space="preserve"
       style="font-size:8px;font-style:normal;font-weight:normal;fill:#000000;fill-opacity:1;stroke:none;font-family:Bitstream Vera Sans"
       x="417.29697"
       y="121.91087"
       id="text5440"><tspan
         sodipodi:role="line"
         id="tspan5442"
         x="417.29697"
         y="121.91087">+7</tspan></text>
    <rect
       style="font-size:8px;fill:none;stroke:#000000;stroke-width:1.75902581;stroke-linecap:round;stroke-miterlimit:4;stroke-opacity:1;stroke-dasharray:none"
       id="rect5444"
       width="35.581223"
       height="22.939196"
       x="354.58286"
       y="80.675949" />
    <rect
       style="font-size:8px;fill:none;stroke:#000000;stroke-width:1.75902581;stroke-linecap:round;stroke-miterlimit:4;stroke-opacity:1;stroke-dasharray:none"
       id="rect5446"
       width="35.581223"
       height="22.939196"
       x="389.81741"
       y="80.675949" />
    <text
       xml:space="preserve"
       style="font-size:8px;font-style:normal;font-weight:normal;fill:#000000;fill-opacity:1;stroke:none;font-family:Bitstream Vera Sans"
       x="361.81509"
       y="90.514511"
       id="text5448"><tspan
         sodipodi:role="line"
         id="tspan5450"
         x="361.81509"
         y="90.514511">HaC0</tspan></text>
    <text
       xml:space="preserve"
       style="font-size:8px;font-style:normal;font-weight:normal;fill:#000000;fill-opacity:1;stroke:none;font-family:Bitstream Vera Sans"
       x="396.82925"
       y="90.514511"
       id="text5452"><tspan
         sodipodi:role="line"
         id="tspan5454"
         x="396.82925"
         y="90.514511">HaC1</tspan></text>
    <text
       xml:space="preserve"
       style="font-size:8px;font-style:normal;font-weight:normal;fill:#000000;fill-opacity:1;stroke:none;font-family:Bitstream Vera Sans"
       x="361.13199"
       y="99.050034"
       id="text5456"><tspan
         sodipodi:role="line"
         id="tspan5458"
         x="361.13199"
         y="99.050034">+8</tspan></text>
    <text
       xml:space="preserve"
       style="font-size:8px;font-style:normal;font-weight:normal;fill:#000000;fill-opacity:1;stroke:none;font-family:Bitstream Vera Sans"
       x="399.04297"
       y="99.050034"
       id="text5460"><tspan
         sodipodi:role="line"
         id="tspan5462"
         x="399.04297"
         y="99.050034">+8</tspan></text>
    <rect
       style="font-size:8px;fill:#e6e6e6;fill-opacity:1;stroke:#000000;stroke-width:1.75902581;stroke-linecap:round;stroke-miterlimit:4;stroke-opacity:1;stroke-dasharray:none"
       id="rect5464"
       width="35.581223"
       height="22.939196"
       x="372.07135"
       y="57.694412" />
    <text
       xml:space="preserve"
       style="font-size:8px;font-style:normal;font-weight:normal;fill:#000000;fill-opacity:1;stroke:none;font-family:Bitstream Vera Sans"
       x="377.30359"
       y="67.532997"
       id="text5466"><tspan
         sodipodi:role="line"
         id="tspan5468"
         x="377.30359"
         y="67.532997"
         style="font-weight:bold;-inkscape-font-specification:Bitstream Vera Sans Bold">HaC0</tspan></text>
    <text
       xml:space="preserve"
       style="font-size:8px;font-style:normal;font-weight:normal;fill:#000000;fill-opacity:1;stroke:none;font-family:Bitstream Vera Sans"
       x="376.53146"
       y="76.068497"
       id="text5470"><tspan
         sodipodi:role="line"
         id="tspan5472"
         x="376.53146"
         y="76.068497"
         style="font-weight:bold;-inkscape-font-specification:Bitstream Vera Sans Bold">+9</tspan></text>
    <g
       id="layer2"
       inkscape:label="zeit"
       style="display:none"
       sodipodi:insensitive="true"
       transform="translate(-621.55184,-825.13603)">
      <path
         id="rect2941"
         style="fill:#e6e6e6;fill-opacity:0.05579397;fill-rule:nonzero;stroke:#ff0000;stroke-width:0.70866144;stroke-linecap:round;stroke-miterlimit:4;stroke-opacity:1"
         d="m 212.96079,479.5667 388.99891,0 0,387.48529 -388.99891,0 0,-387.48529 z m -0.0562,-0.11377 34.0729,0 0,387.4853 -34.0729,0 0,-387.4853 z m 35.2697,-0.0104 69.5655,0 0,387.48529 -69.5655,0 0,-387.48529 z m 106.46539,0.0228 48.26995,0 0,387.48529 -48.26995,0 0,-387.48529 z m 124.16555,-0.0322 16.32659,0 0,387.48529 -16.32659,0 0,-387.48529 z m -17.76103,0.0814 16.3266,0 0,387.48529 -16.3266,0 0,-387.48529 z m -42.58237,0.0271 41.17142,0 0,387.48529 -41.17142,0 0,-387.48529 z m -14.19563,0.0111 12.77734,0 0,387.48529 -12.77734,0 0,-387.48529 z m 145.47099,0.0323 51.8192,0 0,387.48529 -51.8192,0 0,-387.48529 z m -53.17824,-0.0279 51.8192,0 0,387.48529 -51.8192,0 0,-387.48529 z m -177.37478,-0.0625 34.07289,0 0,387.48529 -34.07289,0 0,-387.48529 z"
         inkscape:connector-curvature="0" />
    </g>
  </g>
</svg>
