id;x;y
1;3553871;6028721
2;3553612;6028417
3;3553518;6027998
4;3553314;6027711
5;3553421;6027623
6;3553338;6027580
7;3553395;6027543
8;3553533;6027535
9;3553522;6027447
10;3553166;6027504
11;3551593;6026580
12;3551590;6026450
13;3551724;6026466
14;3551875;6026467
15;3551886;6026415
16;3552427;6026956
17;3552162;6026614
18;3552202;6026768
19;3552255;6026723
20;3552307;6026674
21;3552502;6026648
22;3552544;6026706
23;3552624;6026779
24;3552823;6026772
25;3552801;6026636
26;3552651;6025678
27;3552738;6025519
28;3552564;6025022
29;3552610;6024873
30;3553226;6025464
31;3553299;6025069
32;3553777;6024832
33;3551617;6025182
34;3551531;6024687
35;3551628;6024648
36;3551634;6024361
37;3551368;6024041
38;3551299;6024198
39;3551136;6024303
40;3550804;6024145
41;3551377;6022812
42;3551307;6022686
43;3552719;6024143
44;3552707;6023708
45;3552818;6023989
46;3552839;6023873
47;3553247;6023537
48;3553016;6023592
49;3553067;6023510
50;3553038;6023448
51;3552748;6023332
52;3552692;6023219
53;3552682;6023169
54;3552518;6023000
55;3552751;6022579
56;3552223;6022578
57;3554988;6030119
58;3555388;6030062
59;3554973;6029794
60;3554693;6029806
61;3554657;6029775
62;3554665;6029610
63;3554713;6029499
64;3554612;6029109
65;3554484;6028980
66;3554383;6028904
67;3554247;6028777
68;3554257;6029186
69;3554238;6029286
70;3555041;6028937
71;3554626;6025005
72;3554797;6024311
73;3555322;6024078
74;3555514;6024190
75;3555516;6024078
76;3555571;6023990
77;3555716;6024036
78;3555663;6024051
79;3555669;6024198
80;3556734;6024011
81;3555532;6022833
82;3559466;6025783
83;3563824;6027429
84;3564653;6025928
85;3564332;6024669
86;3556682;6024378
87;3557813;6023836
88;3557567;6023142
89;3557647;6022936
90;3557605;6022916
91;3557573;6022890
92;3557638;6022860
93;3557669;6022881
94;3557928;6022854
95;3557918;6022753
96;3558880;6022801
97;3567038;6029867
98;3567654;6029756
99;3567356;6029744
100;3567308;6029718
101;3567067;6029591
102;3567282;6029428
103;3566940;6027939
104;3566993;6027806
105;3566959;6026713
106;3566858;6026721
107;3565517;6027122
108;3567105;6024603
109;3567027;6024656
110;3566138;6023074
111;3566396;6023136
112;3566427;6022968
113;3566437;6022914
114;3566373;6022877
115;3566455;6022845
116;3566517;6022834
117;3566595;6022692
118;3568251;6026795
119;3569600;6029079
120;3568081;6028828
121;3568182;6029893
122;3571208;6028905
123;3570317;6027822
124;3570304;6027736
125;3572060;6028283
126;3573115;6029214
127;3572640;6029143
128;3573483;6030136
129;3569359;6025140
130;3569518;6025219
131;3568601;6024876
132;3568701;6025058
133;3568800;6025023
134;3568723;6024960
135;3551914;6031921
136;3551988;6031946
137;3552328;6032211
138;3552661;6031938
139;3552714;6031892
140;3552688;6031566
141;3552197;6031962
142;3552594;6031824
143;3552642;6031834
144;3552756;6031772
145;3552667;6031696
146;3552635;6031647
147;3552613;6031658
148;3552577;6031592
149;3552559;6031586
150;3552514;6031599
151;3552456;6031464
152;3552327;6031574
153;3552380;6031649
154;3552435;6031623
155;3552636;6031462
156;3552723;6031465
157;3551932;6030811
158;3552118;6030918
159;3552403;6030809
160;3552209;6030571
161;3552042;6030770
162;3551972;6030723
163;3551945;6030665
164;3552045;6030631
165;3551957;6030597
166;3551911;6030588
167;3551901;6030465
168;3551934;6030431
169;3552013;6030196
170;3551890;6030228
171;3551961;6030159
172;3551818;6030373
173;3551807;6030276
174;3551835;6030335
175;3551183;6031122
176;3551091;6031422
177;3551029;6031387
178;3551401;6040268
179;3550911;6037630
180;3551016;6037594
181;3551051;6037510
182;3551086;6037482
183;3551109;6037457
184;3551260;6037541
185;3550809;6037203
186;3550799;6037257
187;3551991;6036506
188;3552308;6033650
189;3552423;6033634
190;3552464;6033535
191;3553841;6033394
192;3553443;6033334
193;3553343;6032509
194;3553269;6032393
195;3553128;6032231
196;3552742;6032423
197;3552657;6032175
198;3552747;6032248
199;3552750;6032169
200;3552882;6031988
201;3553047;6032167
202;3552946;6032123
203;3552806;6032009
204;3552932;6032155
205;3553394;6032174
206;3553750;6030547
207;3553069;6030477
208;3552986;6030489
209;3553005;6030835
210;3555552;6038849
211;3555788;6038768
212;3556648;6039856
213;3556631;6039893
214;3555058;6035547
215;3555090;6035666
216;3554720;6035638
217;3554651;6035655
218;3554633;6035554
219;3554736;6035528
220;3554634;6035335
221;3554708;6035339
222;3554690;6035237
223;3554720;6034983
224;3554207;6034871
225;3554260;6034806
226;3554387;6034722
227;3554348;6034684
228;3554305;6034645
229;3554215;6034579
230;3554163;6034695
231;3554080;6034744
232;3556398;6032774
233;3557240;6034431
234;3558160;6035178
235;3558256;6035146
236;3559463;6035688
237;3562085;6037303
238;3563266;6037049
239;3563045;6035809
240;3556130;6032765
241;3556681;6031853
242;3556813;6031646
243;3556740;6031643
244;3556607;6031463
245;3556677;6031463
246;3556735;6031415
247;3556814;6031110
248;3556832;6030901
249;3556572;6030663
250;3556569;6030762
251;3556480;6030826
252;3556389;6030871
253;3556035;6030733
254;3555914;6030741
255;3555884;6030660
256;3555856;6030592
257;3556023;6030543
258;3562027;6035350
259;3562040;6035414
260;3561969;6035425
261;3562656;6035215
262;3562973;6033737
263;3564063;6034218
264;3565049;6037079
265;3565024;6036967
266;3565203;6036871
267;3565142;6036812
268;3565533;6036777
269;3566249;6037495
270;3565959;6037097
271;3565963;6037008
272;3565918;6037050
273;3566553;6037341
274;3566614;6037312
275;3567690;6036150
276;3567731;6035947
277;3566998;6035588
278;3567230;6035657
279;3567299;6035313
280;3567854;6035128
281;3565872;6034734
282;3566703;6032314
283;3567380;6034317
284;3567299;6038338
285;3568635;6036528
286;3568580;6036453
287;3568418;6036395
288;3568454;6035585
289;3568386;6035588
290;3568263;6035428
291;3568828;6035311
292;3569155;6035331
293;3568807;6034125
294;3568654;6034044
295;3570141;6035321
296;3570104;6035340
297;3570163;6035361
298;3569694;6035367
299;3569982;6035521
300;3569819;6035609
301;3569483;6036448
302;3569865;6036565
303;3570433;6037018
304;3570678;6036879
305;3570737;6036869
306;3570774;6036952
307;3570896;6036984
308;3570827;6036910
309;3570805;6036791
310;3570805;6036756
311;3570805;6036723
312;3571120;6036915
313;3571046;6036814
314;3571039;6036777
315;3571168;6036515
316;3571101;6036496
317;3571260;6036320
318;3571262;6036242
319;3570543;6035809
320;3570786;6035788
321;3571077;6035895
322;3570975;6035922
323;3571986;6036799
324;3571907;6036902
325;3572549;6036867
326;3571535;6036870
327;3571442;6037045
328;3571212;6037179
329;3572253;6038071
330;3572208;6037926
331;3572323;6037440
332;3572460;6037650
333;3572468;6037528
334;3572654;6038108
335;3571637;6037796
336;3571403;6037740
337;3570465;6038069
338;3570693;6038409
339;3571837;6039559
340;3572229;6039887
341;3573287;6039584
342;3572859;6038907
343;3572881;6039001
344;3573536;6038786
345;3566069;6032336
346;3566116;6032375
347;3566653;6031950
348;3567459;6031861
349;3567581;6031775
350;3567493;6031604
351;3567565;6031613
352;3567546;6031282
353;3568462;6031558
354;3568064;6031632
355;3567904;6031271
356;3567937;6031295
357;3568048;6031455
358;3568154;6031417
359;3569200;6031685
360;3575628;6037281
361;3575021;6037214
362;3572904;6038160
363;3572951;6038168
364;3572919;6038064
365;3572977;6038081
366;3572840;6037877
367;3572793;6037679
368;3572817;6037642
369;3572843;6037611
370;3572856;6037591
371;3572798;6038071
372;3572807;6038064
373;3572703;6038024
374;3572862;6038040
375;3572940;6037282
376;3572938;6037239
377;3572897;6037067
378;3572934;6036998
379;3574983;6036750
380;3575351;6036581
381;3575349;6036520
382;3575610;6036655
383;3575520;6036504
384;3575213;6036399
385;3575247;6036346
386;3575274;6036130
387;3575202;6036114
388;3575243;6036045
389;3575052;6035951
390;3575107;6035826
391;3575656;6035603
392;3571689;6035908
393;3571176;6035587
394;3571073;6035189
395;3570726;6035457
396;3570198;6035016
397;3570455;6033656
398;3573202;6034459
399;3573215;6034280
400;3573733;6034093
401;3573907;6034083
402;3573780;6034158
403;3572203;6033145
404;3573775;6032887
405;3573831;6032961
406;3573773;6032968
407;3573686;6033033
408;3573730;6032961
409;3573679;6032938
410;3573653;6033123
411;3573654;6033028
412;3572362;6031957
413;3572247;6032684
414;3572945;6038045
415;3575700;6031014
416;3575724;6031227
417;3575546;6032049
418;3575626;6030851
419;3575680;6030909
420;3576218;6036371
421;3575976;6036205
422;3575815;6035848
423;3575691;6035450
424;3575829;6031223
425;3575872;6031346
426;3576004;6031221
427;3576444;6031816
428;3576080;6031188
429;3576111;6031240
430;3576111;6031319
431;3576005;6031350
432;3576686;6031237
433;3576729;6031270
434;3576620;6031240
