[
    {
        "name": "123",
        "password": "123",
        "win": 45,
        "tie": 2,
        "loss": 37
    },
    {
        "name": "asd",
        "password": "asd",
        "win": 11,
        "tie": 1,
        "loss": 8
    },
    {
        "name": "qwe",
        "password": "qwe",
        "win": 20,
        "tie": 0,
        "loss": 40
    },
    {
        "name": "abc",
        "password": "abc",
        "win": 0,
        "tie": 0,
        "loss": 0
    },
    {
        "name": "duka",
        "password": "duka",
        "win": 9,
        "tie": 0,
        "loss": 3
    },
    {
        "name": "test",
        "password": "test",
        "win": 6,
        "tie": 2,
        "loss": 2
    },
    {
        "name": "test2",
        "password": "test2",
        "win": 2,
        "tie": 2,
        "loss": 4
    }
]