﻿,
useGeneRandomisation,false, Allow Genes to randomly select
runCollsionChecks,true, If the current run should use collision checks to prevent overlap - true = no overlap
optimizerType,SAGA, Use SAGA or NSAGA
shapeOfScatterer,Circle,
shapeOfObject,Circle,
saveAllImages,false, If all images should be saved - true for all, false for only elites - also fale for none
saveNoImages,true, True if no images should be saved -
useOldSystem,true, True for 2.0, false for 3.0
save360Points,true, save the 360 pressure points afterware
USED_ERROR_METRIC,sanchis, Error metric to use
ALLOW_0_SWITCHING,true, Allow the program to let scatterers return to 0th state
USE_COMSOL,true, should it use comsol
,
cloackThicknesssMultiplier,1.52
centralObjectRadisMultiplier,1
scattererRadiusMultiplier,1/15
csvMapPath,
readOldMapUseNew,false
usePreviousMap,false
pixelWidth,354
regionThickness,0.0605
mappedLayerDensity,8
mappedScatterRadiusMultiplier,0.05
,
previousGenerationCounter,0
resumePreviousRun,false
previousRunFilePath,
INITIAL_ANNEALING_STEP,0
,
initalPopSize,40
numGenerations,50
INITIAL_TEMPERATURE,0.7
MAXIMUM_TEMPERATURE_STEPS,50
initialMutationProbability,0.2
mutateAddtional,0.0,chance for a next mutation to occur
additionalMutationDecrease,0.2, amount 2nd mutation chance should decrease - by default it should equal mutate addtional to produce only 1 extra mutation.
MAXIMUM_SCATTERERS_IN_A_QUADRANT,35
clearModelOnGenerate,FALSE
,
massImageOutputFolder,D:\dev_D\comsol_optimiser\output\MassImages
logFolder,D:\dev_D\comsol_optimiser\output\logs
comsolVersion,v56
reannealingStep,0
tempRaiseAmount,0.1
geneHistoryDir,D:\dev_D\comsol_optimiser\src\main\resources\activeProcessingCSV
numberOfCores,-1
modelPath,D:\dev_D\comsol_optimiser\src\main\java\com\comsolModelInterface\comsolModels\Acoustic_Cloaking_20KHz_thin_cloak_add_pml_explicit4_with_parametric_sweep.java
checkoutLicense,false
waitForLicense,true
tempFunction,, Used to determine which temperature function should be used -
,
monopole,true
contourFilePath, //TODO