a1,n1,R1,r1,phi1,a2,n2,R2,r2,phi2,a3,n3,R3,r3,phi3,a4,n4,R4,r4,phi4
0,6,0.027,0.001,25,1,4,0.027,0.001,25,1,4,0.027,0.001,25,1,4,0.027,0.001,25
0,12,0.027,0.001,0,0,6,0.027,0.001,0,0,6,0.027,0.001,0,0,6,0.027,0.001,0
1,18,0.029,0.001,0,1,9,0.029,0.001,0,1,9,0.029,0.001,0,1,9,0.029,0.001,0
1,8,0.029,0.001,359,1,4,0.029,0.001,180,1,4,0.029,0.001,180,1,4,0.029,0.001,180
1,8,0.028,0.001,0,1,4,0.028,0.001,0,1,4,0.028,0.001,0,1,4,0.028,0.001,0
1,12,0.028,0.001,125,1,6,0.028,0.001,50,1,6,0.028,0.001,50,1,6,0.028,0.001,50
0,9,0.039769,0.0040775,273,1,10,0.030544,0.0011,271,0,5,0.029,0.001,0,0,5,0.029,0.001,0
1,15,0.028,0.001,0,1,7,0.028,0.001,0,1,7,0.028,0.001,0,1,7,0.028,0.001,0
1,16,0.028,0.001,50,1,8,0.028,0.001,25,1,8,0.028,0.001,25,1,8,0.028,0.001,25
1,28,0.032,0.002,20,1,14,0.032,0.002,10,1,14,0.032,0.002,10,1,14,0.032,0.002,10
1,12,0.042,0.009,0,1,6,0.042,0.009,0,1,6,0.042,0.009,0,1,6,0.042,0.009,0
1,18,0.02799,0.0011,20,0,9,0.028,0.0011,10,0,9,0.028,0.0011,10,0,9,0.028,0.0011,10
