n1,R1,phi1,n2,R2,phi2,n3,R3,phi3,n4,R4,phi4,n5,R5,phi5,n6,R6,phi6,n7,R7,phi7,n8,R8,phi8,n9,R9,phi9,n10,R10,phi10
18,0.019,0,9,0.019,0,10,0.019,1,20,0.019,2,11,0.019,2,21,0.019,3,12,0.019,19,12,0.019,19,12,0.019,19,12,0.019,19
8,0.019,359,4,0.019,180,5,0.019,181,10,0.019,359,6,0.019,182,11,0.019,344,7,0.019,9,7,0.019,9,7,0.019,9,7,0.019,9
8,0.019,0,4,0.019,0,5,0.019,1,10,0.019,2,6,0.019,2,11,0.019,3,7,0.019,9,7,0.019,9,7,0.019,9,7,0.019,9
12,0.019,125,6,0.019,50,7,0.019,51,14,0.019,127,8,0.019,52,15,0.019,128,9,0.019,13,9,0.019,13,9,0.019,13,9,0.019,13
15,0.019,0,7,0.019,0,8,0.019,1,17,0.019,2,9,0.019,2,18,0.019,3,10,0.019,16,10,0.019,16,10,0.019,16,10,0.019,16
16,0.019,50,8,0.019,25,9,0.019,26,18,0.019,52,10,0.019,27,19,0.019,53,11,0.019,17,11,0.019,17,11,0.019,17,11,0.019,17
28,0.019,20,14,0.019,10,15,0.019,11,30,0.019,22,16,0.019,12,31,0.019,23,17,0.019,29,17,0.019,29,17,0.019,29,17,0.019,29
12,0.019,0,6,0.019,0,7,0.019,1,14,0.019,2,8,0.019,2,15,0.019,3,9,0.019,13,9,0.019,13,9,0.019,13,9,0.019,13
18,0.019,20,9,0.019,10,10,0.019,11,20,0.019,22,11,0.019,12,21,0.019,23,12,0.019,19,12,0.019,19,12,0.019,19,12,0.019,19
57,0.019,50,9,0.019,10,31,0.013187895631567002,11,20,0.019,52,10,0.019,12,19,0.019,23,12,0.012758745132413788,19,59,0.02001810136668658,17,11,0.01148266042303297,19,11,0.019,19
14,0.017154897951818765,125,8,0.019,25,9,0.020835688900172344,26,16,0.019,104,10,0.02119824554287452,348,19,0.017048158070910292,53,10,0.021363383054612783,18,14,0.019,19,14,0.010952310021646506,12,11,0.019,332,13,0.011672,97,4,0.01524,125,5,0.012535,56,4,0.011474,278,13,0.0095908,37,6,0.018319,256,18,0.0129,96,4,0.019822,358,4,0.012535,343,4,0.019925,183,0.99523
13,0.011672,97,4,0.01524,125,5,0.012535,56,4,0.011474,278,13,0.0095908,37,6,0.018319,256,18,0.0129,96,4,0.019822,358,4,0.012535,343,4,0.019925,183
33,0.012839,140,46,0.011648,203,35,0.012534,201,49,0.011473,25,5,0.0095908,193,49,0.018318,256,59,0.012751,96,17,0.01203,285,31,0.020602,37,4,0.019335,282