22/11 --> 1668831611802-CVE-2007-1860-mod_jk-double-decoding
23/11 --> 1669154136895-apache-tomcat-manager-default-creds
24/11 --> 1669210696625-CVE-2016-10033-PHP-Mailer-RCE
25/11 --> 1669207161295-python-pickle-serialization