<svg width="16" height="16" viewBox="0 0 16 16" fill="none" xmlns="http://www.w3.org/2000/svg">
<path d="M12.1669 14.1801C12.123 14.1803 12.0795 14.1719 12.0389 14.1553C11.9983 14.1387 11.9614 14.1143 11.9302 14.0834L8.26355 10.4167C7.7953 9.95116 7.18554 9.65449 6.53021 9.57341L5.12021 9.40675C5.05832 9.39884 4.99988 9.37371 4.95156 9.33423C4.90324 9.29475 4.86697 9.24249 4.84688 9.18341C4.82878 9.12582 4.82666 9.06438 4.84075 9.00568C4.85484 8.94697 4.88461 8.89319 4.92688 8.85008L9.59355 4.18342C9.63948 4.13792 9.69765 4.10676 9.76098 4.09374C9.82431 4.08072 9.89006 4.0864 9.95021 4.11008C10.0108 4.13339 10.0633 4.17388 10.1012 4.22658C10.139 4.27928 10.1607 4.3419 10.1635 4.40675L10.2169 5.86008C10.2428 6.60315 10.5502 7.30858 11.0769 7.83341L14.6335 11.3801C14.6956 11.4425 14.7305 11.527 14.7305 11.6151C14.7305 11.7031 14.6956 11.7876 14.6335 11.8501L12.4035 14.0834C12.3724 14.1143 12.3355 14.1387 12.2948 14.1553C12.2542 14.1719 12.2107 14.1803 12.1669 14.1801V14.1801ZM5.88355 8.84675L6.61355 8.93341C7.41767 9.03161 8.16606 9.39525 8.74021 9.96675L12.1669 13.3767L13.9269 11.6134L10.5935 8.28008C9.94561 7.63632 9.56769 6.7696 9.53688 5.85675L9.51021 5.17008L5.88355 8.84675Z" fill="#4A4A4A"/>
<path d="M5.16301 9.41008C5.07556 9.40971 4.99176 9.37499 4.92967 9.31341L3.50634 7.89341C3.47545 7.86227 3.451 7.82533 3.43442 7.78471C3.41783 7.7441 3.40942 7.70061 3.40967 7.65674C3.40942 7.61288 3.41783 7.56939 3.43442 7.52878C3.451 7.48816 3.47545 7.45123 3.50634 7.42008L8.17301 2.75341C8.23509 2.69183 8.31889 2.65711 8.40634 2.65674C8.45021 2.65649 8.4937 2.6649 8.53431 2.68149C8.57492 2.69807 8.61186 2.72252 8.64301 2.75341L10.063 4.17341C10.0942 4.2044 10.119 4.24127 10.136 4.28189C10.1529 4.32251 10.1616 4.36607 10.1616 4.41008C10.1616 4.45408 10.1529 4.49765 10.136 4.53827C10.119 4.57889 10.0942 4.61576 10.063 4.64674L5.39634 9.31341C5.33425 9.37499 5.25045 9.40971 5.16301 9.41008ZM4.21301 7.66674L5.16301 8.61675L9.35967 4.41008L8.40967 3.46008L4.21301 7.66674Z" fill="#4A4A4A"/>
<path d="M7.88975 10.0368C7.84565 10.0366 7.80202 10.0277 7.7614 10.0105C7.72077 9.99338 7.68395 9.96832 7.65308 9.93683C7.591 9.87437 7.55615 9.78989 7.55615 9.70183C7.55615 9.61376 7.591 9.52928 7.65308 9.46683L10.0464 7.07349C10.1089 7.01141 10.1934 6.97656 10.2814 6.97656C10.3695 6.97656 10.454 7.01141 10.5164 7.07349C10.5785 7.13595 10.6133 7.22043 10.6133 7.30849C10.6133 7.39656 10.5785 7.48104 10.5164 7.54349L8.12308 9.93683C8.06154 9.99963 7.97767 10.0356 7.88975 10.0368V10.0368Z" fill="#4A4A4A"/>
<path d="M11.3333 13.0802C11.2894 13.0805 11.246 13.0721 11.2053 13.0555C11.1647 13.0389 11.1278 13.0144 11.0966 12.9836C11.0654 12.9526 11.0406 12.9157 11.0237 12.8751C11.0068 12.8345 10.998 12.7909 10.998 12.7469C10.998 12.7029 11.0068 12.6593 11.0237 12.6187C11.0406 12.5781 11.0654 12.5412 11.0966 12.5102L13.0966 10.5102C13.1276 10.479 13.1645 10.4542 13.2051 10.4373C13.2457 10.4203 13.2893 10.4116 13.3333 10.4116C13.3773 10.4116 13.4209 10.4203 13.4615 10.4373C13.5021 10.4542 13.539 10.479 13.57 10.5102C13.6321 10.5727 13.6669 10.6572 13.6669 10.7452C13.6669 10.8333 13.6321 10.9178 13.57 10.9802L11.57 12.9802C11.5391 13.0117 11.5023 13.0368 11.4617 13.0539C11.421 13.0711 11.3774 13.08 11.3333 13.0802V13.0802Z" fill="#4A4A4A"/>
<path d="M5.00022 4.5668C4.95635 4.56705 4.91286 4.55864 4.87225 4.54206C4.83164 4.52547 4.7947 4.50103 4.76355 4.47013L3.31355 3.03013C3.25894 2.96637 3.23041 2.88434 3.23365 2.80045C3.23689 2.71656 3.27166 2.63698 3.33103 2.57761C3.39039 2.51825 3.46997 2.48347 3.55387 2.48023C3.63776 2.47699 3.71978 2.50552 3.78355 2.56013L5.22355 4.00013C5.28563 4.06259 5.32048 4.14707 5.32048 4.23513C5.32048 4.32319 5.28563 4.40768 5.22355 4.47013C5.16395 4.52935 5.08418 4.56387 5.00022 4.5668Z" fill="#F8CE4C"/>
<path d="M6.38997 3.21676C6.30157 3.21676 6.21678 3.18164 6.15427 3.11913C6.09176 3.05662 6.05664 2.97183 6.05664 2.88343V0.846761C6.05664 0.758356 6.09176 0.673571 6.15427 0.611059C6.21678 0.548547 6.30157 0.513428 6.38997 0.513428C6.47838 0.513428 6.56316 0.548547 6.62568 0.611059C6.68819 0.673571 6.72331 0.758356 6.72331 0.846761V2.88343C6.72331 2.97183 6.68819 3.05662 6.62568 3.11913C6.56316 3.18164 6.47838 3.21676 6.38997 3.21676Z" fill="#F8CE4C"/>
<path d="M3.6366 5.96989H1.59993C1.51153 5.96989 1.42674 5.93477 1.36423 5.87226C1.30172 5.80975 1.2666 5.72496 1.2666 5.63656C1.2666 5.54815 1.30172 5.46337 1.36423 5.40085C1.42674 5.33834 1.51153 5.30322 1.59993 5.30322H3.6366C3.72501 5.30322 3.80979 5.33834 3.8723 5.40085C3.93482 5.46337 3.96993 5.54815 3.96993 5.63656C3.96993 5.72496 3.93482 5.80975 3.8723 5.87226C3.80979 5.93477 3.72501 5.96989 3.6366 5.96989Z" fill="#F8CE4C"/>
</svg>
