<svg width="28" height="14" viewBox="0 0 28 14" fill="none" xmlns="http://www.w3.org/2000/svg">
<path d="M26.6665 14H1.33317C1.15636 14 0.98679 13.9298 0.861766 13.8047C0.736742 13.6797 0.666504 13.5101 0.666504 13.3333V1.33332C0.666504 1.15651 0.736742 0.986943 0.861766 0.861919C0.98679 0.736895 1.15636 0.666656 1.33317 0.666656H3.4665C3.64331 0.666656 3.81288 0.736895 3.93791 0.861919C4.06293 0.986943 4.13317 1.15651 4.13317 1.33332C4.13317 1.51013 4.06293 1.6797 3.93791 1.80473C3.81288 1.92975 3.64331 1.99999 3.4665 1.99999H1.99984V12.6667H25.9998V1.99999H6.4465C6.26969 1.99999 6.10012 1.92975 5.9751 1.80473C5.85008 1.6797 5.77984 1.51013 5.77984 1.33332C5.77984 1.15651 5.85008 0.986943 5.9751 0.861919C6.10012 0.736895 6.26969 0.666656 6.4465 0.666656H26.6665C26.8433 0.666656 27.0129 0.736895 27.1379 0.861919C27.2629 0.986943 27.3332 1.15651 27.3332 1.33332V13.3333C27.3332 13.5101 27.2629 13.6797 27.1379 13.8047C27.0129 13.9298 26.8433 14 26.6665 14Z" fill="#4A4A4A"/>
<path d="M5.37974 8.31331C6.10507 8.31331 6.69307 7.72531 6.69307 6.99998C6.69307 6.27464 6.10507 5.68665 5.37974 5.68665C4.65441 5.68665 4.06641 6.27464 4.06641 6.99998C4.06641 7.72531 4.65441 8.31331 5.37974 8.31331Z" fill="#F8CE4C"/>
<path d="M22.8465 5.66666C22.5828 5.66666 22.325 5.74486 22.1058 5.89136C21.8865 6.03787 21.7156 6.24611 21.6147 6.48975C21.5138 6.73338 21.4874 7.00147 21.5388 7.26011C21.5903 7.51875 21.7172 7.75633 21.9037 7.9428C22.0902 8.12927 22.3278 8.25626 22.5864 8.30771C22.845 8.35915 23.1131 8.33275 23.3568 8.23183C23.6004 8.13091 23.8086 7.96002 23.9551 7.74075C24.1017 7.52149 24.1799 7.2637 24.1799 6.99999C24.1799 6.64637 24.0394 6.30723 23.7893 6.05718C23.5393 5.80713 23.2001 5.66666 22.8465 5.66666Z" fill="#F8CE4C"/>
<path d="M10.0598 8.45998L11.0798 5.33331H11.8398L10.4065 9.33331H9.73981L8.2998 5.33331H9.06647L10.0598 8.45998ZM14.3331 9.33331H13.6665V5.33331H14.3331V9.33331ZM18.9998 9.33331H18.7131L16.9998 6.49331V9.33331H16.3331V5.33331H16.6065L18.3331 8.17998V5.33331H18.9998V9.33331Z" fill="#4A4A4A"/>
<path d="M18.9996 9.66671H18.713C18.6554 9.66704 18.5988 9.65248 18.5486 9.62444C18.4983 9.59641 18.4562 9.55585 18.4263 9.50671L17.333 7.66671V9.33337C17.333 9.42178 17.2978 9.50656 17.2353 9.56908C17.1728 9.63159 17.088 9.66671 16.9996 9.66671H16.333C16.2446 9.66671 16.1598 9.63159 16.0973 9.56908C16.0347 9.50656 15.9996 9.42178 15.9996 9.33337V5.33337C15.9996 5.24497 16.0347 5.16018 16.0973 5.09767C16.1598 5.03516 16.2446 5.00004 16.333 5.00004H16.6063C16.6628 5.00021 16.7183 5.01504 16.7674 5.04308C16.8165 5.07113 16.8575 5.11143 16.8863 5.16004L17.9996 7.00004V5.33337C17.9996 5.24497 18.0347 5.16018 18.0973 5.09767C18.1598 5.03516 18.2446 5.00004 18.333 5.00004H18.9996C19.088 5.00004 19.1728 5.03516 19.2353 5.09767C19.2978 5.16018 19.333 5.24497 19.333 5.33337V9.33337C19.333 9.42178 19.2978 9.50656 19.2353 9.56908C19.1728 9.63159 19.088 9.66671 18.9996 9.66671ZM16.6663 9.00004V6.49337C16.6661 6.4481 16.6755 6.4033 16.6939 6.36193C16.7123 6.32056 16.7392 6.28356 16.773 6.25337L16.6663 6.08004V9.00004ZM18.553 8.43337L18.6663 8.61337V8.18004C18.6667 8.22793 18.6568 8.27535 18.6372 8.31906C18.6177 8.36278 18.5889 8.40177 18.553 8.43337ZM14.333 9.66671H13.6663C13.5779 9.66671 13.4931 9.63159 13.4306 9.56908C13.3681 9.50656 13.333 9.42178 13.333 9.33337V5.33337C13.333 5.24497 13.3681 5.16018 13.4306 5.09767C13.4931 5.03516 13.5779 5.00004 13.6663 5.00004H14.333C14.4214 5.00004 14.5062 5.03516 14.5687 5.09767C14.6312 5.16018 14.6663 5.24497 14.6663 5.33337V9.33337C14.6663 9.42178 14.6312 9.50656 14.5687 9.56908C14.5062 9.63159 14.4214 9.66671 14.333 9.66671ZM10.4063 9.66671H9.73963C9.67021 9.66709 9.60234 9.64621 9.54513 9.60688C9.48793 9.56756 9.44413 9.51166 9.41963 9.44671L7.9863 5.44671C7.96919 5.39555 7.96451 5.34107 7.97262 5.28774C7.98073 5.23442 8.00142 5.18379 8.03296 5.14004C8.06292 5.09702 8.10279 5.06184 8.1492 5.03748C8.19561 5.01311 8.24721 5.00027 8.29963 5.00004H9.0663C9.13669 4.99998 9.20523 5.02266 9.26169 5.06471C9.31815 5.10675 9.35952 5.16591 9.37963 5.23338L10.0463 7.38004L10.713 5.23338C10.7343 5.16538 10.777 5.10603 10.8346 5.06403C10.8921 5.02204 10.9617 4.99961 11.033 5.00004H11.793C11.8465 4.99919 11.8994 5.01151 11.9471 5.03592C11.9948 5.06033 12.0357 5.09609 12.0663 5.14004C12.0978 5.18379 12.1185 5.23442 12.1266 5.28774C12.1348 5.34107 12.1301 5.39555 12.113 5.44671L10.673 9.44671C10.6522 9.50387 10.6166 9.55443 10.5697 9.59313C10.5228 9.63182 10.4664 9.65723 10.4063 9.66671ZM9.99963 9.00004H10.1996L10.2996 8.72671C10.2368 8.76464 10.1661 8.78747 10.093 8.79337C10.024 8.79305 9.95667 8.77216 9.89963 8.73337L9.99963 9.00004ZM11.333 5.66671L10.8996 7.00004L11.3796 5.66671H11.333ZM8.7863 5.66671L9.21296 6.86671L8.81296 5.66671H8.7863Z" fill="#4A4A4A"/>
</svg>
