<svg width="16" height="16" viewBox="0 0 16 16" fill="none" xmlns="http://www.w3.org/2000/svg">
<path d="M4.1 12.1901C4.01159 12.1901 3.92681 12.155 3.8643 12.0925C3.80179 12.03 3.76667 11.9452 3.76667 11.8568C3.76578 11.5798 3.65512 11.3144 3.45893 11.1189C3.26274 10.9233 2.99702 10.8135 2.72 10.8135C2.49456 10.8139 2.27125 10.7699 2.06281 10.6841C1.85436 10.5982 1.66487 10.4721 1.50516 10.313C1.34544 10.1539 1.21862 9.96493 1.13195 9.75683C1.04527 9.54872 1.00044 9.32558 1 9.10014V8.18681C1.00088 7.73298 1.18178 7.29804 1.503 6.97745C1.82422 6.65686 2.25951 6.47681 2.71333 6.47681H5.07C5.15841 6.47681 5.24319 6.51193 5.3057 6.57444C5.36821 6.63695 5.40333 6.72173 5.40333 6.81014C5.40333 6.89855 5.36821 6.98333 5.3057 7.04584C5.24319 7.10835 5.15841 7.14347 5.07 7.14347H2.72C2.58227 7.1426 2.44572 7.16891 2.31818 7.22091C2.19064 7.27291 2.07462 7.34957 1.97676 7.44649C1.87891 7.54342 1.80114 7.65871 1.74793 7.78574C1.69472 7.91278 1.6671 8.04907 1.66667 8.18681V9.10014C1.66755 9.37746 1.7781 9.64318 1.9742 9.83927C2.1703 10.0354 2.43601 10.1459 2.71333 10.1468C3.16716 10.1468 3.60245 10.3269 3.92367 10.6475C4.24488 10.968 4.42578 11.403 4.42667 11.8568C4.42668 11.9441 4.39248 12.0279 4.3314 12.0902C4.27033 12.1525 4.18725 12.1884 4.1 12.1901Z" fill="#F8CE4C"/>
<path d="M12.4098 9.81006H5.0765C4.98809 9.81006 4.90331 9.77494 4.8408 9.71243C4.77828 9.64992 4.74316 9.56513 4.74316 9.47673V4.14339C4.74316 4.05499 4.77828 3.9702 4.8408 3.90769C4.90331 3.84518 4.98809 3.81006 5.0765 3.81006H12.4098C12.4982 3.81006 12.583 3.84518 12.6455 3.90769C12.708 3.9702 12.7432 4.05499 12.7432 4.14339V9.47673C12.7432 9.56513 12.708 9.64992 12.6455 9.71243C12.583 9.77494 12.4982 9.81006 12.4098 9.81006ZM5.40983 9.14339H12.0765V4.47673H5.40983V9.14339Z" fill="#4A4A4A"/>
<path d="M14.6667 9.14346C14.6291 9.14303 14.5919 9.13627 14.5567 9.12346L12.3 8.35012C12.2344 8.3272 12.1776 8.28435 12.1376 8.22758C12.0975 8.1708 12.0762 8.10293 12.0767 8.03346V5.58346C12.0769 5.51455 12.0986 5.44742 12.1386 5.39131C12.1786 5.3352 12.235 5.29286 12.3 5.27012L14.55 4.49346C14.6003 4.47589 14.6542 4.47066 14.7069 4.4782C14.7597 4.48574 14.8099 4.50583 14.8533 4.53679C14.8969 4.56779 14.9323 4.6088 14.9567 4.65637C14.9811 4.70394 14.9936 4.75668 14.9933 4.81012V8.81012C14.9931 8.86301 14.9803 8.91507 14.9559 8.96202C14.9316 9.00897 14.8964 9.04945 14.8533 9.08012C14.7989 9.11957 14.7339 9.14165 14.6667 9.14346ZM12.75 7.81012L14.3333 8.33346V5.27679L12.75 5.82012V7.81012Z" fill="#4A4A4A"/>
</svg>
