<svg width="32" height="32" viewBox="0 0 32 32" fill="none" xmlns="http://www.w3.org/2000/svg">
<path d="M28 20H10.6667C10.4899 20 10.3203 19.9298 10.1953 19.8048C10.0702 19.6797 10 19.5102 10 19.3334C10 19.1565 10.0702 18.987 10.1953 18.8619C10.3203 18.7369 10.4899 18.6667 10.6667 18.6667H28C28.1768 18.6667 28.3464 18.7369 28.4714 18.8619C28.5964 18.987 28.6667 19.1565 28.6667 19.3334C28.6667 19.5102 28.5964 19.6797 28.4714 19.8048C28.3464 19.9298 28.1768 20 28 20Z" fill="#4A4A4A"/>
<path d="M10.6667 25.9999C10.4899 25.9999 10.3203 25.9297 10.1953 25.8047C10.0702 25.6796 10 25.5101 10 25.3333C10 25.1564 10.0702 24.9869 10.1953 24.8618C10.3203 24.7368 10.4899 24.6666 10.6667 24.6666L21.3333 24.6266C21.5101 24.6266 21.6797 24.6968 21.8047 24.8219C21.9298 24.9469 22 25.1164 22 25.2933C22 25.4701 21.9298 25.6396 21.8047 25.7647C21.6797 25.8897 21.5101 25.9599 21.3333 25.9599L10.6667 25.9999Z" fill="#4A4A4A"/>
<path d="M5.66667 21.3333C6.58714 21.3333 7.33333 20.5871 7.33333 19.6667C7.33333 18.7462 6.58714 18 5.66667 18C4.74619 18 4 18.7462 4 19.6667C4 20.5871 4.74619 21.3333 5.66667 21.3333Z" fill="#F8CE4C"/>
<path d="M5.66667 26.6667C6.58714 26.6667 7.33333 25.9205 7.33333 25C7.33333 24.0795 6.58714 23.3333 5.66667 23.3333C4.74619 23.3333 4 24.0795 4 25C4 25.9205 4.74619 26.6667 5.66667 26.6667Z" fill="#F8CE4C"/>
<path d="M10.0599 13.3333C9.95828 13.3337 9.85795 13.3109 9.76653 13.2666C9.26614 13.0348 8.84514 12.6607 8.55608 12.1911C8.26703 11.7214 8.12274 11.177 8.14123 10.6259C8.15972 10.0747 8.34017 9.54119 8.66005 9.09197C8.97993 8.64275 9.42506 8.29772 9.93986 8.09996L14.8665 6.31996C15.84 5.96727 16.8763 5.82128 17.9094 5.8913C18.9424 5.96132 19.9495 6.24581 20.8665 6.72663C21.3945 6.95049 21.9382 7.13543 22.4932 7.27996L23.5199 7.59996C25.0465 8.10663 25.9265 9.1933 25.9265 10.5733C25.942 11.297 25.7064 12.0036 25.2599 12.5733C25.1467 12.7103 24.9837 12.7968 24.8068 12.8137C24.6299 12.8305 24.4536 12.7765 24.3165 12.6633C24.1795 12.5501 24.093 12.3872 24.0762 12.2103C24.0593 12.0334 24.1134 11.857 24.2265 11.72C24.4815 11.4002 24.6181 11.0022 24.6132 10.5933C24.5862 10.1843 24.4253 9.79564 24.1554 9.4872C23.8855 9.17875 23.5216 8.96771 23.1199 8.88663C22.8199 8.78663 22.4532 8.67996 22.1332 8.57996C21.4927 8.40582 20.8664 8.18295 20.2599 7.9133C19.5075 7.51719 18.6811 7.28183 17.833 7.22215C16.9848 7.16247 16.1336 7.27978 15.3332 7.56663L10.4199 9.36663C10.1489 9.47314 9.91541 9.6572 9.74855 9.89576C9.5817 10.1343 9.4889 10.4168 9.48179 10.7078C9.47467 10.9989 9.55355 11.2856 9.70855 11.532C9.86355 11.7784 10.0878 11.9737 10.3532 12.0933C10.4887 12.1589 10.598 12.2685 10.6633 12.4042C10.7286 12.5398 10.7461 12.6936 10.7128 12.8405C10.6796 12.9873 10.5976 13.1186 10.4803 13.2129C10.3629 13.3073 10.2171 13.3591 10.0665 13.36L10.0599 13.3333Z" fill="#4A4A4A"/>
<path d="M18.6667 13.3333H16.6667C16.4899 13.3333 16.3203 13.2631 16.1953 13.1381C16.0702 13.013 16 12.8435 16 12.6667C16 12.4899 16.0702 12.3203 16.1953 12.1953C16.3203 12.0702 16.4899 12 16.6667 12H18.6667C18.8435 12 19.013 12.0702 19.1381 12.1953C19.2631 12.3203 19.3333 12.4899 19.3333 12.6667C19.3333 12.8435 19.2631 13.013 19.1381 13.1381C19.013 13.2631 18.8435 13.3333 18.6667 13.3333Z" fill="#4A4A4A"/>
<path d="M13.0002 14C13.9206 14 14.6668 13.2538 14.6668 12.3334C14.6668 11.4129 13.9206 10.6667 13.0002 10.6667C12.0797 10.6667 11.3335 11.4129 11.3335 12.3334C11.3335 13.2538 12.0797 14 13.0002 14Z" fill="#F8CE4C"/>
<path d="M21.6667 14C22.5871 14 23.3333 13.2538 23.3333 12.3334C23.3333 11.4129 22.5871 10.6667 21.6667 10.6667C20.7462 10.6667 20 11.4129 20 12.3334C20 13.2538 20.7462 14 21.6667 14Z" fill="#F8CE4C"/>
</svg>
