<svg width="32" height="32" viewBox="0 0 32 32" fill="none" xmlns="http://www.w3.org/2000/svg">
<path d="M12 16H10.6667C10.4899 16 10.3203 15.9298 10.1953 15.8048C10.0702 15.6797 10 15.5102 10 15.3334C10 15.1565 10.0702 14.987 10.1953 14.8619C10.3203 14.7369 10.4899 14.6667 10.6667 14.6667H12C12.1768 14.6667 12.3464 14.7369 12.4714 14.8619C12.5964 14.987 12.6667 15.1565 12.6667 15.3334C12.6667 15.5102 12.5964 15.6797 12.4714 15.8048C12.3464 15.9298 12.1768 16 12 16Z" fill="#4A4A4A"/>
<path d="M20.6665 17.3333H19.3332C19.1564 17.3333 18.9868 17.2631 18.8618 17.1381C18.7367 17.013 18.6665 16.8435 18.6665 16.6667C18.6665 16.4899 18.7367 16.3203 18.8618 16.1953C18.9868 16.0702 19.1564 16 19.3332 16H20.6665C20.8433 16 21.0129 16.0702 21.1379 16.1953C21.2629 16.3203 21.3332 16.4899 21.3332 16.6667C21.3332 16.8435 21.2629 17.013 21.1379 17.1381C21.0129 17.2631 20.8433 17.3333 20.6665 17.3333Z" fill="#4A4A4A"/>
<path d="M13.4268 13.8666C13.339 13.8671 13.252 13.8503 13.1708 13.8172C13.0896 13.784 13.0157 13.7351 12.9534 13.6733L12.3734 13.0866C12.2488 12.9593 12.1798 12.7877 12.1817 12.6096C12.1836 12.4314 12.2561 12.2613 12.3834 12.1366C12.5107 12.012 12.6823 11.943 12.8605 11.9449C13.0387 11.9468 13.2088 12.0193 13.3334 12.1466L13.9201 12.7266C13.9826 12.7886 14.0322 12.8624 14.066 12.9436C14.0999 13.0248 14.1173 13.112 14.1173 13.2C14.1173 13.288 14.0999 13.3751 14.066 13.4564C14.0322 13.5376 13.9826 13.6113 13.9201 13.6733C13.8554 13.7375 13.7783 13.7878 13.6935 13.8211C13.6086 13.8543 13.5178 13.8698 13.4268 13.8666Z" fill="#F8CE4C"/>
<path d="M16.0002 13.3334C15.8234 13.3334 15.6538 13.2631 15.5288 13.1381C15.4037 13.0131 15.3335 12.8435 15.3335 12.6667V11.3334C15.3335 11.1565 15.4037 10.987 15.5288 10.8619C15.6538 10.7369 15.8234 10.6667 16.0002 10.6667C16.177 10.6667 16.3465 10.7369 16.4716 10.8619C16.5966 10.987 16.6668 11.1565 16.6668 11.3334V12.6667C16.6668 12.8435 16.5966 13.0131 16.4716 13.1381C16.3465 13.2631 16.177 13.3334 16.0002 13.3334Z" fill="#F8CE4C"/>
<path d="M18.5465 13.8666C18.4141 13.8674 18.2845 13.8287 18.1741 13.7555C18.0638 13.6823 17.9777 13.5779 17.9269 13.4556C17.8762 13.3333 17.863 13.1987 17.889 13.0688C17.915 12.939 17.9792 12.8199 18.0732 12.7266L18.6599 12.1466C18.7196 12.0768 18.7932 12.0202 18.8759 11.9801C18.9586 11.9401 19.0487 11.9176 19.1405 11.9141C19.2323 11.9106 19.3239 11.926 19.4094 11.9595C19.495 11.9931 19.5726 12.0439 19.6376 12.1089C19.7026 12.1738 19.7534 12.2515 19.7869 12.3371C19.8205 12.4226 19.8359 12.5142 19.8324 12.606C19.8288 12.6978 19.8064 12.7879 19.7663 12.8706C19.7263 12.9533 19.6696 13.0269 19.5999 13.0866L19.0132 13.6733C18.889 13.7965 18.7214 13.8659 18.5465 13.8666Z" fill="#F8CE4C"/>
<path d="M12.8402 20.0533C12.6644 20.0508 12.4966 19.9789 12.3735 19.8533C12.2494 19.7284 12.1797 19.5594 12.1797 19.3833C12.1797 19.2072 12.2494 19.0382 12.3735 18.9133L12.9535 18.3266C13.0791 18.2011 13.2493 18.1306 13.4269 18.1306C13.6044 18.1306 13.7747 18.2011 13.9002 18.3266C14.0258 18.4522 14.0963 18.6224 14.0963 18.8C14.0963 18.9775 14.0258 19.1478 13.9002 19.2733L13.3135 19.8533C13.2518 19.9163 13.1782 19.9664 13.0969 20.0008C13.0157 20.0351 12.9284 20.0529 12.8402 20.0533Z" fill="#F8CE4C"/>
<path d="M16.0002 21.3334C15.8234 21.3334 15.6538 21.2631 15.5288 21.1381C15.4037 21.0131 15.3335 20.8435 15.3335 20.6667V19.3334C15.3335 19.1565 15.4037 18.987 15.5288 18.8619C15.6538 18.7369 15.8234 18.6667 16.0002 18.6667C16.177 18.6667 16.3465 18.7369 16.4716 18.8619C16.5966 18.987 16.6668 19.1565 16.6668 19.3334V20.6667C16.6668 20.8435 16.5966 21.0131 16.4716 21.1381C16.3465 21.2631 16.177 21.3334 16.0002 21.3334Z" fill="#F8CE4C"/>
<path d="M19.1265 20.0533C18.9507 20.0508 18.7829 19.979 18.6598 19.8533L18.0732 19.2733C18.0107 19.2114 17.9611 19.1376 17.9272 19.0564C17.8934 18.9752 17.876 18.888 17.876 18.8C17.876 18.712 17.8934 18.6249 17.9272 18.5436C17.9611 18.4624 18.0107 18.3886 18.0732 18.3267C18.1981 18.2025 18.3671 18.1328 18.5432 18.1328C18.7193 18.1328 18.8883 18.2025 19.0132 18.3267L19.5998 18.9133C19.6939 19.0066 19.758 19.1257 19.784 19.2556C19.8101 19.3854 19.7969 19.52 19.7461 19.6423C19.6953 19.7646 19.6093 19.869 19.4989 19.9422C19.3886 20.0154 19.2589 20.0541 19.1265 20.0533Z" fill="#F8CE4C"/>
<path d="M10.6665 17.3333H10.5132C3.11982 17.3333 2.31982 13.14 2.31982 11.3333C2.36649 8.34001 4.91982 5.33334 10.5132 5.33334H29.3332C29.51 5.33334 29.6795 5.40358 29.8046 5.52861C29.9296 5.65363 29.9998 5.8232 29.9998 6.00001C29.9998 6.17682 29.9296 6.34639 29.8046 6.47141C29.6795 6.59644 29.51 6.66668 29.3332 6.66668H10.5132C5.84649 6.66668 3.69316 9.01334 3.65316 11.3333C3.65316 14.9667 6.98649 15.8867 9.99982 16V14.6667H9.93316C5.93316 14.6667 5.50649 12.3333 5.50649 11.3333C5.50649 9.66668 6.90649 8.00001 9.93316 8.00001H19.9998C20.1766 8.00001 20.3462 8.07025 20.4712 8.19527C20.5963 8.3203 20.6665 8.48987 20.6665 8.66668C20.6665 8.84349 20.5963 9.01306 20.4712 9.13808C20.3462 9.26311 20.1766 9.33334 19.9998 9.33334H9.93316C7.81982 9.33334 6.85316 10.34 6.83982 11.3333C6.83982 12.6667 7.87982 13.3333 9.93316 13.3333H10.6665C10.8433 13.3333 11.0129 13.4036 11.1379 13.5286C11.2629 13.6536 11.3332 13.8232 11.3332 14V16.6667C11.3332 16.8435 11.2629 17.0131 11.1379 17.1381C11.0129 17.2631 10.8433 17.3333 10.6665 17.3333Z" fill="#4A4A4A"/>
<path d="M29.3334 9.33333H23.5534C23.3766 9.33333 23.207 9.2631 23.082 9.13807C22.957 9.01305 22.8867 8.84348 22.8867 8.66667C22.8867 8.48986 22.957 8.32029 23.082 8.19526C23.207 8.07024 23.3766 8 23.5534 8H29.3334C29.5102 8 29.6798 8.07024 29.8048 8.19526C29.9298 8.32029 30.0001 8.48986 30.0001 8.66667C30.0001 8.84348 29.9298 9.01305 29.8048 9.13807C29.6798 9.2631 29.5102 9.33333 29.3334 9.33333Z" fill="#4A4A4A"/>
<path d="M9.61333 26.6667H2.66667C2.48986 26.6667 2.32029 26.5964 2.19526 26.4714C2.07024 26.3464 2 26.1768 2 26C2 25.8232 2.07024 25.6536 2.19526 25.5286C2.32029 25.4036 2.48986 25.3333 2.66667 25.3333H9.61333C9.79014 25.3333 9.95971 25.4036 10.0847 25.5286C10.2098 25.6536 10.28 25.8232 10.28 26C10.28 26.1768 10.2098 26.3464 10.0847 26.4714C9.95971 26.5964 9.79014 26.6667 9.61333 26.6667Z" fill="#4A4A4A"/>
<path d="M21.4733 26.6667H12.84C12.6632 26.6667 12.4936 26.5964 12.3686 26.4714C12.2436 26.3464 12.1733 26.1768 12.1733 26C12.1733 25.8232 12.2436 25.6536 12.3686 25.5286C12.4936 25.4036 12.6632 25.3334 12.84 25.3334H21.5067C26.1733 25.3334 28.3267 22.9867 28.3667 20.6667C28.3667 16.82 24.6333 16 21.5067 16H21.3333V17.3334H22.04C26.04 17.3334 26.4733 19.6667 26.4733 20.6667C26.4733 22.3334 25.0667 24 22.04 24H2.66667C2.48986 24 2.32029 23.9298 2.19526 23.8048C2.07024 23.6797 2 23.5102 2 23.3334C2 23.1565 2.07024 22.987 2.19526 22.8619C2.32029 22.7369 2.48986 22.6667 2.66667 22.6667H22.04C24.16 22.6667 25.12 21.66 25.14 20.6667C25.14 19.3334 24.0933 18.6667 22.04 18.6667H20.6667C20.4899 18.6667 20.3203 18.5964 20.1953 18.4714C20.0702 18.3464 20 18.1768 20 18V15.3334C20 15.1565 20.0702 14.987 20.1953 14.8619C20.3203 14.7369 20.4899 14.6667 20.6667 14.6667H21.4733C28.8667 14.6667 29.6667 18.86 29.6667 20.6667C29.62 23.66 27.0667 26.6667 21.4733 26.6667Z" fill="#4A4A4A"/>
<path d="M15.9935 17.3334C16.7299 17.3334 17.3268 16.7364 17.3268 16C17.3268 15.2636 16.7299 14.6667 15.9935 14.6667C15.2571 14.6667 14.6602 15.2636 14.6602 16C14.6602 16.7364 15.2571 17.3334 15.9935 17.3334Z" fill="#F8CE4C"/>
</svg>
