{
  "id": 979,
  "created": "18.01.2019",
  "executor_name": "Алексей Чернов",
  "name": "X9FMXXEEBMCY63028",
  "photos_auto": [
    {
      "id": 61504,
      "image": "/media/reports/ppk/2019/01/18/id_61504/auto_165220.jpg",
      "embed_url": ""
    },
    {
      "id": 61503,
      "image": "/media/reports/ppk/2019/01/18/id_61503/auto_165220.jpg",
      "embed_url": ""
    },
    {
      "id": 61502,
      "image": "/media/reports/ppk/2019/01/18/id_61502/auto_165220.jpg",
      "embed_url": ""
    },
    {
      "id": 61501,
      "image": "/media/reports/ppk/2019/01/18/id_61501/auto_165220.jpg",
      "embed_url": ""
    },
    {
      "id": 61500,
      "image": "/media/reports/ppk/2019/01/18/id_61500/auto_165220.jpg",
      "embed_url": ""
    },
    {
      "id": 61499,
      "image": "/media/reports/ppk/2019/01/18/id_61499/auto_165220.jpg",
      "embed_url": ""
    },
    {
      "id": 61498,
      "image": "/media/reports/ppk/2019/01/18/id_61498/auto_165220.jpg",
      "embed_url": ""
    },
    {
      "id": 61497,
      "image": "/media/reports/ppk/2019/01/18/id_61497/auto_165220.jpg",
      "embed_url": ""
    },
    {
      "id": 61496,
      "image": "/media/reports/ppk/2019/01/18/id_61496/auto_165220.jpg",
      "embed_url": ""
    },
    {
      "id": 61495,
      "image": "/media/reports/ppk/2019/01/18/id_61495/auto_165220.jpg",
      "embed_url": ""
    },
    {
      "id": 61494,
      "image": "/media/reports/ppk/2019/01/18/id_61494/auto_165220.jpg",
      "embed_url": ""
    },
    {
      "id": 61493,
      "image": "/media/reports/ppk/2019/01/18/id_61493/auto_165220.jpg",
      "embed_url": ""
    },
    {
      "id": 61492,
      "image": "/media/reports/ppk/2019/01/18/id_61492/auto_165220.jpg",
      "embed_url": ""
    },
    {
      "id": 61491,
      "image": "/media/reports/ppk/2019/01/18/id_61491/auto_165220.jpg",
      "embed_url": ""
    },
    {
      "id": 61490,
      "image": "/media/reports/ppk/2019/01/18/id_61490/auto_165220.jpg",
      "embed_url": ""
    },
    {
      "id": 61489,
      "image": "/media/reports/ppk/2019/01/18/id_61489/auto_165220.jpg",
      "embed_url": ""
    },
    {
      "id": 61488,
      "image": "/media/reports/ppk/2019/01/18/id_61488/auto_165220.jpg",
      "embed_url": ""
    },
    {
      "id": 61487,
      "image": "/media/reports/ppk/2019/01/18/id_61487/auto_165220.jpg",
      "embed_url": ""
    },
    {
      "id": 61486,
      "image": "/media/reports/ppk/2019/01/18/id_61486/auto_165220.jpg",
      "embed_url": ""
    },
    {
      "id": 61485,
      "image": "/media/reports/ppk/2019/01/18/id_61485/auto_165220.jpg",
      "embed_url": ""
    },
    {
      "id": 61484,
      "image": "/media/reports/ppk/2019/01/18/id_61484/auto_165220.jpg",
      "embed_url": ""
    }
  ],
  "surrphotos_auto": [
    {
      "id": 1532,
      "image": "/media/reports/ppk/2019/01/18/id_1532/auto_165220.jpg"
    },
    {
      "id": 1531,
      "image": "/media/reports/ppk/2019/01/18/id_1531/auto_165220.jpg"
    },
    {
      "id": 1530,
      "image": "/media/reports/ppk/2019/01/18/id_1530/auto_165220.jpg"
    }
  ],
  "vin": null,
  "report_type": 0,
  "mileage": null,
  "cost_before": 1,
  "cost_after": 110,
  "cost_estimated": 109,
  "number_of_hosts": 0,
  "executor": {
    "id": 7,
    "first_name": "Алексей",
    "last_name": "Чернов",
    "email": "chelex@yandex.ru",
    "phone": "79688018880",
    "date_joined": "19.10.17 02:19",
    "full_name": "Алексей Чернов",
    "avatar": "/media/user/avatar/photo_2018-09-03_14-13-58.jpg",
    "avatar_thumbnail": "/media/CACHE/images/user/avatar/photo_2018-09-03_14-13-58/e9dcf984d240c5bd426bcfcf4fd221aa.jpg",
    "filials": [
      "Владивосток",
      "Воронеж",
      "Екатеринбург",
      "Казань",
      "Краснодар",
      "Москва",
      "Нижний Новгород",
      "Новосибирск",
      "Ростов-на-Дону",
      "Самара",
      "Санкт-Петербург",
      "Тула",
      "Уфа"
    ],
    "groups": [
      "Администратор"
    ],
    "user_sid": [],
    "user_fid": [
      {
        "id": 1,
        "text": "",
        "view": false,
        "recieve": false,
        "read": false,
        "date": "2018-09-05T09:17:19.546296Z",
        "modified": "2018-09-05T09:17:19.546317Z",
        "room": {
          "id": 1,
          "name": null,
          "show": false,
          "date": "2018-09-05T09:17:16.225513Z",
          "modified": "2018-09-05T09:17:19.502644Z",
          "locked": false,
          "rsid": 77,
          "rfid": 7,
          "current": 77
        },
        "sid": {
          "id": 77,
          "password": "pbkdf2_sha256$36000$bSm3y4dvGMeO$6HpqBnNxtBuwFekuhDPQolzd87XGCCfv6Edk5RtYbxc=",
          "last_login": null,
          "is_superuser": false,
          "username": "79313714051",
          "first_name": "Павел",
          "email": "fedoseev_ap@bk.ru",
          "is_staff": true,
          "is_active": true,
          "date_joined": "2018-06-29T19:19:58.000000Z",
          "patronymic": "Сергеевич",
          "phone": "79313714051",
          "last_name": "Федосеев",
          "avatar": "/media/user/avatar/%D0%A4%D0%B5%D0%B4%D0%BE%D1%81%D0%B5%D0%B5%D0%B2.JPG",
          "modified": "2018-12-24T19:22:55.397113Z",
          "expert_level": null,
          "groups": [
            2,
            1
          ],
          "user_permissions": [],
          "filials": [
            2
          ]
        },
        "fid": {
          "id": 7,
          "password": "pbkdf2_sha256$36000$uYfNLlUTczOK$EfwANJtuUpvq0qcJ2+js9bPmW5x0i5PS9AbbeyTnHmk=",
          "last_login": "2019-01-17T14:43:44.921092Z",
          "is_superuser": true,
          "username": "79688018880",
          "first_name": "Алексей",
          "email": "chelex@yandex.ru",
          "is_staff": true,
          "is_active": true,
          "date_joined": "2017-10-19T14:19:22.000000Z",
          "patronymic": "Александрович",
          "phone": "79688018880",
          "last_name": "Чернов",
          "avatar": "/media/user/avatar/photo_2018-09-03_14-13-58.jpg",
          "modified": "2019-01-17T14:43:24.720433Z",
          "expert_level": null,
          "groups": [
            5
          ],
          "user_permissions": [],
          "filials": [
            12,
            9,
            7,
            6,
            4,
            1,
            3,
            11,
            8,
            10,
            2,
            5,
            13
          ]
        },
        "notifications": []
      }
    ],
    "order": 0
  },
  "order": [],
  "auto": {
    "id": 720,
    "auto": " Ford Aerostar",
    "name": " Ford Aerostar X9FMXXEEBMCY63028",
    "year_auto": {
      "id": 108,
      "year": 2013
    },
    "body_type_auto": {
      "id": 1,
      "name": "Седан"
    },
    "transmission_type": "механическая",
    "engine_capacity": "1.6 л",
    "engine_type": "бензин",
    "drive_type": "передний",
    "author_type": "",
    "thumbnail": "https://img-fotki.yandex.ru/get/770612/312483962.a2d5/0_467f0e_7e865b4c_orig",
    "image": "",
    "report_count": 2,
    "photos_auto": [
      {
        "id": 14240,
        "image": null,
        "embed_url": "https://img-fotki.yandex.ru/get/770612/312483962.a2d5/0_467f0e_7e865b4c_orig"
      },
      {
        "id": 14241,
        "image": null,
        "embed_url": "https://img-fotki.yandex.ru/get/480528/312483962.a2d5/0_467f11_a04d5158_orig"
      },
      {
        "id": 14242,
        "image": null,
        "embed_url": "https://img-fotki.yandex.ru/get/767871/312483962.a2d5/0_467f14_c5dbc999_orig"
      },
      {
        "id": 14243,
        "image": null,
        "embed_url": "https://img-fotki.yandex.ru/get/480528/312483962.a2d5/0_467f17_9eb29cfb_orig"
      },
      {
        "id": 14225,
        "image": null,
        "embed_url": "https://img-fotki.yandex.ru/get/766807/312483962.a2d4/0_467ee1_b5dfbb1_orig"
      },
      {
        "id": 14226,
        "image": null,
        "embed_url": "https://img-fotki.yandex.ru/get/475949/312483962.a2d4/0_467ee4_c32adaee_orig"
      },
      {
        "id": 14219,
        "image": null,
        "embed_url": ""
      },
      {
        "id": 14227,
        "image": null,
        "embed_url": "https://img-fotki.yandex.ru/get/770612/312483962.a2d4/0_467ee7_4a991f23_orig"
      },
      {
        "id": 14228,
        "image": null,
        "embed_url": "https://img-fotki.yandex.ru/get/480528/312483962.a2d4/0_467eea_f3ee4ba3_orig"
      },
      {
        "id": 14229,
        "image": null,
        "embed_url": "https://img-fotki.yandex.ru/get/766807/312483962.a2d4/0_467eed_374d8f6d_orig"
      },
      {
        "id": 14230,
        "image": null,
        "embed_url": "https://img-fotki.yandex.ru/get/770612/312483962.a2d4/0_467ef0_325cee3c_orig"
      },
      {
        "id": 14221,
        "image": null,
        "embed_url": "https://img-fotki.yandex.ru/get/373240/312483962.a2d4/0_467ed5_2a4a245a_orig"
      },
      {
        "id": 14222,
        "image": null,
        "embed_url": "https://img-fotki.yandex.ru/get/1030038/312483962.a2d4/0_467ed8_a155ce08_orig"
      },
      {
        "id": 14223,
        "image": null,
        "embed_url": "https://img-fotki.yandex.ru/get/476913/312483962.a2d4/0_467edb_c6eb3426_orig"
      },
      {
        "id": 14224,
        "image": null,
        "embed_url": "https://img-fotki.yandex.ru/get/480528/312483962.a2d4/0_467ede_a2ec6a33_orig"
      },
      {
        "id": 14231,
        "image": null,
        "embed_url": "https://img-fotki.yandex.ru/get/480528/312483962.a2d4/0_467ef3_e357e809_orig"
      },
      {
        "id": 14232,
        "image": null,
        "embed_url": "https://img-fotki.yandex.ru/get/770612/312483962.a2d4/0_467ef6_aa1ca690_orig"
      },
      {
        "id": 14233,
        "image": null,
        "embed_url": "https://img-fotki.yandex.ru/get/373240/312483962.a2d4/0_467ef9_f84d5e39_orig"
      },
      {
        "id": 14234,
        "image": null,
        "embed_url": "https://img-fotki.yandex.ru/get/373240/312483962.a2d4/0_467efc_76be9ed6_orig"
      },
      {
        "id": 14235,
        "image": null,
        "embed_url": "https://img-fotki.yandex.ru/get/476913/312483962.a2d4/0_467eff_b03a8569_orig"
      },
      {
        "id": 14236,
        "image": null,
        "embed_url": "https://img-fotki.yandex.ru/get/766807/312483962.a2d4/0_467f02_6620ca83_orig"
      },
      {
        "id": 14237,
        "image": null,
        "embed_url": "https://img-fotki.yandex.ru/get/480528/312483962.a2d4/0_467f05_ba911db5_orig"
      },
      {
        "id": 14238,
        "image": null,
        "embed_url": "https://img-fotki.yandex.ru/get/770612/312483962.a2d5/0_467f08_d4ef117b_orig"
      },
      {
        "id": 14239,
        "image": null,
        "embed_url": "https://img-fotki.yandex.ru/get/1026686/312483962.a2d5/0_467f0b_988b7b3f_orig"
      },
      {
        "id": 14220,
        "image": null,
        "embed_url": "https://img-fotki.yandex.ru/get/480528/312483962.a2d3/0_467ecf_758061a1_orig"
      }
    ],
    "deleted": null,
    "created": "2019-01-15T07:10:19.913399Z",
    "modified": "2019-01-22T09:51:43.422484Z",
    "vin": "X9FMXXEEBMCY63028",
    "horsepower": 123,
    "color_auto": "Красный",
    "color_salon": null,
    "salon_auto": "кожа",
    "equipment": "Titanium",
    "cost": 0,
    "author": null,
    "owners": 112,
    "state": null,
    "mileage": 12321,
    "phone": null,
    "source": null,
    "location": null,
    "resell": false,
    "mark_auto": {
      "id": 441,
      "name": "Ford"
    },
    "model_auto": {
      "id": 7880,
      "name": "Aerostar",
      "mark_auto": 441
    },
    "generation": null,
    "notifications": []
  },
  "pluses": "Один владелец, ПТС оригинал\nАвтомобиль юридически чист\nОдин владелец, ПТС оригинал\nАвтомобиль юридически чист\nОдин владелец, ПТС оригинал\nАвтомобиль юридически чист",
  "minuses": "Трещина на лобовом стекле, рекомендуется заменить лобовое стекло (15-20 т руб)\nТрещина на лобовом стекле, рекомендуется заменить лобовое стекло (15-20 т руб)\nТрещина на лобовом стекле, рекомендуется заменить лобовое стекло (15-20 т руб)\nТрещина на лобовом стекле, рекомендуется заменить лобовое стекло (15-20 т руб)",
  "category": 1,
  "recommended": true,
  "result_expert": "123321123",
  "comment_expert": "",
  "comment_manager": "",
  "data": [
    {
      "name": "Общая информация",
      "with_comment": false
    },
    {
      "name": "Юридическая проверка",
      "groups": [
        {
          "fields": [
            {
              "type": "image",
              "multiple": true,
              "label": "Фото ГИБДД",
              "value": [
                {
                  "id": 61487,
                  "image_small": "/media/CACHE/images/reports/ppk/2019/01/18/id_61487/auto_165220/6613ca58cd7699c1cca236d1eb316a11.jpg",
                  "image": "/media/reports/ppk/2019/01/18/id_61487/auto_165220.jpg"
                },
                {
                  "id": 61488,
                  "image_small": "/media/CACHE/images/reports/ppk/2019/01/18/id_61488/auto_165220/3ec5a038d8b1b12589ca2ec40855c58f.jpg",
                  "image": "/media/reports/ppk/2019/01/18/id_61488/auto_165220.jpg"
                }
              ]
            },
            {
              "type": "image",
              "multiple": true,
              "label": "Фото MyCreditInfo",
              "value": [
                {
                  "id": 61489,
                  "image_small": "/media/CACHE/images/reports/ppk/2019/01/18/id_61489/auto_165220/dd750b629fe6f2768f5a888bef098d97.jpg",
                  "image": "/media/reports/ppk/2019/01/18/id_61489/auto_165220.jpg"
                },
                {
                  "id": 61490,
                  "image_small": "/media/CACHE/images/reports/ppk/2019/01/18/id_61490/auto_165220/2ab6e07cc96a1dd3734d9b3ca33519c6.jpg",
                  "image": "/media/reports/ppk/2019/01/18/id_61490/auto_165220.jpg"
                }
              ]
            },
            {
              "type": "image",
              "multiple": true,
              "label": "Фото ФССП",
              "value": [
                {
                  "id": 61491,
                  "image_small": "/media/CACHE/images/reports/ppk/2019/01/18/id_61491/auto_165220/0a9fd0ca022f802e8f17d87fe02ed19a.jpg",
                  "image": "/media/reports/ppk/2019/01/18/id_61491/auto_165220.jpg"
                },
                {
                  "id": 61492,
                  "image_small": "/media/CACHE/images/reports/ppk/2019/01/18/id_61492/auto_165220/5ed95e9c35722a9283913fdc754b56fd.jpg",
                  "image": "/media/reports/ppk/2019/01/18/id_61492/auto_165220.jpg"
                }
              ]
            },
            {
              "type": "image",
              "multiple": true,
              "label": "Фото с реестра залогов",
              "value": [
                {
                  "id": 61493,
                  "image_small": "/media/CACHE/images/reports/ppk/2019/01/18/id_61493/auto_165220/38c7c73a0ddc897098f2fe666e64dd44.jpg",
                  "image": "/media/reports/ppk/2019/01/18/id_61493/auto_165220.jpg"
                },
                {
                  "id": 61494,
                  "image_small": "/media/CACHE/images/reports/ppk/2019/01/18/id_61494/auto_165220/27173d9e6f0e48f9195b9928000a9c6b.jpg",
                  "image": "/media/reports/ppk/2019/01/18/id_61494/auto_165220.jpg"
                }
              ]
            },
            {
              "type": "image",
              "multiple": true,
              "label": "Фото Автокод",
              "value": [
                {
                  "id": 61495,
                  "image_small": "/media/CACHE/images/reports/ppk/2019/01/18/id_61495/auto_165220/b2dfdaaa67e5be236de763e3f8a4f2af.jpg",
                  "image": "/media/reports/ppk/2019/01/18/id_61495/auto_165220.jpg"
                },
                {
                  "id": 61496,
                  "image_small": "/media/CACHE/images/reports/ppk/2019/01/18/id_61496/auto_165220/1223e6bd889b85733439f92e73c6a08a.jpg",
                  "image": "/media/reports/ppk/2019/01/18/id_61496/auto_165220.jpg"
                }
              ]
            },
            {
              "type": "image",
              "multiple": true,
              "label": "Фото Доп. сервисы",
              "value": [
                {
                  "id": 61497,
                  "image_small": "/media/CACHE/images/reports/ppk/2019/01/18/id_61497/auto_165220/86579d7924ccf1917fc362b3beda7180.jpg",
                  "image": "/media/reports/ppk/2019/01/18/id_61497/auto_165220.jpg"
                },
                {
                  "id": 61498,
                  "image_small": "/media/CACHE/images/reports/ppk/2019/01/18/id_61498/auto_165220/ac16b08f9dd300a6592f0ed40e7de90b.jpg",
                  "image": "/media/reports/ppk/2019/01/18/id_61498/auto_165220.jpg"
                }
              ]
            }
          ]
        }
      ],
      "with_comment": true,
      "comment": "Комментарий к разделу Юридическая проверка\n\n"
    },
    {
      "name": "Кузов",
      "groups": [
        {
          "name": "Внешние элементы",
          "fields": [
            {
              "type": "body",
              "top": 50,
              "left": 50,
              "negative": {
                "type": "checkbox",
                "items": [
                  {
                    "label": "Окрашено"
                  },
                  {
                    "label": "Скол/царапина"
                  },
                  {
                    "label": "Вмятина"
                  },
                  {
                    "label": "Коррозия/ржавчина"
                  },
                  {
                    "label": "Заменено"
                  }
                ]
              },
              "data_id": 1,
              "label": "Крыша",
              "value": true
            },
            {
              "type": "body",
              "top": 28,
              "left": 50,
              "comment": "-Капот",
              "negative": {
                "type": "checkbox",
                "items": [
                  {
                    "label": "Окрашено",
                    "value": true
                  },
                  {
                    "label": "Скол/царапина"
                  },
                  {
                    "label": "Вмятина"
                  },
                  {
                    "label": "Коррозия/ржавчина"
                  },
                  {
                    "label": "Заменено",
                    "value": true
                  }
                ]
              },
              "data_id": 20,
              "label": "Капот",
              "value": false
            },
            {
              "type": "body",
              "top": 75,
              "left": 50,
              "negative": {
                "type": "checkbox",
                "items": [
                  {
                    "label": "Окрашено"
                  },
                  {
                    "label": "Скол/царапина"
                  },
                  {
                    "label": "Вмятина"
                  },
                  {
                    "label": "Коррозия/ржавчина"
                  },
                  {
                    "label": "Заменено"
                  }
                ]
              },
              "data_id": 9,
              "label": "Багажник",
              "value": true
            },
            {
              "type": "body",
              "top": 12,
              "left": 50,
              "negative": {
                "type": "checkbox",
                "items": [
                  {
                    "label": "Окрашено"
                  },
                  {
                    "label": "Скол/царапина"
                  },
                  {
                    "label": "Вмятина"
                  },
                  {
                    "label": "Коррозия/ржавчина"
                  },
                  {
                    "label": "Заменено"
                  }
                ]
              },
              "data_id": 22,
              "label": "Передний бампер",
              "value": false
            },
            {
              "type": "body",
              "top": 86,
              "left": 50,
              "negative": {
                "type": "checkbox",
                "items": [
                  {
                    "label": "Окрашено"
                  },
                  {
                    "label": "Скол/царапина"
                  },
                  {
                    "label": "Вмятина"
                  },
                  {
                    "label": "Коррозия/ржавчина"
                  },
                  {
                    "label": "Заменено"
                  }
                ]
              },
              "data_id": 11,
              "label": "Задний бампер",
              "value": true
            },
            {
              "type": "body",
              "top": 30,
              "left": 25,
              "comment": "Переднее левое крыло",
              "negative": {
                "type": "checkbox",
                "items": [
                  {
                    "label": "Окрашено"
                  },
                  {
                    "label": "Скол/царапина"
                  },
                  {
                    "label": "Вмятина"
                  },
                  {
                    "label": "Коррозия/ржавчина"
                  },
                  {
                    "label": "Заменено"
                  }
                ]
              },
              "data_id": 19,
              "label": "Переднее левое крыло",
              "value": false
            },
            {
              "type": "body",
              "top": 30,
              "left": 75,
              "negative": {
                "type": "checkbox",
                "items": [
                  {
                    "label": "Окрашено"
                  },
                  {
                    "label": "Скол/царапина"
                  },
                  {
                    "label": "Вмятина"
                  },
                  {
                    "label": "Коррозия/ржавчина"
                  },
                  {
                    "label": "Заменено"
                  }
                ]
              },
              "data_id": 2,
              "label": "Переднее правое крыло",
              "value": true
            },
            {
              "type": "body",
              "top": 44,
              "left": 22,
              "negative": {
                "type": "checkbox",
                "items": [
                  {
                    "label": "Окрашено"
                  },
                  {
                    "label": "Скол/царапина"
                  },
                  {
                    "label": "Вмятина"
                  },
                  {
                    "label": "Коррозия/ржавчина"
                  },
                  {
                    "label": "Заменено"
                  }
                ]
              },
              "data_id": 17,
              "label": "Передняя левая дверь",
              "value": false
            },
            {
              "type": "body",
              "top": 44,
              "left": 78,
              "negative": {
                "type": "checkbox",
                "items": [
                  {
                    "label": "Окрашено"
                  },
                  {
                    "label": "Скол/царапина"
                  },
                  {
                    "label": "Вмятина"
                  },
                  {
                    "label": "Коррозия/ржавчина"
                  },
                  {
                    "label": "Заменено"
                  }
                ]
              },
              "data_id": 3,
              "label": "Передняя правая дверь",
              "value": true
            },
            {
              "type": "body",
              "top": 56,
              "left": 22,
              "negative": {
                "type": "checkbox",
                "items": [
                  {
                    "label": "Окрашено"
                  },
                  {
                    "label": "Скол/царапина"
                  },
                  {
                    "label": "Вмятина"
                  },
                  {
                    "label": "Коррозия/ржавчина"
                  },
                  {
                    "label": "Заменено"
                  }
                ]
              },
              "data_id": 15,
              "label": "Задняя левая дверь",
              "value": true
            },
            {
              "type": "body",
              "top": 56,
              "left": 78,
              "negative": {
                "type": "checkbox",
                "items": [
                  {
                    "label": "Окрашено"
                  },
                  {
                    "label": "Скол/царапина"
                  },
                  {
                    "label": "Вмятина"
                  },
                  {
                    "label": "Коррозия/ржавчина"
                  },
                  {
                    "label": "Заменено"
                  }
                ]
              },
              "data_id": 5,
              "label": "Задняя правая дверь",
              "value": true
            },
            {
              "type": "body",
              "top": 70,
              "left": 25,
              "negative": {
                "type": "checkbox",
                "items": [
                  {
                    "label": "Окрашено"
                  },
                  {
                    "label": "Скол/царапина"
                  },
                  {
                    "label": "Вмятина"
                  },
                  {
                    "label": "Коррозия/ржавчина"
                  },
                  {
                    "label": "Заменено"
                  }
                ]
              },
              "data_id": 13,
              "label": "Заднее левое крыло",
              "value": true
            },
            {
              "type": "body",
              "top": 70,
              "left": 75,
              "negative": {
                "type": "checkbox",
                "items": [
                  {
                    "label": "Окрашено"
                  },
                  {
                    "label": "Скол/царапина"
                  },
                  {
                    "label": "Вмятина"
                  },
                  {
                    "label": "Коррозия/ржавчина"
                  },
                  {
                    "label": "Заменено"
                  }
                ]
              },
              "data_id": 8,
              "label": "Заднее правое крыло",
              "value": true
            },
            {
              "type": "body",
              "top": 50,
              "left": 15,
              "negative": {
                "type": "checkbox",
                "items": [
                  {
                    "label": "Окрашено"
                  },
                  {
                    "label": "Скол/царапина"
                  },
                  {
                    "label": "Вмятина"
                  },
                  {
                    "label": "Коррозия/ржавчина"
                  },
                  {
                    "label": "Заменено"
                  }
                ]
              },
              "data_id": 14,
              "label": "Левый порог",
              "value": true
            },
            {
              "type": "body",
              "top": 50,
              "left": 85,
              "negative": {
                "type": "checkbox",
                "items": [
                  {
                    "label": "Окрашено"
                  },
                  {
                    "label": "Скол/царапина"
                  },
                  {
                    "label": "Вмятина"
                  },
                  {
                    "label": "Коррозия/ржавчина"
                  },
                  {
                    "label": "Заменено"
                  }
                ]
              },
              "data_id": 7,
              "label": "Правый порог",
              "value": true
            },
            {
              "type": "body",
              "top": 40,
              "left": 50,
              "negative": {
                "type": "checkbox",
                "items": [
                  {
                    "label": "Скол"
                  },
                  {
                    "label": "Трещина"
                  },
                  {
                    "label": "Запотевание"
                  },
                  {
                    "label": "Заменено"
                  }
                ]
              },
              "data_id": 21,
              "label": "Лобовое стекло",
              "value": true
            },
            {
              "type": "body",
              "top": 48,
              "left": 32,
              "negative": {
                "type": "checkbox",
                "items": [
                  {
                    "label": "Скол"
                  },
                  {
                    "label": "Трещина"
                  },
                  {
                    "label": "Запотевание"
                  },
                  {
                    "label": "Заменено"
                  }
                ]
              },
              "data_id": 18,
              "label": "Переднее левое стекло",
              "value": true
            },
            {
              "type": "body",
              "top": 48,
              "left": 68,
              "negative": {
                "type": "checkbox",
                "items": [
                  {
                    "label": "Скол"
                  },
                  {
                    "label": "Трещина"
                  },
                  {
                    "label": "Запотевание"
                  },
                  {
                    "label": "Заменено"
                  }
                ]
              },
              "data_id": 4,
              "label": "Переднее правое стекло",
              "value": true
            },
            {
              "type": "body",
              "top": 57,
              "left": 32,
              "negative": {
                "type": "checkbox",
                "items": [
                  {
                    "label": "Скол"
                  },
                  {
                    "label": "Трещина"
                  },
                  {
                    "label": "Запотевание"
                  },
                  {
                    "label": "Заменено"
                  }
                ]
              },
              "data_id": 16,
              "label": "Заднее левое стекло",
              "value": true
            },
            {
              "type": "body",
              "top": 57,
              "left": 68,
              "negative": {
                "type": "checkbox",
                "items": [
                  {
                    "label": "Скол"
                  },
                  {
                    "label": "Трещина"
                  },
                  {
                    "label": "Запотевание"
                  },
                  {
                    "label": "Заменено"
                  }
                ]
              },
              "data_id": 6,
              "label": "Заднее правое стекло",
              "value": true
            },
            {
              "type": "body",
              "top": 68,
              "left": 50,
              "negative": {
                "type": "checkbox",
                "items": [
                  {
                    "label": "Скол"
                  },
                  {
                    "label": "Трещина"
                  },
                  {
                    "label": "Запотевание"
                  },
                  {
                    "label": "Заменено"
                  }
                ]
              },
              "data_id": 10,
              "label": "Заднее стекло",
              "value": true
            },
            {
              "type": "body",
              "styles": [
                {
                  "top": 16,
                  "left": 62
                },
                {
                  "top": 16,
                  "left": 38
                }
              ],
              "negative": {
                "type": "checkbox",
                "items": [
                  {
                    "label": "Скол"
                  },
                  {
                    "label": "Трещина"
                  },
                  {
                    "label": "Запотевание"
                  },
                  {
                    "label": "Заменено"
                  }
                ]
              },
              "data_id": 23,
              "label": "Передние фонари",
              "value": true
            },
            {
              "type": "body",
              "styles": [
                {
                  "top": 82,
                  "left": 40
                },
                {
                  "top": 82,
                  "left": 60
                }
              ],
              "negative": {
                "type": "checkbox",
                "items": [
                  {
                    "label": "Скол"
                  },
                  {
                    "label": "Трещина"
                  },
                  {
                    "label": "Запотевание"
                  },
                  {
                    "label": "Заменено"
                  }
                ]
              },
              "data_id": 12,
              "label": "Задние фонари",
              "value": true
            }
          ]
        },
        {
          "name": "Силовые элементы",
          "fields": [
            {
              "type": "body",
              "top": 39,
              "left": 25,
              "negative": {
                "type": "checkbox",
                "items": [
                  {
                    "label": "Окрашено"
                  },
                  {
                    "label": "Скол/царапина"
                  },
                  {
                    "label": "Вмятина"
                  },
                  {
                    "label": "Коррозия/ржавчина"
                  },
                  {
                    "label": "Заменено"
                  }
                ]
              },
              "data_id": 123,
              "label": "Стойка передняя левая",
              "value": true
            },
            {
              "type": "body",
              "top": 53,
              "left": 20,
              "negative": {
                "type": "checkbox",
                "items": [
                  {
                    "label": "Окрашено"
                  },
                  {
                    "label": "Скол/царапина"
                  },
                  {
                    "label": "Вмятина"
                  },
                  {
                    "label": "Коррозия/ржавчина"
                  },
                  {
                    "label": "Заменено"
                  }
                ]
              },
              "data_id": 125,
              "label": "Стойка центральная левая",
              "value": true
            },
            {
              "type": "body",
              "top": 70,
              "left": 75,
              "negative": {
                "type": "checkbox",
                "items": [
                  {
                    "label": "Окрашено"
                  },
                  {
                    "label": "Скол/царапина"
                  },
                  {
                    "label": "Вмятина"
                  },
                  {
                    "label": "Коррозия/ржавчина"
                  },
                  {
                    "label": "Заменено"
                  }
                ]
              },
              "data_id": 128,
              "label": "Стойка задняя правая",
              "value": true
            },
            {
              "type": "body",
              "top": 53,
              "left": 80,
              "negative": {
                "type": "checkbox",
                "items": [
                  {
                    "label": "Окрашено"
                  },
                  {
                    "label": "Скол/царапина"
                  },
                  {
                    "label": "Вмятина"
                  },
                  {
                    "label": "Коррозия/ржавчина"
                  },
                  {
                    "label": "Заменено"
                  }
                ]
              },
              "data_id": 126,
              "label": "Стойка центральная правая",
              "value": true
            },
            {
              "type": "body",
              "top": 70,
              "left": 25,
              "negative": {
                "type": "checkbox",
                "items": [
                  {
                    "label": "Окрашено"
                  },
                  {
                    "label": "Скол/царапина"
                  },
                  {
                    "label": "Вмятина"
                  },
                  {
                    "label": "Коррозия/ржавчина"
                  },
                  {
                    "label": "Заменено"
                  }
                ]
              },
              "data_id": 127,
              "label": "Стойка задняя левая",
              "value": true
            },
            {
              "type": "body",
              "top": 39,
              "left": 75,
              "negative": {
                "type": "checkbox",
                "items": [
                  {
                    "label": "Окрашено"
                  },
                  {
                    "label": "Скол/царапина"
                  },
                  {
                    "label": "Вмятина"
                  },
                  {
                    "label": "Коррозия/ржавчина"
                  },
                  {
                    "label": "Заменено"
                  }
                ]
              },
              "data_id": 124,
              "label": "Стойка передняя правая",
              "value": true
            },
            {
              "type": "body",
              "top": 16,
              "left": 41,
              "negative": {
                "type": "checkbox",
                "items": [
                  {
                    "label": "Окрашено"
                  },
                  {
                    "label": "Скол/царапина"
                  },
                  {
                    "label": "Вмятина"
                  },
                  {
                    "label": "Коррозия/ржавчина"
                  },
                  {
                    "label": "Заменено"
                  }
                ]
              },
              "data_id": 116,
              "label": "Передний лонжерон левый",
              "value": true
            },
            {
              "type": "body",
              "top": 16,
              "left": 59,
              "negative": {
                "type": "checkbox",
                "items": [
                  {
                    "label": "Окрашено"
                  },
                  {
                    "label": "Скол/царапина"
                  },
                  {
                    "label": "Вмятина"
                  },
                  {
                    "label": "Коррозия/ржавчина"
                  },
                  {
                    "label": "Заменено"
                  }
                ]
              },
              "data_id": 117,
              "label": "Передний лонжерон правый",
              "value": true
            },
            {
              "type": "body",
              "top": 22,
              "left": 40,
              "negative": {
                "type": "checkbox",
                "items": [
                  {
                    "label": "Окрашено"
                  },
                  {
                    "label": "Скол/царапина"
                  },
                  {
                    "label": "Вмятина"
                  },
                  {
                    "label": "Коррозия/ржавчина"
                  },
                  {
                    "label": "Заменено"
                  }
                ]
              },
              "data_id": 118,
              "label": "Чашка передняя левая",
              "value": true
            },
            {
              "type": "body",
              "top": 22,
              "left": 60,
              "negative": {
                "type": "checkbox",
                "items": [
                  {
                    "label": "Окрашено"
                  },
                  {
                    "label": "Скол/царапина"
                  },
                  {
                    "label": "Вмятина"
                  },
                  {
                    "label": "Коррозия/ржавчина"
                  },
                  {
                    "label": "Заменено"
                  }
                ]
              },
              "data_id": 119,
              "label": "Чашка передняя правая",
              "value": true
            },
            {
              "type": "body",
              "top": 25,
              "left": 50,
              "negative": {
                "type": "checkbox",
                "items": [
                  {
                    "label": "Окрашено"
                  },
                  {
                    "label": "Скол/царапина"
                  },
                  {
                    "label": "Вмятина"
                  },
                  {
                    "label": "Коррозия/ржавчина"
                  },
                  {
                    "label": "Заменено"
                  }
                ]
              },
              "data_id": 120,
              "label": "Моторный щит",
              "value": true
            },
            {
              "type": "body",
              "top": 35,
              "left": 50,
              "negative": {
                "type": "checkbox",
                "items": [
                  {
                    "label": "Окрашено"
                  },
                  {
                    "label": "Скол/царапина"
                  },
                  {
                    "label": "Вмятина"
                  },
                  {
                    "label": "Коррозия/ржавчина"
                  },
                  {
                    "label": "Заменено"
                  }
                ]
              },
              "data_id": 121,
              "label": "Центральный тоннель",
              "value": true
            },
            {
              "type": "body",
              "top": 40,
              "left": 46,
              "negative": {
                "type": "checkbox",
                "items": [
                  {
                    "label": "Окрашено"
                  },
                  {
                    "label": "Скол/царапина"
                  },
                  {
                    "label": "Вмятина"
                  },
                  {
                    "label": "Коррозия/ржавчина"
                  },
                  {
                    "label": "Заменено"
                  }
                ]
              },
              "data_id": 122,
              "label": "Пол",
              "value": true
            },
            {
              "type": "body",
              "top": 69,
              "left": 40,
              "negative": {
                "type": "checkbox",
                "items": [
                  {
                    "label": "Окрашено"
                  },
                  {
                    "label": "Скол/царапина"
                  },
                  {
                    "label": "Вмятина"
                  },
                  {
                    "label": "Коррозия/ржавчина"
                  },
                  {
                    "label": "Заменено"
                  }
                ]
              },
              "data_id": 131,
              "label": "Задняя чашка левая",
              "value": true
            },
            {
              "type": "body",
              "top": 69,
              "left": 60,
              "negative": {
                "type": "checkbox",
                "items": [
                  {
                    "label": "Окрашено"
                  },
                  {
                    "label": "Скол/царапина"
                  },
                  {
                    "label": "Вмятина"
                  },
                  {
                    "label": "Коррозия/ржавчина"
                  },
                  {
                    "label": "Заменено"
                  }
                ]
              },
              "data_id": 132,
              "label": "Задняя чашка правая",
              "value": true
            },
            {
              "type": "body",
              "top": 76,
              "left": 50,
              "negative": {
                "type": "checkbox",
                "items": [
                  {
                    "label": "Окрашено"
                  },
                  {
                    "label": "Скол/царапина"
                  },
                  {
                    "label": "Вмятина"
                  },
                  {
                    "label": "Коррозия/ржавчина"
                  },
                  {
                    "label": "Заменено"
                  }
                ]
              },
              "data_id": 133,
              "label": "Пол багажника",
              "value": true
            }
          ]
        }
      ],
      "with_comment": true,
      "comment": "Комментарий к разделу Кузов"
    },
    {
      "name": "Двигатель и трансмиссия",
      "groups": [
        {
          "fields": [
            {
              "type": "boolean",
              "data_id": 24,
              "label": "Посторонние шумы отсутствуют",
              "value": true
            },
            {
              "type": "boolean",
              "data_id": 25,
              "label": "Запотевание/течи отсутствуют",
              "value": true
            },
            {
              "type": "boolean",
              "data_id": 26,
              "label": "Равномерность работы",
              "value": true
            },
            {
              "type": "boolean",
              "data_id": 27,
              "label": "Уровень масла",
              "value": true
            },
            {
              "type": "boolean",
              "data_id": 28,
              "comment": "Уровень жидкости охлаждающей системы",
              "label": "Уровень жидкости охлаждающей системы",
              "value": false
            },
            {
              "type": "boolean",
              "data_id": 29,
              "label": "Обслуживание не требуется",
              "value": true
            },
            {
              "type": "boolean",
              "data_id": 30,
              "label": "Состояние приводных ремней",
              "value": true
            },
            {
              "type": "boolean",
              "data_id": 31,
              "label": "КПП работает исправно",
              "value": true
            },
            {
              "type": "boolean",
              "data_id": 32,
              "comment": "Плавность включения передач",
              "label": "Плавность включения передач",
              "value": false
            }
          ]
        }
      ],
      "with_comment": true,
      "comment": "Комментарий к разделу Двигатель и трансмиссия\n\n"
    },
    {
      "name": "Рулевое управление, подвеска и тормозная система",
      "groups": [
        {
          "fields": [
            {
              "type": "range",
              "range": [
                "75.00"
              ],
              "data_id": 33,
              "label": "Остаток ПТК",
              "value": true
            },
            {
              "type": "range",
              "range": [
                "23.89"
              ],
              "data_id": 34,
              "label": "Остаток ПТД",
              "value": true
            },
            {
              "type": "range",
              "range": [
                "25.00"
              ],
              "comment": "Остаток ЗТК",
              "data_id": 35,
              "label": "Остаток ЗТК",
              "value": false
            },
            {
              "type": "range",
              "range": [
                "9.52"
              ],
              "data_id": 36,
              "label": "Остаток ЗТД",
              "value": false
            },
            {
              "type": "range",
              "range": [
                "91.84"
              ],
              "data_id": 37,
              "label": "Остаток летней резины",
              "value": true
            },
            {
              "type": "range",
              "range": [
                "4.42"
              ],
              "data_id": 38,
              "label": "Остаток зимней резины",
              "value": true
            },
            {
              "type": "boolean",
              "data_id": 39,
              "label": "Уровень тормозной жидкости в норме",
              "value": true
            },
            {
              "type": "boolean",
              "data_id": 40,
              "label": "Уровень жидкости ГУР в норме",
              "value": true
            },
            {
              "type": "boolean",
              "data_id": 41,
              "comment": "Состояние стояночного тормоза",
              "label": "Состояние стояночного тормоза",
              "value": false
            },
            {
              "type": "boolean",
              "data_id": 42,
              "label": "Состояние резины",
              "value": true
            },
            {
              "type": "boolean",
              "data_id": 43,
              "label": "Состояние тормозной жидкости",
              "value": true
            },
            {
              "type": "boolean",
              "data_id": 44,
              "comment": "Посторонние стуки и скрипы отсутствуют",
              "label": "Посторонние стуки и скрипы отсутствуют",
              "value": false
            },
            {
              "type": "boolean",
              "data_id": 45,
              "label": "Прямолинейность движения",
              "value": true
            },
            {
              "type": "boolean",
              "data_id": 46,
              "label": "Люфты в рулевом управлении отсутствуют",
              "value": true
            }
          ]
        }
      ],
      "with_comment": true,
      "comment": "Комментарий к разделу Рулевое управление, подвеска и тормозная система"
    },
    {
      "name": "Компьютерная диагностика",
      "groups": [
        {
          "fields": [
            {
              "type": "boolean",
              "data_id": 47,
              "label": "Чтение Vin из ЭБУ"
            },
            {
              "type": "boolean",
              "data_id": 48,
              "label": "Связь с основным ЭБУ",
              "value": true
            },
            {
              "type": "boolean",
              "data_id": 49,
              "label": "Ошибки в ЭБУ отсутствуют",
              "value": true
            },
            {
              "type": "boolean",
              "data_id": 50,
              "label": "Соответствие прописанных ключей с фактическим",
              "value": true
            }
          ]
        }
      ],
      "with_comment": true,
      "comment": "Комментарий к разделу Компьютерная диагностика"
    },
    {
      "name": "Электрика и безопасность/отопление и вентиляция",
      "groups": [
        {
          "fields": [
            {
              "type": "boolean",
              "data_id": 51,
              "label": "Освещение и индикация",
              "value": true
            },
            {
              "type": "boolean",
              "data_id": 52,
              "label": "Стеклоподъемники",
              "value": true
            },
            {
              "type": "boolean",
              "data_id": 53,
              "label": "Очиститель/омыватель",
              "value": true
            },
            {
              "type": "boolean",
              "data_id": 54,
              "label": "Эл. привод (сидений, зеркал и т.д.)/Подогрев",
              "value": true
            },
            {
              "type": "boolean",
              "data_id": 55,
              "label": "Прочие электронные компоненты и устройства",
              "value": true
            },
            {
              "type": "boolean",
              "data_id": 56,
              "label": "Исправность/ Наличие системы SRS",
              "value": true
            },
            {
              "type": "boolean",
              "data_id": 57,
              "comment": "Исправность системы A/C",
              "label": "Исправность системы A/C",
              "value": false
            },
            {
              "type": "boolean",
              "data_id": 58,
              "label": "Ремни безопасности"
            }
          ]
        }
      ],
      "with_comment": true,
      "comment": "омментарий к разделу Электрика и безопасность/отопление и вентиляция\n\n"
    },
    {
      "name": "Состояние салона",
      "groups": [
        {
          "fields": [
            {
              "type": "boolean",
              "data_id": 59,
              "label": "Отсутствие дефектов",
              "value": true
            },
            {
              "type": "boolean",
              "data_id": 60,
              "label": "Чистота",
              "value": true
            }
          ]
        }
      ],
      "with_comment": true,
      "comment": "Комментарий к разделу Состояние салона"
    },
    {
      "name": "Таблички и маркировки Vin",
      "groups": [
        {
          "fields": [
            {
              "type": "image",
              "multiple": true,
              "data_id": 61,
              "label": "Vin код на кузове/раме №1",
              "value": [
                {
                  "id": 61499,
                  "image_small": "/media/CACHE/images/reports/ppk/2019/01/18/id_61499/auto_165220/f821edde6704df76fc7edfc09b6e60cf.jpg",
                  "image": "/media/reports/ppk/2019/01/18/id_61499/auto_165220.jpg"
                }
              ]
            },
            {
              "type": "image",
              "multiple": true,
              "data_id": 62,
              "label": "Vin код на кузове/раме №2",
              "value": [
                {
                  "id": 61500,
                  "image_small": "/media/CACHE/images/reports/ppk/2019/01/18/id_61500/auto_165220/113565ca5ca7984ec10f3bf580cc7113.jpg",
                  "image": "/media/reports/ppk/2019/01/18/id_61500/auto_165220.jpg"
                },
                {
                  "id": 61501,
                  "image_small": "/media/CACHE/images/reports/ppk/2019/01/18/id_61501/auto_165220/03e87756394a24bdfe1ac4966dcd1c94.jpg",
                  "image": "/media/reports/ppk/2019/01/18/id_61501/auto_165220.jpg"
                }
              ]
            },
            {
              "type": "image",
              "multiple": true,
              "data_id": 63,
              "label": "Vin код на кузове/раме №3",
              "value": [
                {
                  "id": 61502,
                  "image_small": "/media/CACHE/images/reports/ppk/2019/01/18/id_61502/auto_165220/327115267428c77f5913cd08105c89bf.jpg",
                  "image": "/media/reports/ppk/2019/01/18/id_61502/auto_165220.jpg"
                }
              ]
            },
            {
              "type": "image",
              "multiple": true,
              "data_id": 64,
              "label": "Vin код на табличке",
              "value": [
                {
                  "id": 61503,
                  "image_small": "/media/CACHE/images/reports/ppk/2019/01/18/id_61503/auto_165220/f3e6cf3b56bdc66822dd846b83888233.jpg",
                  "image": "/media/reports/ppk/2019/01/18/id_61503/auto_165220.jpg"
                }
              ]
            },
            {
              "type": "image",
              "multiple": true,
              "data_id": 65,
              "label": "Vin код под лобовым стеклом",
              "value": [
                {
                  "id": 61504,
                  "image_small": "/media/CACHE/images/reports/ppk/2019/01/18/id_61504/auto_165220/03c318a9b59ea8cb30bac98ff0a433e9.jpg",
                  "image": "/media/reports/ppk/2019/01/18/id_61504/auto_165220.jpg"
                }
              ]
            }
          ]
        }
      ],
      "with_comment": true,
      "comment": "Комментарий к разделу Таблички и маркировки Vin\n"
    },
    {
      "name": "Осмотр на подъемнике",
      "groups": [
        {
          "fields": [
            {
              "type": "boolean",
              "data_id": 66,
              "comment": "фты отсутствуют (шаровые, рул",
              "label": "Люфты отсутствуют (шаровые, рулевые, наконечники, тяги, подшипники)",
              "value": false
            },
            {
              "type": "boolean",
              "data_id": 67,
              "label": "Состояние сайлентблоков",
              "value": true
            },
            {
              "type": "boolean",
              "data_id": 68,
              "label": "Тормозная система (шланги, трубки, суппорта)",
              "value": true
            },
            {
              "type": "boolean",
              "data_id": 69,
              "label": "Состояние опор (ДВС, КПП, раздаточной КПП, редуктора и т.д.)"
            },
            {
              "type": "boolean",
              "data_id": 70,
              "label": "Запотевания отсутствуют",
              "value": true
            },
            {
              "type": "boolean",
              "data_id": 71,
              "comment": "12",
              "label": "Состояние пыльников",
              "value": false
            },
            {
              "type": "boolean",
              "data_id": 72,
              "label": "Состояние выхлопной системы",
              "value": true
            },
            {
              "type": "boolean",
              "data_id": 73,
              "label": "Состояние силовых элементов кузова",
              "value": true
            }
          ]
        }
      ],
      "with_comment": true,
      "comment": "Комментарий к разделу Осмотр на подъемнике\n"
    },
    {
      "name": "Дополнительное оборудование",
      "groups": [
        {
          "fields": [
            {
              "type": "text",
              "data_id": 74,
              "label": "Дополнительное оборудование",
              "value": "Дополнительное оборудование\n(comment)"
            }
          ]
        }
      ],
      "with_comment": false
    },
    {
      "name": "Заключение эксперта"
    }
  ]
}