<svg width="18" height="18" viewBox="0 0 18 18" fill="none" xmlns="http://www.w3.org/2000/svg">
<path d="M4.50146 2.925H4.42646V3V15V15.075H4.50146H13.5015H13.5765V15V6.75V6.675H13.5015H9.82646V3V2.925H9.75146H4.50146ZM3.49384 1.99237C3.76108 1.72513 4.12353 1.575 4.50146 1.575H10.4704L14.9265 6.03107V15C14.9265 15.3779 14.7763 15.7404 14.5091 16.0076C14.2418 16.2749 13.8794 16.425 13.5015 16.425H4.50146C4.12353 16.425 3.76108 16.2749 3.49384 16.0076C3.2266 15.7404 3.07646 15.3779 3.07646 15V3C3.07646 2.62207 3.2266 2.25961 3.49384 1.99237Z" fill="#4A4A4A" stroke="white" stroke-width="0.15"/>
</svg>
