<svg width="50" height="50" viewBox="0 0 50 50" fill="none" xmlns="http://www.w3.org/2000/svg">
<path d="M38.4873 22.075V25.35H36.2998V18.8125H28.3998V15.3875H31.7373V12.75H22.2748V15.3875H25.5373V18.8125H21.2248L17.7498 23H14.6248V26.575H11.7873V22.7875H8.9248V33.4125H11.7873V29.4H14.6248V33.5375H17.5623L21.2748 37.25H30.7123L36.2998 31.65V29.4125H38.4873V32.7125H41.0748V22.075H38.4873Z" stroke="#4A4A4A" stroke-linecap="round" stroke-linejoin="round"/>
<rect x="20.8335" y="27.0833" width="10.4167" height="1.04167" fill="#EFB23E"/>
</svg>
