{
    "files": [
        {
            "name": "_data.js",
            "content": "var data = {\n    __componentName__: [\n        {\n            title: 'title',\n            mod: 'mod',\n            link: 'link',\n            count: 'count',\n        }\n    ]\n};"
        },
        {
            "name": "__componentName__.__templateExtension__",
            "content": "mixin __componentName__(data)\n    block vars\n    .__componentName__\n        for item, index in data\n            if item.link == currentUrl\n                - item.mod = '__componentName____item_active'\n            else\n                - item.mod = ''\n            .__componentName____item(class=item.mod)\n                a.__componentName____link(href=item.link)\n                    .__componentName____title=item.title\n                    if item.count\n                        .__componentName____count=item.count"
        }, {
            "name": "__componentName__.__cssExtension__",
            "content": ".__componentName__ {\n    &__item {\n        \n    }\n    &__link {\n        \n    }\n    &__title {\n        \n    }\n    &__count {\n        \n    }\n}"
        }, {
            "name": "__componentName__.js",
            "content": ""
        }
    ]
}
