62.109.8.114:68
178.197.248.213:1080
72.49.49.11:31034
178.197.249.213:1080
174.75.238.68:16399
193.112.23.99:8888
5.178.61.121:9999
149.154.71.37:68
47.93.251.207:3001
166.62.121.76:18656
45.63.41.113:32002
118.24.177.211:1080
47.75.149.193:1080
188.120.246.178:68
104.238.97.215:29771
175.184.232.62:6667
119.29.204.142:1081
37.230.138.173:68
59.66.157.42:1080
78.24.223.92:68
64.118.87.11:23320
47.94.19.105:3001
166.62.103.159:34758
185.127.165.122:68
118.25.74.212:8888
82.146.40.45:68
190.6.196.118:9999
150.129.201.30:6667
94.250.255.31:68
106.12.114.21:1080
84.53.239.112:8888
192.169.236.118:1849
69.61.200.104:36181
185.127.166.200:68
47.107.136.195:3128
41.77.129.22:34511
212.3.210.61:41312
165.22.154.157:3128
41.242.90.178:43884
124.41.213.211:35784
77.94.144.162:3128
104.43.244.233:80
89.216.48.230:44061
212.50.85.39:51810
188.137.100.250:38147
34.249.134.129:8080
31.209.104.163:38911
24.139.244.238:8888
91.92.80.25:53794
183.91.33.41:8083
41.139.159.34:55694
62.162.228.66:58960
120.77.245.11:8080
88.118.134.214:61172
91.215.176.237:8080
91.150.189.122:57138
118.27.31.50:3128
111.160.121.238:8080
41.169.151.90:46799