<svg width="50" height="50" viewBox="0 0 50 50" fill="none" xmlns="http://www.w3.org/2000/svg">
<path d="M41.7498 11.6H8.2373V33.7875H41.7498V11.6Z" stroke="#4A4A4A" stroke-linecap="round" stroke-linejoin="round"/>
<path d="M22.7246 33.7875V37.875" stroke="#4A4A4A" stroke-linecap="round" stroke-linejoin="round"/>
<path d="M27.2749 33.7875V37.875" stroke="#4A4A4A" stroke-linecap="round" stroke-linejoin="round"/>
<path d="M20.2998 38.4H29.6998" stroke="#4A4A4A" stroke-linecap="round" stroke-linejoin="round"/>
<path d="M12.8623 22.8375H17.8998L20.8748 15.9875L23.5998 29.4L26.6998 20.6L27.9748 22.6875H37.1373" stroke="#EFB23E" stroke-linecap="round" stroke-linejoin="round"/>
</svg>
