{
  "Vin": "12345678901234567",
  "Марка": "Kia",
  "Модель": "Cerato",
  "Поколение": "II",
  "Остаток ПТК": 100,
  "Остаток ПТД": [
    {
      "Значение": 0,
      "Коментарий": "комент остаток птд"
    }
  ],
  "Остаток ЗТК": [
    {
      "Значение": 0,
      "Коментарий": "комент остаток зтк"
    }
  ],
  "Остаток ЗТД": 75,
  "Объем": "1.6",
  "Салон": "Ткань",
  "Привод": "Передний",
  "Дата выпуска": "2012",
  "Количество владельцев": "2",
  "Кузов": "Седан",
  "Цвет": "белый",
  "Комплектация": "максимальная",
  "Двигатель": "Бензин",
  "Мощность": "128",
  "Трансмиссия": "Автоматическая",
  "Цвет салона": "черный",
  "Пробег": "64000",
  "Цена": "550000",
  "Описание1": "описание основной информации",
  "Тип продавца": "часный",
  "Имя": "вова",
  "Телефон": "88005553535",
  "Местоположение": "Пенза",
  "Источник": "авито",
  "Перекуп": true,
  "Комментарий1": "клиент к разделу юр проверка",
  "Крыша": "ОК",
  "Переднее правое крыло": "ОК",
  "Передняя правая дверь": "ОК",
  "Переднее правое стекло": "ОК",
  "Задняя правая дверь": [
    {
      "Окрашено": true,
      "Скол|Царапина": true,
      "Вмятина": true,
      "Коррозия|Ржавчина": true,
      "Заменено": true,
      "Коментарий": "комент зпд"
    }
  ],
  "Заднее правое стекло": [
    {
      "Скол": true,
      "Трещина": true,
      "Запотевание": true,
      "Заменено": true,
      "Коментарий": "комент зпс"
    }
  ],
  "Правый порог": "ОК",
  "Заднее правое крыло": "ОК",
  "Багажник": "ОК",
  "Заднее стекло": "ОК",
  "Задний бампер": "ОК",
  "Задние фонари": "ОК",
  "Заднее левое крыло": "ОК",
  "Левый порог": "ОК",
  "Задняя левая дверь": "ОК",
  "Заднее левое стекло": "ОК",
  "Передняя левая дверь": "ОК",
  "Переднее левое стекло": "ОК",
  "Переднее левое крыло": "ОК",
  "Капот": "ОК",
  "Лобовое стекло": "ОК",
  "Передний бампер": "ОК",
  "Передние фонари": "ОК",
  "Стойка передняя левая": [
    {
      "Окрашено": true,
      "Скол|Царапина": true,
      "Вмятина": true,
      "Коррозия|Ржавчина": true,
      "Заменено": true,
      "Коментарий": "комент спл"
    }
  ],
  "Стойка центральная левая": "ОК",
  "Стойка задняя правая": "ОК",
  "Стойка центральная правая": "ОК",
  "Стойка задняя левая": "ОК",
  "Стойка передняя правая": "ОК",
  "Передний лонжерон левый": "ОК",
  "Передний лонжерон правый": "ОК",
  "Чашка передняя левая": "ОК",
  "Чашка передняя правая": "ОК",
  "Моторный щит": "ОК",
  "Центральный тоннель": "ОК",
  "Пол": "ОК",
  "Задняя чашка левая": "ОК",
  "Задняя чашка правая": "ОК",
  "Пол багажника": "ОК",
  "Комментарий2": "комментарий кузов",
  "Посторонние шумы": "комент посторонние шумы",
  "Запотевание\/течи": "ОК",
  "Равномерность работы": "ОК",
  "Уровень масла": "ОК",
  "Уровень жидкости охлаждающей системы": "ОК",
  "Требуется обслуживание": "ОК",
  "Состояние приводных ремней": "ОК",
  "Пробуксовка\/проскальзывание АКПП": "ОК",
  "Плавность включения передач": "ОК",
  "Комментарий3": "комментарий д и т",
  "Остаток летней резины": 75,
  "Остаток зимней резины": 75,
  "Уровень тормозной жидкости": "ОК",
  "Уровень жидкости ГУР": "ОК",
  "Состояние стояночного тормоза": "комент сст",
  "Состояние резины": "ОК",
  "Состояние тормозной жидкости": "ОК",
  "Наличие стуков, скрипов": "ОК",
  "Отклонение от прямолинейного движения": "ОК",
  "Люфты в рулевом управлении": "ОК",
  "Комментарий4": "комментарий рулевое управление и тд",
  "Чтение Vin из ЭБУ": "ОК",
  "Связь с основным ЭБУ": "ОК",
  "Колличество прописанных ключей в ЭБУ Immo": "ОК",
  "Наличие ошибок ЭБУ": "комент наличие ошибок эбу",
  "Комментарий5": "комментарий к разделу комп. диагностика",
  "Комментарий6": "комментарий к разделу э.б.",
  "Освещение и индикация": "ОК",
  "Стеклоподъемники": "ОК",
  "Очиститель\/Омыватель": "ОК",
  "Эл. привод (сидений, зеркал и т.п.)\/Подогрев": "ОК",
  "Прочие электронные компоненты и устройства": "ОК",
  "Исправность и наличие системы SRS": "ОК",
  "Исправность системы A\/C": "ОК",
  "Ремни безопасности": "комент к ремни безопасности ",
  "Комментарий7": "комментарий к разделу состояние салона",
  "Наличие дефектов": "ОК",
  "Чистота": "комент чистота",
  "Комментарий8": "комментарий к разделу таблички и вин",
  "Лифты(шаровые, рулевые, наконечники, тяги, подшипники)": "ОК",
  "Состояние сайлентблоков": "ОК",
  "Наличие дефектов тормозной системы(шланги, трубки, суппорта)": "ОК",
  "Состояние опор(ДВС, КПП, раздаточной КПП, редуктора и т.п.)": "ОК",
  "Запотевание": "ОК",
  "Состояние пыльников": "ОК",
  "Состояние выхлопной системы": "ОК",
  "Состояние силовых элементов кузова": "ОК",
  "Прочие дефекты": "комментарий",
  "Комментарий9": "комментарий к разделу осмотр на подъемнике",
  "Дополнительное оборудование": "доп оборудование",
  "Заказы": "123, 456",
  "Плюсы": "+",
  "Минусы": "-",
  "Рекомендуем": true,
  "Категория авто": "123",
  "Стоимость до торга": "550000",
  "Стоимость после торга": "500000",
  "Оценочная стоимость": "500000",
  "Вывод эксперта": "вывод"
}