-------------------------------------------------------------------------------
Test set: com.epam.rd.june2018.hashtable.HashTableTest
-------------------------------------------------------------------------------
Tests run: 15, Failures: 0, Errors: 0, Skipped: 0, Time elapsed: 0.102 s - in com.epam.rd.june2018.hashtable.HashTableTest
