D:\EPAM\homework_11\src\main\java\com\epam\rd\june2018\IList.java
D:\EPAM\homework_11\src\main\java\com\epam\rd\june2018\IList1.java
D:\EPAM\homework_11\src\main\java\com\epam\rd\june2018\HashTable.java
D:\EPAM\homework_11\src\main\java\com\epam\rd\june2018\Demo.java
D:\EPAM\homework_11\src\main\java\com\epam\rd\june2018\BinaryTree.java
D:\EPAM\homework_11\src\main\java\com\epam\rd\june2018\LList.java
