{
    "name": "PlayerControls",
    "maps": [
        {
            "name": "PlayerActions",
            "id": "2aaa2750-93db-454e-9075-2a75bf9a8d8f",
            "actions": [
                {
                    "name": "Movement",
                    "type": "Value",
                    "id": "3b579bcb-7ab2-4ba1-9e88-ab80dbc63955",
                    "expectedControlType": "Vector2",
                    "processors": "",
                    "interactions": "",
                    "initialStateCheck": true
                },
                {
                    "name": "Interaction",
                    "type": "Button",
                    "id": "a89b8d92-761e-4ee4-9e8c-8ab90ffd0d8e",
                    "expectedControlType": "Button",
                    "processors": "",
                    "interactions": "",
                    "initialStateCheck": false
                }
            ],
            "bindings": [
                {
                    "name": "2D Vector",
                    "id": "596f8467-9200-4da4-8c99-adc2d596d075",
                    "path": "2DVector",
                    "interactions": "",
                    "processors": "",
                    "groups": "",
                    "action": "Movement",
                    "isComposite": true,
                    "isPartOfComposite": false
                },
                {
                    "name": "left",
                    "id": "7ad2446b-3c50-4c97-8233-86b54602cb53",
                    "path": "<Keyboard>/a",
                    "interactions": "",
                    "processors": "",
                    "groups": "",
                    "action": "Movement",
                    "isComposite": false,
                    "isPartOfComposite": true
                },
                {
                    "name": "right",
                    "id": "0af79ba2-c94a-457e-8213-5782bfbf07c4",
                    "path": "<Keyboard>/d",
                    "interactions": "",
                    "processors": "",
                    "groups": "",
                    "action": "Movement",
                    "isComposite": false,
                    "isPartOfComposite": true
                },
                {
                    "name": "",
                    "id": "0338e289-665a-4471-a9e7-8efcfe645e36",
                    "path": "<Keyboard>/e",
                    "interactions": "",
                    "processors": "",
                    "groups": "",
                    "action": "Interaction",
                    "isComposite": false,
                    "isPartOfComposite": false
                }
            ]
        }
    ],
    "controlSchemes": []
}