[
    {
        "name": "Vest",
        "price": 899,
        "image": "./img/vest.jpg",
        "article": 1230423,
        "color": "brown"
    },
    {
        "name": "Sweater",
        "price": 899,
        "image": "./img/sweater.jpg",
        "article": 1230304,
        "color": "white"
    },
    {
        "name": "Blouse",
        "price": 123,
        "image": "./img/blouse.jpg",
        "article": 123047,
        "color": "black"
    },
    {
        "name": "Costume",
        "price": 270,
        "image": "./img/costume.jpg",
        "article": 1234003,
        "color": "grey"
    },
    {
        "name": "Kimono",
        "price": 990,
        "image": "./img/kimono.jpg",
        "article": 1230339,
        "color": "milk"
    },
    {
        "name": "Cardigan",
        "price": 1190,
        "image": "./img/cardigan.jpg",
        "article": 1230314,
        "color": "beige"
    },
    {
        "name": "Top",
        "price": 490,
        "image": "./img/top.jpg",
        "article": 1230335,
        "color": "black"
    },
    {
        "name": "Trousers",
        "price": 650,
        "image": "./img/trousers.jpg",
        "article": 1230337,
        "color": "black"
    },
    {
        "name": "Dress",
        "price": 290,
        "image": "./img/dress.jpg",
        "article": 1230159,
        "color": "grey"
    },
    {
        "name": "T-shirt",
        "price": 490,
        "image": "./img/t-shirt.jpg",
        "article": 1230330,
        "color": "beige"
    }
]