{
	"info": {
		"_postman_id": "92f67e54-793b-400a-a91c-1af629cc9693",
		"name": "MOC course",
		"schema": "https://schema.getpostman.com/json/collection/v2.1.0/collection.json"
	},
	"item": [
		{
			"name": "Get multiple users",
			"request": {
				"auth": {
					"type": "bearer",
					"bearer": [
						{
							"key": "token",
							"value": "0/713af09f21a6ad4ccf9fe2915308d6e3",
							"type": "string"
						}
					]
				},
				"method": "GET",
				"header": [
					{
						"key": "Accept",
						"name": "Content-Type",
						"value": "application/json",
						"type": "text"
					},
					{
						"key": "Content-Type",
						"value": "application/json"
					}
				],
				"url": {
					"raw": "https://{{Asana_url}}/api/1.0/users",
					"protocol": "https",
					"host": [
						"{{Asana_url}}"
					],
					"path": [
						"api",
						"1.0",
						"users"
					]
				}
			},
			"response": []
		},
		{
			"name": "Get a user",
			"request": {
				"auth": {
					"type": "bearer",
					"bearer": [
						{
							"key": "token",
							"value": "0/713af09f21a6ad4ccf9fe2915308d6e3",
							"type": "string"
						}
					]
				},
				"method": "GET",
				"header": [
					{
						"key": "Accept",
						"name": "Content-Type",
						"value": "application/json",
						"type": "text"
					},
					{
						"key": "Content-Type",
						"value": "application/json"
					}
				],
				"url": {
					"raw": "https://{{Asana_url}}/api/1.0/users/{{gid}}",
					"protocol": "https",
					"host": [
						"{{Asana_url}}"
					],
					"path": [
						"api",
						"1.0",
						"users",
						"{{gid}}"
					]
				}
			},
			"response": []
		},
		{
			"name": "Get multiple workspaces",
			"request": {
				"auth": {
					"type": "bearer",
					"bearer": [
						{
							"key": "token",
							"value": "0/713af09f21a6ad4ccf9fe2915308d6e3",
							"type": "string"
						}
					]
				},
				"method": "GET",
				"header": [
					{
						"key": "Accept",
						"name": "Content-Type",
						"value": "application/json",
						"type": "text"
					},
					{
						"key": "Content-Type",
						"value": "application/json"
					}
				],
				"url": {
					"raw": "https://app.asana.com/api/1.0/workspaces",
					"protocol": "https",
					"host": [
						"app",
						"asana",
						"com"
					],
					"path": [
						"api",
						"1.0",
						"workspaces"
					]
				}
			},
			"response": []
		},
		{
			"name": "Get a workspace",
			"request": {
				"auth": {
					"type": "bearer",
					"bearer": [
						{
							"key": "token",
							"value": "0/713af09f21a6ad4ccf9fe2915308d6e3",
							"type": "string"
						}
					]
				},
				"method": "GET",
				"header": [
					{
						"key": "Accept",
						"name": "Content-Type",
						"value": "application/json",
						"type": "text"
					},
					{
						"key": "Content-Type",
						"value": "application/json"
					}
				],
				"url": {
					"raw": "https://app.asana.com/api/1.0/workspaces/{{workspace_gid}}",
					"protocol": "https",
					"host": [
						"app",
						"asana",
						"com"
					],
					"path": [
						"api",
						"1.0",
						"workspaces",
						"{{workspace_gid}}"
					]
				}
			},
			"response": []
		},
		{
			"name": "Get multiple projects",
			"request": {
				"auth": {
					"type": "bearer",
					"bearer": [
						{
							"key": "token",
							"value": "0/713af09f21a6ad4ccf9fe2915308d6e3",
							"type": "string"
						}
					]
				},
				"method": "GET",
				"header": [
					{
						"key": "Accept",
						"value": "application/json",
						"type": "text"
					}
				],
				"url": {
					"raw": "https://{{Asana_url}}/api/1.0/projects",
					"protocol": "https",
					"host": [
						"{{Asana_url}}"
					],
					"path": [
						"api",
						"1.0",
						"projects"
					]
				}
			},
			"response": []
		},
		{
			"name": "Add a user to a workspace or organization",
			"request": {
				"auth": {
					"type": "bearer",
					"bearer": [
						{
							"key": "token",
							"value": "0/713af09f21a6ad4ccf9fe2915308d6e3",
							"type": "string"
						}
					]
				},
				"method": "POST",
				"header": [
					{
						"key": "Accept",
						"value": "application/json",
						"type": "text"
					},
					{
						"key": "Content-Type",
						"name": "Content-Type",
						"value": "application/json",
						"type": "text"
					}
				],
				"body": {
					"mode": "raw",
					"raw": "{\n  \"data\": {\n    \"user\": \"1150166519745121\"\n  }\n}",
					"options": {
						"raw": {
							"language": "json"
						}
					}
				},
				"url": {
					"raw": "https://app.asana.com/api/1.0/workspaces/{{workspace_gid}}/addUser",
					"protocol": "https",
					"host": [
						"app",
						"asana",
						"com"
					],
					"path": [
						"api",
						"1.0",
						"workspaces",
						"{{workspace_gid}}",
						"addUser"
					]
				}
			},
			"response": []
		},
		{
			"name": "Create a tag in a workspace",
			"request": {
				"auth": {
					"type": "bearer",
					"bearer": [
						{
							"key": "token",
							"value": "0/713af09f21a6ad4ccf9fe2915308d6e3",
							"type": "string"
						}
					]
				},
				"method": "POST",
				"header": [
					{
						"key": "Accept",
						"value": "application/json",
						"type": "text"
					},
					{
						"key": "Content-Type",
						"value": "application/json",
						"type": "text"
					}
				],
				"body": {
					"mode": "raw",
					"raw": "{\n  \"data\": {\n    \"name\": \"Stuff to buy\",\n    \"color\": \"light-green\"\n  }\n}"
				},
				"url": {
					"raw": "https://app.asana.com/api/1.0/workspaces/{{workspace_gid}}/tags",
					"protocol": "https",
					"host": [
						"app",
						"asana",
						"com"
					],
					"path": [
						"api",
						"1.0",
						"workspaces",
						"{{workspace_gid}}",
						"tags"
					]
				}
			},
			"response": []
		},
		{
			"name": "Update a workspace",
			"request": {
				"auth": {
					"type": "bearer",
					"bearer": [
						{
							"key": "token",
							"value": "0/713af09f21a6ad4ccf9fe2915308d6e3",
							"type": "string"
						}
					]
				},
				"method": "PUT",
				"header": [
					{
						"key": "Accept",
						"name": "Content-Type",
						"value": "application/json",
						"type": "text"
					},
					{
						"key": "Content-Type",
						"name": "Content-Type",
						"value": "application/x-www-form-urlencoded",
						"type": "text"
					}
				],
				"url": {
					"raw": "https://app.asana.com/api/1.0/workspaces/{{workspace_gid}}",
					"protocol": "https",
					"host": [
						"app",
						"asana",
						"com"
					],
					"path": [
						"api",
						"1.0",
						"workspaces",
						"{{workspace_gid}}"
					]
				}
			},
			"response": []
		}
	],
	"protocolProfileBehavior": {}
}