{
  "drinks": [
    {
      "idDrink": "13332",
      "strDrink": "B-53",
      "strDrinkAlternate": null,
      "strTags": null,
      "strVideo": null,
      "strCategory": "Shot",
      "strIBA": null,
      "strAlcoholic": "Alcoholic",
      "strGlass": "Collins Glass",
      "strInstructions": "Layer the Kahlua, Sambucca and Grand Marnier into a shot glas in that order. Better than B-52",
      "strInstructionsES": null,
      "strInstructionsDE": "Schichte die Kahlua, Sambucca und Grand Marnier in dieser Reihenfolge in ein Schnapsglas ein. Besser als B-52",
      "strInstructionsFR": null,
      "strInstructionsIT": "Metti Kahlua, Sambuca e Grand Marnier in un bicchierino in quest'ordine. ",
      "strInstructionsZH-HANS": null,
      "strInstructionsZH-HANT": null,
      "strDrinkThumb": "https:\/\/www.thecocktaildb.com\/images\/media\/drink\/rwqxrv1461866023.jpg",
      "strIngredient1": "Kahlua",
      "strIngredient2": "Sambuca",
      "strIngredient3": "Grand Marnier",
      "strIngredient4": null,
      "strIngredient5": null,
      "strIngredient6": null,
      "strIngredient7": null,
      "strIngredient8": null,
      "strIngredient9": null,
      "strIngredient10": null,
      "strIngredient11": null,
      "strIngredient12": null,
      "strIngredient13": null,
      "strIngredient14": null,
      "strIngredient15": null,
      "strMeasure1": "1\/3 shot ",
      "strMeasure2": "1\/3 shot ",
      "strMeasure3": "1\/3 shot ",
      "strMeasure4": null,
      "strMeasure5": null,
      "strMeasure6": null,
      "strMeasure7": null,
      "strMeasure8": null,
      "strMeasure9": null,
      "strMeasure10": null,
      "strMeasure11": null,
      "strMeasure12": null,
      "strMeasure13": null,
      "strMeasure14": null,
      "strMeasure15": null,
      "strImageSource": null,
      "strImageAttribution": null,
      "strCreativeCommonsConfirmed": "No",
      "dateModified": "2016-04-28 18:53:43"
    },
    {
      "idDrink": "15853",
      "strDrink": "B-52",
      "strDrinkAlternate": null,
      "strTags": "IBA,NewEra",
      "strVideo": null,
      "strCategory": "Shot",
      "strIBA": "New Era Drinks",
      "strAlcoholic": "Alcoholic",
      "strGlass": "Shot glass",
      "strInstructions": "Layer ingredients into a shot glass. Serve with a stirrer.",
      "strInstructionsES": null,
      "strInstructionsDE": "Zutaten in ein Schnapsglas schichten. Mit einem R\u00fchrstab servieren.",
      "strInstructionsFR": null,
      "strInstructionsIT": "Metti gli ingredienti in un bicchiere da shot a strati.\r\nServire con una paletta.",
      "strInstructionsZH-HANS": null,
      "strInstructionsZH-HANT": null,
      "strDrinkThumb": "https:\/\/www.thecocktaildb.com\/images\/media\/drink\/5a3vg61504372070.jpg",
      "strIngredient1": "Baileys irish cream",
      "strIngredient2": "Grand Marnier",
      "strIngredient3": "Kahlua",
      "strIngredient4": null,
      "strIngredient5": null,
      "strIngredient6": null,
      "strIngredient7": null,
      "strIngredient8": null,
      "strIngredient9": null,
      "strIngredient10": null,
      "strIngredient11": null,
      "strIngredient12": null,
      "strIngredient13": null,
      "strIngredient14": null,
      "strIngredient15": null,
      "strMeasure1": "1\/3 ",
      "strMeasure2": "1\/3 ",
      "strMeasure3": "1\/4 ",
      "strMeasure4": null,
      "strMeasure5": null,
      "strMeasure6": null,
      "strMeasure7": null,
      "strMeasure8": null,
      "strMeasure9": null,
      "strMeasure10": null,
      "strMeasure11": null,
      "strMeasure12": null,
      "strMeasure13": null,
      "strMeasure14": null,
      "strMeasure15": null,
      "strImageSource": null,
      "strImageAttribution": null,
      "strCreativeCommonsConfirmed": "No",
      "dateModified": "2017-09-02 18:07:51"
    },
    {
      "idDrink": "17254",
      "strDrink": "Bijou",
      "strDrinkAlternate": null,
      "strTags": null,
      "strVideo": null,
      "strCategory": "Cocktail",
      "strIBA": null,
      "strAlcoholic": "Alcoholic",
      "strGlass": "Cocktail glass",
      "strInstructions": "Stir in mixing glass with ice and strain\r\n",
      "strInstructionsES": null,
      "strInstructionsDE": "In Mischglas mit Eis verr\u00fchren und abseihen.",
      "strInstructionsFR": null,
      "strInstructionsIT": "Mescolare nel mixing glass con ghiaccio e filtrare",
      "strInstructionsZH-HANS": null,
      "strInstructionsZH-HANT": null,
      "strDrinkThumb": "https:\/\/www.thecocktaildb.com\/images\/media\/drink\/rysb3r1513706985.jpg",
      "strIngredient1": "Orange Bitters",
      "strIngredient2": "Green Chartreuse",
      "strIngredient3": "Gin",
      "strIngredient4": "Sweet Vermouth",
      "strIngredient5": null,
      "strIngredient6": null,
      "strIngredient7": null,
      "strIngredient8": null,
      "strIngredient9": null,
      "strIngredient10": null,
      "strIngredient11": null,
      "strIngredient12": null,
      "strIngredient13": null,
      "strIngredient14": null,
      "strIngredient15": null,
      "strMeasure1": "1 dash",
      "strMeasure2": "1 oz",
      "strMeasure3": "1 oz",
      "strMeasure4": "1 oz",
      "strMeasure5": null,
      "strMeasure6": null,
      "strMeasure7": null,
      "strMeasure8": null,
      "strMeasure9": null,
      "strMeasure10": null,
      "strMeasure11": null,
      "strMeasure12": null,
      "strMeasure13": null,
      "strMeasure14": null,
      "strMeasure15": null,
      "strImageSource": null,
      "strImageAttribution": null,
      "strCreativeCommonsConfirmed": "No",
      "dateModified": "2017-12-19 18:09:45"
    },
    {
      "idDrink": "11149",
      "strDrink": "Boxcar",
      "strDrinkAlternate": null,
      "strTags": null,
      "strVideo": null,
      "strCategory": "Ordinary Drink",
      "strIBA": null,
      "strAlcoholic": "Alcoholic",
      "strGlass": "Whiskey sour glass",
      "strInstructions": "In a shaker half-filled with ice cubes, combine all of the ingredients. Shake well. Strain into a sour glass.",
      "strInstructionsES": null,
      "strInstructionsDE": "In einem Shaker, der halb mit Eisw\u00fcrfeln gef\u00fcllt ist, alle Zutaten vermengen. Gut sch\u00fctteln. In ein Sour Glas abseihen.",
      "strInstructionsFR": null,
      "strInstructionsIT": "In uno shaker riempito a met\u00e0 con cubetti di ghiaccio, unire tutti gli ingredienti.Filtrare in un bicchiere sour.Agitare bene.",
      "strInstructionsZH-HANS": null,
      "strInstructionsZH-HANT": null,
      "strDrinkThumb": "https:\/\/www.thecocktaildb.com\/images\/media\/drink\/pwgtpa1504366376.jpg",
      "strIngredient1": "Gin",
      "strIngredient2": "Triple sec",
      "strIngredient3": "Lemon juice",
      "strIngredient4": "Grenadine",
      "strIngredient5": "Egg white",
      "strIngredient6": null,
      "strIngredient7": null,
      "strIngredient8": null,
      "strIngredient9": null,
      "strIngredient10": null,
      "strIngredient11": null,
      "strIngredient12": null,
      "strIngredient13": null,
      "strIngredient14": null,
      "strIngredient15": null,
      "strMeasure1": "1 1\/2 oz ",
      "strMeasure2": "1 oz ",
      "strMeasure3": "1 tsp ",
      "strMeasure4": "1\/2 tsp ",
      "strMeasure5": "1 ",
      "strMeasure6": null,
      "strMeasure7": null,
      "strMeasure8": null,
      "strMeasure9": null,
      "strMeasure10": null,
      "strMeasure11": null,
      "strMeasure12": null,
      "strMeasure13": null,
      "strMeasure14": null,
      "strMeasure15": null,
      "strImageSource": null,
      "strImageAttribution": null,
      "strCreativeCommonsConfirmed": "No",
      "dateModified": "2017-09-02 16:32:57"
    },
    {
      "idDrink": "13222",
      "strDrink": "Big Red",
      "strDrinkAlternate": null,
      "strTags": null,
      "strVideo": null,
      "strCategory": "Shot",
      "strIBA": null,
      "strAlcoholic": "Alcoholic",
      "strGlass": "Shot glass",
      "strInstructions": "Pour ingredients into 1 ounce shot glass",
      "strInstructionsES": null,
      "strInstructionsDE": "Zutaten in 1 Schnapsglas gie\u00dfen.",
      "strInstructionsFR": null,
      "strInstructionsIT": "Versare gli ingredienti in un bicchierino da shot.",
      "strInstructionsZH-HANS": null,
      "strInstructionsZH-HANT": null,
      "strDrinkThumb": "https:\/\/www.thecocktaildb.com\/images\/media\/drink\/yqwuwu1441248116.jpg",
      "strIngredient1": "Irish cream",
      "strIngredient2": "Goldschlager",
      "strIngredient3": null,
      "strIngredient4": null,
      "strIngredient5": null,
      "strIngredient6": null,
      "strIngredient7": null,
      "strIngredient8": null,
      "strIngredient9": null,
      "strIngredient10": null,
      "strIngredient11": null,
      "strIngredient12": null,
      "strIngredient13": null,
      "strIngredient14": null,
      "strIngredient15": null,
      "strMeasure1": "1\/2 oz ",
      "strMeasure2": "1\/2 oz ",
      "strMeasure3": null,
      "strMeasure4": null,
      "strMeasure5": null,
      "strMeasure6": null,
      "strMeasure7": null,
      "strMeasure8": null,
      "strMeasure9": null,
      "strMeasure10": null,
      "strMeasure11": null,
      "strMeasure12": null,
      "strMeasure13": null,
      "strMeasure14": null,
      "strMeasure15": null,
      "strImageSource": null,
      "strImageAttribution": null,
      "strCreativeCommonsConfirmed": "No",
      "dateModified": "2015-09-03 03:41:56"
    },
    {
      "idDrink": "17195",
      "strDrink": "Bellini",
      "strDrinkAlternate": null,
      "strTags": "ContemporaryClassic,IBA",
      "strVideo": null,
      "strCategory": "Ordinary Drink",
      "strIBA": "Contemporary Classics",
      "strAlcoholic": "Alcoholic",
      "strGlass": "Champagne Flute",
      "strInstructions": "Pour peach pur\u00e9e into chilled flute, add sparkling wine. Stir gently.",
      "strInstructionsES": null,
      "strInstructionsDE": "Pfirsichp\u00fcree in das gek\u00fchlte Sektglas gie\u00dfen, Sekt hinzuf\u00fcgen. Vorsichtig umr\u00fchren.",
      "strInstructionsFR": null,
      "strInstructionsIT": "Versare la purea di pesche in una fl\u00fbte fredda, aggiungere lo spumante.\r\n",
      "strInstructionsZH-HANS": null,
      "strInstructionsZH-HANT": null,
      "strDrinkThumb": "https:\/\/www.thecocktaildb.com\/images\/media\/drink\/eaag491504367543.jpg",
      "strIngredient1": "Champagne",
      "strIngredient2": "Peach schnapps",
      "strIngredient3": null,
      "strIngredient4": null,
      "strIngredient5": null,
      "strIngredient6": null,
      "strIngredient7": null,
      "strIngredient8": null,
      "strIngredient9": null,
      "strIngredient10": null,
      "strIngredient11": null,
      "strIngredient12": null,
      "strIngredient13": null,
      "strIngredient14": null,
      "strIngredient15": null,
      "strMeasure1": "6 oz ",
      "strMeasure2": "1 oz ",
      "strMeasure3": null,
      "strMeasure4": null,
      "strMeasure5": null,
      "strMeasure6": null,
      "strMeasure7": null,
      "strMeasure8": null,
      "strMeasure9": null,
      "strMeasure10": null,
      "strMeasure11": null,
      "strMeasure12": null,
      "strMeasure13": null,
      "strMeasure14": null,
      "strMeasure15": null,
      "strImageSource": null,
      "strImageAttribution": null,
      "strCreativeCommonsConfirmed": "No",
      "dateModified": "2017-09-02 16:52:23"
    },
    {
      "idDrink": "17210",
      "strDrink": "Bramble",
      "strDrinkAlternate": null,
      "strTags": "IBA,NewEra",
      "strVideo": null,
      "strCategory": "Ordinary Drink",
      "strIBA": "New Era Drinks",
      "strAlcoholic": "Alcoholic",
      "strGlass": "Old-Fashioned glass",
      "strInstructions": "Fill glass with crushed ice. Build gin, lemon juice and simple syrup over. Stir, and then pour blackberry liqueur over in a circular fashion to create marbling effect. Garnish with two blackberries and lemon slice.",
      "strInstructionsES": null,
      "strInstructionsDE": "F\u00fcllen Sie das Glas mit zersto\u00dfenem Eis. Den Gin, den Zitronensaft und den Sirup dazugeben. R\u00fchren Sie um und gie\u00dfen Sie dann Brombeerlik\u00f6r kreisf\u00f6rmig dar\u00fcber, um einen Marmoriereffekt zu erzielen. Mit zwei Brombeeren und einer Zitronenscheibe garnieren.",
      "strInstructionsFR": null,
      "strInstructionsIT": "Riempi il bicchiere con ghiaccio tritato.\r\nAggiungi gin, succo di limone e sciroppo semplice.\r\nMescolare e poi versare il liquore alla mora in modo circolare per creare un effetto marmorizzato.\r\nGuarnire con due more e una fetta di limone.",
      "strInstructionsZH-HANS": null,
      "strInstructionsZH-HANT": null,
      "strDrinkThumb": "https:\/\/www.thecocktaildb.com\/images\/media\/drink\/twtbh51630406392.jpg",
      "strIngredient1": "Gin",
      "strIngredient2": "lemon juice",
      "strIngredient3": "Sugar syrup",
      "strIngredient4": "Creme de Mure",
      "strIngredient5": null,
      "strIngredient6": null,
      "strIngredient7": null,
      "strIngredient8": null,
      "strIngredient9": null,
      "strIngredient10": null,
      "strIngredient11": null,
      "strIngredient12": null,
      "strIngredient13": null,
      "strIngredient14": null,
      "strIngredient15": null,
      "strMeasure1": "4 cl",
      "strMeasure2": "1.5 cl",
      "strMeasure3": "1 cl",
      "strMeasure4": "1.5 cl",
      "strMeasure5": null,
      "strMeasure6": null,
      "strMeasure7": null,
      "strMeasure8": null,
      "strMeasure9": null,
      "strMeasure10": null,
      "strMeasure11": null,
      "strMeasure12": null,
      "strMeasure13": null,
      "strMeasure14": null,
      "strMeasure15": null,
      "strImageSource": "https:\/\/www.instagram.com\/p\/CSR2YF3M9uT",
      "strImageAttribution": "@wanderingdane",
      "strCreativeCommonsConfirmed": "Yes",
      "dateModified": "2017-09-02 18:15:26"
    },
    {
      "idDrink": "11060",
      "strDrink": "Balmoral",
      "strDrinkAlternate": null,
      "strTags": null,
      "strVideo": null,
      "strCategory": "Ordinary Drink",
      "strIBA": null,
      "strAlcoholic": "Alcoholic",
      "strGlass": "Cocktail glass",
      "strInstructions": "In a mixing glass half-filled with ice cubes, combine all of the ingredients. Stir well. Strain into a cocktail glass.",
      "strInstructionsES": null,
      "strInstructionsDE": "In einem Mischglas, das halb mit Eisw\u00fcrfeln gef\u00fcllt ist, alle Zutaten vermengen. Gut umr\u00fchren. In ein Cocktailglas abseihen.",
      "strInstructionsFR": null,
      "strInstructionsIT": "In un mixing glass riempito a met\u00e0 con cubetti di ghiaccio, unire tutti gli ingredienti. Filtrare in un bicchiere da cocktail.Mescolare bene.",
      "strInstructionsZH-HANS": null,
      "strInstructionsZH-HANT": null,
      "strDrinkThumb": "https:\/\/www.thecocktaildb.com\/images\/media\/drink\/vysuyq1441206297.jpg",
      "strIngredient1": "Scotch",
      "strIngredient2": "Sweet Vermouth",
      "strIngredient3": "Dry Vermouth",
      "strIngredient4": "Bitters",
      "strIngredient5": null,
      "strIngredient6": null,
      "strIngredient7": null,
      "strIngredient8": null,
      "strIngredient9": null,
      "strIngredient10": null,
      "strIngredient11": null,
      "strIngredient12": null,
      "strIngredient13": null,
      "strIngredient14": null,
      "strIngredient15": null,
      "strMeasure1": "1 1\/2 oz ",
      "strMeasure2": "1\/2 oz ",
      "strMeasure3": "1\/2 oz ",
      "strMeasure4": "2 dashes ",
      "strMeasure5": null,
      "strMeasure6": null,
      "strMeasure7": null,
      "strMeasure8": null,
      "strMeasure9": null,
      "strMeasure10": null,
      "strMeasure11": null,
      "strMeasure12": null,
      "strMeasure13": null,
      "strMeasure14": null,
      "strMeasure15": null,
      "strImageSource": null,
      "strImageAttribution": null,
      "strCreativeCommonsConfirmed": "No",
      "dateModified": "2015-09-02 16:04:57"
    },
    {
      "idDrink": "11120",
      "strDrink": "Bluebird",
      "strDrinkAlternate": null,
      "strTags": null,
      "strVideo": null,
      "strCategory": "Ordinary Drink",
      "strIBA": null,
      "strAlcoholic": "Alcoholic",
      "strGlass": "Cocktail glass",
      "strInstructions": "In a mixing glass half-filled with crushed ice, combine the gin, triple sec, Curacao, and bitters. Stir well. Strain into a cocktail glass and garnish with the lemon twist and the cherry.",
      "strInstructionsES": null,
      "strInstructionsDE": "In einem Mischglas, das halb mit Crushed Ice gef\u00fcllt ist, den Gin, Triple Sec, Curacao und Bitter vermengen. Gut umr\u00fchren. In ein Cocktailglas abseihen und mit Zitronenschale und Kirsche garnieren.",
      "strInstructionsFR": null,
      "strInstructionsIT": "In un mixing glass riempito a met\u00e0 con ghiaccio tritato, unisci il gin, il triple sec, il Curacao e il bitter.Mescolare bene.Filtrare in una coppetta da cocktail e guarnire con la scorza di limone e la ciliegia.",
      "strInstructionsZH-HANS": null,
      "strInstructionsZH-HANT": null,
      "strDrinkThumb": "https:\/\/www.thecocktaildb.com\/images\/media\/drink\/5jhyd01582579843.jpg",
      "strIngredient1": "Gin",
      "strIngredient2": "Triple sec",
      "strIngredient3": "Blue Curacao",
      "strIngredient4": "Bitters",
      "strIngredient5": "Maraschino cherry",
      "strIngredient6": "Lemon peel",
      "strIngredient7": null,
      "strIngredient8": null,
      "strIngredient9": null,
      "strIngredient10": null,
      "strIngredient11": null,
      "strIngredient12": null,
      "strIngredient13": null,
      "strIngredient14": null,
      "strIngredient15": null,
      "strMeasure1": "1 1\/2 oz ",
      "strMeasure2": "1\/2 oz ",
      "strMeasure3": "1\/2 oz ",
      "strMeasure4": "2 dashes ",
      "strMeasure5": "1 ",
      "strMeasure6": "1 twist of ",
      "strMeasure7": null,
      "strMeasure8": null,
      "strMeasure9": null,
      "strMeasure10": null,
      "strMeasure11": null,
      "strMeasure12": null,
      "strMeasure13": null,
      "strMeasure14": null,
      "strMeasure15": null,
      "strImageSource": null,
      "strImageAttribution": null,
      "strCreativeCommonsConfirmed": "Yes",
      "dateModified": "2015-09-02 17:06:11"
    },
    {
      "idDrink": "178310",
      "strDrink": "Brooklyn",
      "strDrinkAlternate": null,
      "strTags": "Alcoholic,Sweet,DateNight,USA",
      "strVideo": null,
      "strCategory": "Cocktail",
      "strIBA": null,
      "strAlcoholic": "Alcoholic",
      "strGlass": "Cocktail glass",
      "strInstructions": "Combine ingredients with ice and stir until well-chilled. Strain into a chilled cocktail glass.",
      "strInstructionsES": null,
      "strInstructionsDE": null,
      "strInstructionsFR": null,
      "strInstructionsIT": "Unisci gli ingredienti con il ghiaccio e mescola finch\u00e9 non si saranno raffreddati. Filtrare in una coppetta da cocktail ghiacciata.",
      "strInstructionsZH-HANS": null,
      "strInstructionsZH-HANT": null,
      "strDrinkThumb": "https:\/\/www.thecocktaildb.com\/images\/media\/drink\/ojsezf1582477277.jpg",
      "strIngredient1": "Rye Whiskey",
      "strIngredient2": "Dry Vermouth",
      "strIngredient3": "Maraschino Liqueur",
      "strIngredient4": "Angostura Bitters",
      "strIngredient5": "Maraschino Cherry",
      "strIngredient6": null,
      "strIngredient7": null,
      "strIngredient8": null,
      "strIngredient9": null,
      "strIngredient10": null,
      "strIngredient11": null,
      "strIngredient12": null,
      "strIngredient13": null,
      "strIngredient14": null,
      "strIngredient15": null,
      "strMeasure1": "2 oz",
      "strMeasure2": "1 oz",
      "strMeasure3": "1\/4 oz",
      "strMeasure4": "3 dashes",
      "strMeasure5": "1",
      "strMeasure6": null,
      "strMeasure7": null,
      "strMeasure8": null,
      "strMeasure9": null,
      "strMeasure10": null,
      "strMeasure11": null,
      "strMeasure12": null,
      "strMeasure13": null,
      "strMeasure14": null,
      "strMeasure15": null,
      "strImageSource": null,
      "strImageAttribution": null,
      "strCreativeCommonsConfirmed": "Yes",
      "dateModified": null
    },
    {
      "idDrink": "11124",
      "strDrink": "Boomerang",
      "strDrinkAlternate": null,
      "strTags": null,
      "strVideo": null,
      "strCategory": "Ordinary Drink",
      "strIBA": null,
      "strAlcoholic": "Alcoholic",
      "strGlass": "Cocktail glass",
      "strInstructions": "In a mixing glass half-filled with ice cubes, combine the gin, vermouth, bitters, and maraschino liqueur. Stir well. Strain into a cocktail glass and garnish with the cherry.",
      "strInstructionsES": null,
      "strInstructionsDE": "In einem Mischglas, das halb mit Eisw\u00fcrfeln gef\u00fcllt ist, den Gin, Wermut, Bitter und Maraschino-Lik\u00f6r vermengen. Gut umr\u00fchren. In ein Cocktailglas abseihen und mit der Kirsche garnieren.",
      "strInstructionsFR": null,
      "strInstructionsIT": "In un mixing glass riempito a met\u00e0 con cubetti di ghiaccio, unire il gin, il vermouth, il bitter e il liquore al maraschino.Mescolare bene.Filtrare in una coppetta da cocktail e guarnire con la ciliegia.",
      "strInstructionsZH-HANS": null,
      "strInstructionsZH-HANT": null,
      "strDrinkThumb": "https:\/\/www.thecocktaildb.com\/images\/media\/drink\/3m6yz81504389551.jpg",
      "strIngredient1": "Gin",
      "strIngredient2": "Dry Vermouth",
      "strIngredient3": "Bitters",
      "strIngredient4": "Maraschino liqueur",
      "strIngredient5": "Maraschino cherry",
      "strIngredient6": null,
      "strIngredient7": null,
      "strIngredient8": null,
      "strIngredient9": null,
      "strIngredient10": null,
      "strIngredient11": null,
      "strIngredient12": null,
      "strIngredient13": null,
      "strIngredient14": null,
      "strIngredient15": null,
      "strMeasure1": "2 oz ",
      "strMeasure2": "1\/2 oz ",
      "strMeasure3": "2 dashes ",
      "strMeasure4": "1\/2 tsp ",
      "strMeasure5": "1 ",
      "strMeasure6": null,
      "strMeasure7": null,
      "strMeasure8": null,
      "strMeasure9": null,
      "strMeasure10": null,
      "strMeasure11": null,
      "strMeasure12": null,
      "strMeasure13": null,
      "strMeasure14": null,
      "strMeasure15": null,
      "strImageSource": null,
      "strImageAttribution": null,
      "strCreativeCommonsConfirmed": "No",
      "dateModified": "2017-09-02 22:59:12"
    },
    {
      "idDrink": "12572",
      "strDrink": "Bora Bora",
      "strDrinkAlternate": null,
      "strTags": null,
      "strVideo": null,
      "strCategory": "Cocktail",
      "strIBA": null,
      "strAlcoholic": "Non alcoholic",
      "strGlass": "Highball glass",
      "strInstructions": "Prepare in a blender or shaker, serve in a highball glass on the rocks. Garnish with 1 slice of pineapple and one cherry.",
      "strInstructionsES": null,
      "strInstructionsDE": "In einem Mixer oder Shaker zubereiten, in einem Highball-Glas \"On the Rocks\" servieren. Mit 1 Scheibe Ananas und einer Kirsche garnieren.",
      "strInstructionsFR": null,
      "strInstructionsIT": "Preparare in un frullatore o uno shaker, servire in un bicchiere highball con ghiaccio.Guarnire con 1 fetta di ananas e una ciliegia.",
      "strInstructionsZH-HANS": null,
      "strInstructionsZH-HANT": null,
      "strDrinkThumb": "https:\/\/www.thecocktaildb.com\/images\/media\/drink\/xwuqvw1473201811.jpg",
      "strIngredient1": "Pineapple juice",
      "strIngredient2": "Passion fruit juice",
      "strIngredient3": "Lemon juice",
      "strIngredient4": "Grenadine",
      "strIngredient5": null,
      "strIngredient6": null,
      "strIngredient7": null,
      "strIngredient8": null,
      "strIngredient9": null,
      "strIngredient10": null,
      "strIngredient11": null,
      "strIngredient12": null,
      "strIngredient13": null,
      "strIngredient14": null,
      "strIngredient15": null,
      "strMeasure1": "10 cl ",
      "strMeasure2": "6 cl ",
      "strMeasure3": "1 cl ",
      "strMeasure4": "1 cl ",
      "strMeasure5": null,
      "strMeasure6": null,
      "strMeasure7": null,
      "strMeasure8": null,
      "strMeasure9": null,
      "strMeasure10": null,
      "strMeasure11": null,
      "strMeasure12": null,
      "strMeasure13": null,
      "strMeasure14": null,
      "strMeasure15": null,
      "strImageSource": null,
      "strImageAttribution": null,
      "strCreativeCommonsConfirmed": "No",
      "dateModified": "2016-09-06 23:43:31"
    },
    {
      "idDrink": "17209",
      "strDrink": "Barracuda",
      "strDrinkAlternate": null,
      "strTags": "IBA,NewEra",
      "strVideo": null,
      "strCategory": "Ordinary Drink",
      "strIBA": "New Era Drinks",
      "strAlcoholic": "Alcoholic",
      "strGlass": "Margarita glass",
      "strInstructions": "Shake pour ingredients with ice. Strain into glass, top with Sparkling wine.",
      "strInstructionsES": null,
      "strInstructionsDE": "Sch\u00fctteln Sie die Zutaten mit Eis. In ein Glas abseihen, mit Sekt \u00fcbergie\u00dfen.",
      "strInstructionsFR": null,
      "strInstructionsIT": "Shakerare e versare gli ingredienti con ghiaccio.\r\nFiltrare in un bicchiere, completare con spumante.",
      "strInstructionsZH-HANS": null,
      "strInstructionsZH-HANT": null,
      "strDrinkThumb": "https:\/\/www.thecocktaildb.com\/images\/media\/drink\/jwmr1x1504372337.jpg",
      "strIngredient1": "Rum",
      "strIngredient2": "Galliano",
      "strIngredient3": "Pineapple Juice",
      "strIngredient4": "Lime Juice",
      "strIngredient5": "Prosecco",
      "strIngredient6": null,
      "strIngredient7": null,
      "strIngredient8": null,
      "strIngredient9": null,
      "strIngredient10": null,
      "strIngredient11": null,
      "strIngredient12": null,
      "strIngredient13": null,
      "strIngredient14": null,
      "strIngredient15": null,
      "strMeasure1": "4.5 cl",
      "strMeasure2": "1.5 cl",
      "strMeasure3": "6 cl",
      "strMeasure4": " 1 dash",
      "strMeasure5": "top up ",
      "strMeasure6": null,
      "strMeasure7": null,
      "strMeasure8": null,
      "strMeasure9": null,
      "strMeasure10": null,
      "strMeasure11": null,
      "strMeasure12": null,
      "strMeasure13": null,
      "strMeasure14": null,
      "strMeasure15": null,
      "strImageSource": null,
      "strImageAttribution": null,
      "strCreativeCommonsConfirmed": "No",
      "dateModified": "2017-09-02 18:12:17"
    },
    {
      "idDrink": "17035",
      "strDrink": "Buccaneer",
      "strDrinkAlternate": null,
      "strTags": null,
      "strVideo": null,
      "strCategory": "Beer",
      "strIBA": null,
      "strAlcoholic": "Alcoholic",
      "strGlass": "Beer pilsner",
      "strInstructions": "Pour the corona into an 18oz beer glass pour the bacardi limon into the beer stir very gently",
      "strInstructionsES": null,
      "strInstructionsDE": "Gie\u00dfen Sie die Korona in ein Bierglas und gie\u00dfen Sie die Bacardi-Limone in das Bier. R\u00fchren Sie sehr sanft.",
      "strInstructionsFR": null,
      "strInstructionsIT": "Versare la corona in un bicchiere da birra da 530ml, versare il Bacardi Limon nella birra mescolando molto delicatamente",
      "strInstructionsZH-HANS": null,
      "strInstructionsZH-HANT": null,
      "strDrinkThumb": "https:\/\/www.thecocktaildb.com\/images\/media\/drink\/upvtyt1441249023.jpg",
      "strIngredient1": "Corona",
      "strIngredient2": "Bacardi Limon",
      "strIngredient3": null,
      "strIngredient4": null,
      "strIngredient5": null,
      "strIngredient6": null,
      "strIngredient7": null,
      "strIngredient8": null,
      "strIngredient9": null,
      "strIngredient10": null,
      "strIngredient11": null,
      "strIngredient12": null,
      "strIngredient13": null,
      "strIngredient14": null,
      "strIngredient15": null,
      "strMeasure1": "1 ",
      "strMeasure2": "1 shot ",
      "strMeasure3": null,
      "strMeasure4": null,
      "strMeasure5": null,
      "strMeasure6": null,
      "strMeasure7": null,
      "strMeasure8": null,
      "strMeasure9": null,
      "strMeasure10": null,
      "strMeasure11": null,
      "strMeasure12": null,
      "strMeasure13": null,
      "strMeasure14": null,
      "strMeasure15": null,
      "strImageSource": null,
      "strImageAttribution": null,
      "strCreativeCommonsConfirmed": "No",
      "dateModified": "2015-09-03 03:57:03"
    },
    {
      "idDrink": "17825",
      "strDrink": "Brigadier",
      "strDrinkAlternate": null,
      "strTags": null,
      "strVideo": null,
      "strCategory": "Cocktail",
      "strIBA": null,
      "strAlcoholic": "Alcoholic",
      "strGlass": "Coupe Glass",
      "strInstructions": "Mix ingredients in a warmed mug and stir.",
      "strInstructionsES": null,
      "strInstructionsDE": "Die Zutaten in einem erw\u00e4rmten Becher mischen und umr\u00fchren.",
      "strInstructionsFR": null,
      "strInstructionsIT": "Mescolare gli ingredienti in una tazza calda e mescola.",
      "strInstructionsZH-HANS": null,
      "strInstructionsZH-HANT": null,
      "strDrinkThumb": "https:\/\/www.thecocktaildb.com\/images\/media\/drink\/nl89tf1518947401.jpg",
      "strIngredient1": "Hot Chocolate",
      "strIngredient2": "Green Chartreuse",
      "strIngredient3": "Cherry Heering",
      "strIngredient4": null,
      "strIngredient5": null,
      "strIngredient6": null,
      "strIngredient7": null,
      "strIngredient8": null,
      "strIngredient9": null,
      "strIngredient10": null,
      "strIngredient11": null,
      "strIngredient12": null,
      "strIngredient13": null,
      "strIngredient14": null,
      "strIngredient15": null,
      "strMeasure1": "4 oz",
      "strMeasure2": "1 oz",
      "strMeasure3": "1 oz",
      "strMeasure4": null,
      "strMeasure5": null,
      "strMeasure6": null,
      "strMeasure7": null,
      "strMeasure8": null,
      "strMeasure9": null,
      "strMeasure10": null,
      "strMeasure11": null,
      "strMeasure12": null,
      "strMeasure13": null,
      "strMeasure14": null,
      "strMeasure15": null,
      "strImageSource": null,
      "strImageAttribution": null,
      "strCreativeCommonsConfirmed": "No",
      "dateModified": "2018-02-18 09:50:01"
    },
    {
      "idDrink": "178311",
      "strDrink": "Broadside",
      "strDrinkAlternate": null,
      "strTags": null,
      "strVideo": null,
      "strCategory": "Cocktail",
      "strIBA": null,
      "strAlcoholic": "Alcoholic",
      "strGlass": "Highball glass",
      "strInstructions": "Half fill the glass with ice cubes. Crush the wormwood and add to ice. Pour rum, scotch and butters, then serve!",
      "strInstructionsES": null,
      "strInstructionsDE": null,
      "strInstructionsFR": null,
      "strInstructionsIT": "Riempire a met\u00e0 il bicchiere con cubetti di ghiaccio. Schiacciare l'assenzio e aggiungerlo al ghiaccio. Versare rum, scotch e burro, quindi servire!",
      "strInstructionsZH-HANS": null,
      "strInstructionsZH-HANT": null,
      "strDrinkThumb": "https:\/\/www.thecocktaildb.com\/images\/media\/drink\/l2o6xu1582476870.jpg",
      "strIngredient1": "151 proof rum",
      "strIngredient2": "Scotch",
      "strIngredient3": "Bitters",
      "strIngredient4": "Wormwood",
      "strIngredient5": "Ice",
      "strIngredient6": "",
      "strIngredient7": "",
      "strIngredient8": null,
      "strIngredient9": null,
      "strIngredient10": null,
      "strIngredient11": null,
      "strIngredient12": null,
      "strIngredient13": null,
      "strIngredient14": null,
      "strIngredient15": null,
      "strMeasure1": "1 shot",
      "strMeasure2": "1\/2 shot",
      "strMeasure3": "3 drops",
      "strMeasure4": "1 Fresh",
      "strMeasure5": "cubes",
      "strMeasure6": "",
      "strMeasure7": "",
      "strMeasure8": null,
      "strMeasure9": null,
      "strMeasure10": null,
      "strMeasure11": null,
      "strMeasure12": null,
      "strMeasure13": null,
      "strMeasure14": null,
      "strMeasure15": null,
      "strImageSource": null,
      "strImageAttribution": null,
      "strCreativeCommonsConfirmed": "Yes",
      "dateModified": null
    },
    {
      "idDrink": "11106",
      "strDrink": "Blackthorn",
      "strDrinkAlternate": null,
      "strTags": null,
      "strVideo": null,
      "strCategory": "Ordinary Drink",
      "strIBA": null,
      "strAlcoholic": "Alcoholic",
      "strGlass": "Cocktail glass",
      "strInstructions": "Stir sloe gin and vermouth with ice and strain into a cocktail glass. Add the twist of lemon peel and serve.",
      "strInstructionsES": null,
      "strInstructionsDE": "Sloe Gin und Wermut mit Eis verr\u00fchren und in ein Cocktailglas abseihen. Die Zitronenschale hinzuf\u00fcgen und servieren.",
      "strInstructionsFR": null,
      "strInstructionsIT": "Mescolare il prugnolo e il vermouth con ghiaccio e filtrare in un bicchiere da cocktail. Aggiungere la scorza di limone e servire.",
      "strInstructionsZH-HANS": null,
      "strInstructionsZH-HANT": null,
      "strDrinkThumb": "https:\/\/www.thecocktaildb.com\/images\/media\/drink\/dgj92f1616098672.jpg",
      "strIngredient1": "Sweet Vermouth",
      "strIngredient2": "Sloe gin",
      "strIngredient3": "Lemon peel",
      "strIngredient4": null,
      "strIngredient5": null,
      "strIngredient6": null,
      "strIngredient7": null,
      "strIngredient8": null,
      "strIngredient9": null,
      "strIngredient10": null,
      "strIngredient11": null,
      "strIngredient12": null,
      "strIngredient13": null,
      "strIngredient14": null,
      "strIngredient15": null,
      "strMeasure1": "1 oz ",
      "strMeasure2": "1 1\/2 oz ",
      "strMeasure3": "1 twist of ",
      "strMeasure4": null,
      "strMeasure5": null,
      "strMeasure6": null,
      "strMeasure7": null,
      "strMeasure8": null,
      "strMeasure9": null,
      "strMeasure10": null,
      "strMeasure11": null,
      "strMeasure12": null,
      "strMeasure13": null,
      "strMeasure14": null,
      "strMeasure15": null,
      "strImageSource": null,
      "strImageAttribution": null,
      "strCreativeCommonsConfirmed": "No",
      "dateModified": "2015-09-02 16:57:10"
    },
    {
      "idDrink": "13395",
      "strDrink": "Bob Marley",
      "strDrinkAlternate": null,
      "strTags": null,
      "strVideo": null,
      "strCategory": "Shot",
      "strIBA": null,
      "strAlcoholic": "Alcoholic",
      "strGlass": "Shot glass",
      "strInstructions": "Layer in a 2 oz shot glass or pony glass",
      "strInstructionsES": null,
      "strInstructionsDE": "In einem 6 cl. Schnapsglas oder Ponyglas schichten.",
      "strInstructionsFR": null,
      "strInstructionsIT": "Versa in un bicchierino da 60gr o in un bicchiere da shot.",
      "strInstructionsZH-HANS": null,
      "strInstructionsZH-HANT": null,
      "strDrinkThumb": "https:\/\/www.thecocktaildb.com\/images\/media\/drink\/rrqrst1477140664.jpg",
      "strIngredient1": "Midori melon liqueur",
      "strIngredient2": "J\u00e4germeister",
      "strIngredient3": "Goldschlager",
      "strIngredient4": null,
      "strIngredient5": null,
      "strIngredient6": null,
      "strIngredient7": null,
      "strIngredient8": null,
      "strIngredient9": null,
      "strIngredient10": null,
      "strIngredient11": null,
      "strIngredient12": null,
      "strIngredient13": null,
      "strIngredient14": null,
      "strIngredient15": null,
      "strMeasure1": "1\/2 oz ",
      "strMeasure2": "1\/2 oz ",
      "strMeasure3": "1\/2 oz ",
      "strMeasure4": null,
      "strMeasure5": null,
      "strMeasure6": null,
      "strMeasure7": null,
      "strMeasure8": null,
      "strMeasure9": null,
      "strMeasure10": null,
      "strMeasure11": null,
      "strMeasure12": null,
      "strMeasure13": null,
      "strMeasure14": null,
      "strMeasure15": null,
      "strImageSource": null,
      "strImageAttribution": null,
      "strCreativeCommonsConfirmed": "No",
      "dateModified": "2016-10-22 13:51:04"
    },
    {
      "idDrink": "14538",
      "strDrink": "Bumble Bee",
      "strDrinkAlternate": null,
      "strTags": null,
      "strVideo": null,
      "strCategory": "Shot",
      "strIBA": null,
      "strAlcoholic": "Alcoholic",
      "strGlass": "Shot glass",
      "strInstructions": "This is a layered shot. First pour the Bailey's into the shot glass. Then take an upside down spoon and touch it to the inside wall of the glass. Carefully add the Kahlua. Repeat this process for the Sambuca. If done properly, the alcohol will stay separated and resemble a bumble bee. Enjoy!!!",
      "strInstructionsES": null,
      "strInstructionsDE": "Dies ist ein mehrschichtiges Getr\u00e4nk. Zuerst gie\u00dft man die Bailey's in das Schnapsglas. Nehmen Sie dann einen umgedrehten L\u00f6ffel und ber\u00fchren Sie ihn an der Innenwand des Glases. F\u00fcge das Kahlua vorsichtig hinzu. Wiederholen Sie diesen Vorgang f\u00fcr den Sambuca. Bei richtiger Anwendung bleibt der Alkohol getrennt und \u00e4hnelt einer Hummel. Genie\u00dft es!!!!!!",
      "strInstructionsFR": null,
      "strInstructionsIT": "Questo \u00e8 uno scatto a strati.\r\nPer prima cosa, versa il Bailey's nel bicchierino.\r\nQuindi prendi un cucchiaio capovolto e toccalo sulla parete interna del vetro.\r\nAggiungi con attenzione il Kahlua.\r\nRipeti questo processo per la Sambuca.\r\nSe fatto correttamente, l'alcol rimarr\u00e0 separato e assomiglier\u00e0 a un calabrone",
      "strInstructionsZH-HANS": null,
      "strInstructionsZH-HANT": null,
      "strDrinkThumb": "https:\/\/www.thecocktaildb.com\/images\/media\/drink\/uwqpvv1461866378.jpg",
      "strIngredient1": "Baileys irish cream",
      "strIngredient2": "Kahlua",
      "strIngredient3": "Sambuca",
      "strIngredient4": null,
      "strIngredient5": null,
      "strIngredient6": null,
      "strIngredient7": null,
      "strIngredient8": null,
      "strIngredient9": null,
      "strIngredient10": null,
      "strIngredient11": null,
      "strIngredient12": null,
      "strIngredient13": null,
      "strIngredient14": null,
      "strIngredient15": null,
      "strMeasure1": "1\/3 oz ",
      "strMeasure2": "1\/3 oz ",
      "strMeasure3": "1\/3 oz ",
      "strMeasure4": null,
      "strMeasure5": null,
      "strMeasure6": null,
      "strMeasure7": null,
      "strMeasure8": null,
      "strMeasure9": null,
      "strMeasure10": null,
      "strMeasure11": null,
      "strMeasure12": null,
      "strMeasure13": null,
      "strMeasure14": null,
      "strMeasure15": null,
      "strImageSource": null,
      "strImageAttribution": null,
      "strCreativeCommonsConfirmed": "No",
      "dateModified": "2016-04-28 18:59:38"
    },
    {
      "idDrink": "14730",
      "strDrink": "Bubble Gum",
      "strDrinkAlternate": null,
      "strTags": null,
      "strVideo": null,
      "strCategory": "Shot",
      "strIBA": null,
      "strAlcoholic": "Alcoholic",
      "strGlass": "Shot glass",
      "strInstructions": "Layer in order into a shot glass.",
      "strInstructionsES": null,
      "strInstructionsDE": "Nacheinander in ein Schnapsglas schichten.",
      "strInstructionsFR": null,
      "strInstructionsIT": "Versare a strati nell'ordine di ingrediente",
      "strInstructionsZH-HANS": null,
      "strInstructionsZH-HANT": null,
      "strDrinkThumb": "https:\/\/www.thecocktaildb.com\/images\/media\/drink\/spuurv1468878783.jpg",
      "strIngredient1": "Vodka",
      "strIngredient2": "Banana liqueur",
      "strIngredient3": "Orange juice",
      "strIngredient4": "Peach schnapps",
      "strIngredient5": null,
      "strIngredient6": null,
      "strIngredient7": null,
      "strIngredient8": null,
      "strIngredient9": null,
      "strIngredient10": null,
      "strIngredient11": null,
      "strIngredient12": null,
      "strIngredient13": null,
      "strIngredient14": null,
      "strIngredient15": null,
      "strMeasure1": "1\/4 ",
      "strMeasure2": "1\/4 ",
      "strMeasure3": "1\/4 ",
      "strMeasure4": "1\/4 ",
      "strMeasure5": null,
      "strMeasure6": null,
      "strMeasure7": null,
      "strMeasure8": null,
      "strMeasure9": null,
      "strMeasure10": null,
      "strMeasure11": null,
      "strMeasure12": null,
      "strMeasure13": null,
      "strMeasure14": null,
      "strMeasure15": null,
      "strImageSource": null,
      "strImageAttribution": null,
      "strCreativeCommonsConfirmed": "No",
      "dateModified": "2016-07-18 22:53:03"
    },
    {
      "idDrink": "16986",
      "strDrink": "Bible Belt",
      "strDrinkAlternate": null,
      "strTags": null,
      "strVideo": null,
      "strCategory": "Other\/Unknown",
      "strIBA": null,
      "strAlcoholic": "Alcoholic",
      "strGlass": "Highball glass",
      "strInstructions": "Mix all ingredients, and pour over ice.",
      "strInstructionsES": null,
      "strInstructionsDE": "Alle Zutaten mischen und \u00fcber Eis gie\u00dfen.",
      "strInstructionsFR": null,
      "strInstructionsIT": "Mescolare tutti gli ingredienti e versare su un bicchiere con del ghiaccio.",
      "strInstructionsZH-HANS": null,
      "strInstructionsZH-HANT": null,
      "strDrinkThumb": "https:\/\/www.thecocktaildb.com\/images\/media\/drink\/6bec6v1503563675.jpg",
      "strIngredient1": "Southern Comfort",
      "strIngredient2": "Triple sec",
      "strIngredient3": "Lime",
      "strIngredient4": "Sour mix",
      "strIngredient5": null,
      "strIngredient6": null,
      "strIngredient7": null,
      "strIngredient8": null,
      "strIngredient9": null,
      "strIngredient10": null,
      "strIngredient11": null,
      "strIngredient12": null,
      "strIngredient13": null,
      "strIngredient14": null,
      "strIngredient15": null,
      "strMeasure1": "2 oz ",
      "strMeasure2": "1\/2 oz ",
      "strMeasure3": "2 wedges ",
      "strMeasure4": "2 oz ",
      "strMeasure5": null,
      "strMeasure6": null,
      "strMeasure7": null,
      "strMeasure8": null,
      "strMeasure9": null,
      "strMeasure10": null,
      "strMeasure11": null,
      "strMeasure12": null,
      "strMeasure13": null,
      "strMeasure14": null,
      "strMeasure15": null,
      "strImageSource": null,
      "strImageAttribution": null,
      "strCreativeCommonsConfirmed": "No",
      "dateModified": "2017-08-24 09:34:35"
    },
    {
      "idDrink": "17120",
      "strDrink": "Brain Fart",
      "strDrinkAlternate": null,
      "strTags": null,
      "strVideo": null,
      "strCategory": "Punch \/ Party Drink",
      "strIBA": null,
      "strAlcoholic": "Alcoholic",
      "strGlass": "Punch bowl",
      "strInstructions": "Mix all ingredients together. Slowly and gently. Works best if ice is added to punch bowl and soda's are very cold.",
      "strInstructionsES": null,
      "strInstructionsDE": "Alle Zutaten miteinander vermengen. Langsam und sanft. Funktioniert am besten, wenn Eis in die Bowle gegeben wird und die Soda sehr kalt ist.",
      "strInstructionsFR": null,
      "strInstructionsIT": "Mescola tutti gli ingredienti insieme.\r\nLentamente e delicatamente.\r\nFunziona meglio se si aggiunge ghiaccio alla ciotola del punch e se le bibite sono molto fredde.",
      "strInstructionsZH-HANS": null,
      "strInstructionsZH-HANT": null,
      "strDrinkThumb": "https:\/\/www.thecocktaildb.com\/images\/media\/drink\/rz5aun1504389701.jpg",
      "strIngredient1": "Everclear",
      "strIngredient2": "Vodka",
      "strIngredient3": "Mountain Dew",
      "strIngredient4": "Surge",
      "strIngredient5": "Lemon juice",
      "strIngredient6": "Rum",
      "strIngredient7": null,
      "strIngredient8": null,
      "strIngredient9": null,
      "strIngredient10": null,
      "strIngredient11": null,
      "strIngredient12": null,
      "strIngredient13": null,
      "strIngredient14": null,
      "strIngredient15": null,
      "strMeasure1": "1 fifth ",
      "strMeasure2": "1 fifth Smirnoff red label ",
      "strMeasure3": "2 L ",
      "strMeasure4": "2 L ",
      "strMeasure5": "1 small bottle ",
      "strMeasure6": "1 pint ",
      "strMeasure7": null,
      "strMeasure8": null,
      "strMeasure9": null,
      "strMeasure10": null,
      "strMeasure11": null,
      "strMeasure12": null,
      "strMeasure13": null,
      "strMeasure14": null,
      "strMeasure15": null,
      "strImageSource": null,
      "strImageAttribution": null,
      "strCreativeCommonsConfirmed": "No",
      "dateModified": "2017-09-02 23:01:42"
    },
    {
      "idDrink": "11113",
      "strDrink": "Bloody Mary",
      "strDrinkAlternate": null,
      "strTags": "IBA,ContemporaryClassic",
      "strVideo": null,
      "strCategory": "Ordinary Drink",
      "strIBA": "Contemporary Classics",
      "strAlcoholic": "Alcoholic",
      "strGlass": "Old-fashioned glass",
      "strInstructions": "Stirring gently, pour all ingredients into highball glass. Garnish.",
      "strInstructionsES": null,
      "strInstructionsDE": "Unter leichtem R\u00fchren alle Zutaten in ein Highball-Glas geben. Garnieren.",
      "strInstructionsFR": null,
      "strInstructionsIT": "Mescolando delicatamente, versare tutti gli ingredienti nel bicchiere highball.",
      "strInstructionsZH-HANS": null,
      "strInstructionsZH-HANT": null,
      "strDrinkThumb": "https:\/\/www.thecocktaildb.com\/images\/media\/drink\/t6caa21582485702.jpg",
      "strIngredient1": "Vodka",
      "strIngredient2": "Tomato juice",
      "strIngredient3": "Lemon juice",
      "strIngredient4": "Worcestershire sauce",
      "strIngredient5": "Tabasco sauce",
      "strIngredient6": "Lime",
      "strIngredient7": null,
      "strIngredient8": null,
      "strIngredient9": null,
      "strIngredient10": null,
      "strIngredient11": null,
      "strIngredient12": null,
      "strIngredient13": null,
      "strIngredient14": null,
      "strIngredient15": null,
      "strMeasure1": "1 1\/2 oz ",
      "strMeasure2": "3 oz ",
      "strMeasure3": "1 dash ",
      "strMeasure4": "1\/2 tsp ",
      "strMeasure5": "2-3 drops ",
      "strMeasure6": "1 wedge ",
      "strMeasure7": null,
      "strMeasure8": null,
      "strMeasure9": null,
      "strMeasure10": null,
      "strMeasure11": null,
      "strMeasure12": null,
      "strMeasure13": null,
      "strMeasure14": null,
      "strMeasure15": null,
      "strImageSource": "https:\/\/www.thecocktaildb.com\/drink\/11113-Bloody-Mary",
      "strImageAttribution": "TheCocktialDB.com",
      "strCreativeCommonsConfirmed": "Yes",
      "dateModified": "2015-08-18 15:09:14"
    },
    {
      "idDrink": "11117",
      "strDrink": "Blue Lagoon",
      "strDrinkAlternate": null,
      "strTags": null,
      "strVideo": null,
      "strCategory": "Ordinary Drink",
      "strIBA": null,
      "strAlcoholic": "Alcoholic",
      "strGlass": "Highball glass",
      "strInstructions": "Pour vodka and curacao over ice in a highball glass. Fill with lemonade, top with the cherry, and serve.",
      "strInstructionsES": null,
      "strInstructionsDE": "Gie\u00dfen Sie Wodka und Curacao in einem Highball-Glas \u00fcber Eis. Mit Limonade f\u00fcllen, mit der Kirsche verzieren und servieren.",
      "strInstructionsFR": null,
      "strInstructionsIT": "Versare la vodka e il curacao in un bicchiere highball. Aggiungi cubetti di ghiaccio. Riempi con la limonata, guarnisci con la ciliegia e servi.",
      "strInstructionsZH-HANS": null,
      "strInstructionsZH-HANT": null,
      "strDrinkThumb": "https:\/\/www.thecocktaildb.com\/images\/media\/drink\/5wm4zo1582579154.jpg",
      "strIngredient1": "Vodka",
      "strIngredient2": "Blue Curacao",
      "strIngredient3": "Lemonade",
      "strIngredient4": "Cherry",
      "strIngredient5": null,
      "strIngredient6": null,
      "strIngredient7": null,
      "strIngredient8": null,
      "strIngredient9": null,
      "strIngredient10": null,
      "strIngredient11": null,
      "strIngredient12": null,
      "strIngredient13": null,
      "strIngredient14": null,
      "strIngredient15": null,
      "strMeasure1": "1 oz ",
      "strMeasure2": "1 oz ",
      "strMeasure3": null,
      "strMeasure4": null,
      "strMeasure5": null,
      "strMeasure6": null,
      "strMeasure7": null,
      "strMeasure8": null,
      "strMeasure9": null,
      "strMeasure10": null,
      "strMeasure11": null,
      "strMeasure12": null,
      "strMeasure13": null,
      "strMeasure14": null,
      "strMeasure15": null,
      "strImageSource": null,
      "strImageAttribution": null,
      "strCreativeCommonsConfirmed": "Yes",
      "dateModified": "2017-09-02 22:58:25"
    },
    {
      "idDrink": "11129",
      "strDrink": "Boston Sour",
      "strDrinkAlternate": null,
      "strTags": null,
      "strVideo": null,
      "strCategory": "Ordinary Drink",
      "strIBA": null,
      "strAlcoholic": "Alcoholic",
      "strGlass": "Whiskey sour glass",
      "strInstructions": "Shake juice of lemon, powdered sugar, blended whiskey, and egg white with cracked ice and strain into a whiskey sour glass. Add the slice of lemon, top with the cherry, and serve.",
      "strInstructionsES": null,
      "strInstructionsDE": "Den Saft von Zitrone, Puderzucker, gemischtem Whiskey und Eiwei\u00df mit zerkleinertem Eis sch\u00fctteln und in ein Whisky Sour Glas abseihen. Die Zitronenscheibe dazugeben, mit der Kirsche garnieren und servieren.",
      "strInstructionsFR": null,
      "strInstructionsIT": "Shakerare il succo di limone, lo zucchero a velo, il whisky miscelato e l'albume con ghiaccio tritato e filtrare in un bicchiere da whisky sour.Aggiungere la fetta di limone, guarnire con la ciliegia e servire.",
      "strInstructionsZH-HANS": null,
      "strInstructionsZH-HANT": null,
      "strDrinkThumb": "https:\/\/www.thecocktaildb.com\/images\/media\/drink\/kxlgbi1504366100.jpg",
      "strIngredient1": "Blended whiskey",
      "strIngredient2": "Lemon",
      "strIngredient3": "Powdered sugar",
      "strIngredient4": "Egg white",
      "strIngredient5": "Lemon",
      "strIngredient6": "Cherry",
      "strIngredient7": null,
      "strIngredient8": null,
      "strIngredient9": null,
      "strIngredient10": null,
      "strIngredient11": null,
      "strIngredient12": null,
      "strIngredient13": null,
      "strIngredient14": null,
      "strIngredient15": null,
      "strMeasure1": "2 oz ",
      "strMeasure2": "Juice of 1\/2 ",
      "strMeasure3": "1 tsp ",
      "strMeasure4": "1 ",
      "strMeasure5": "1 slice ",
      "strMeasure6": "1 ",
      "strMeasure7": null,
      "strMeasure8": null,
      "strMeasure9": null,
      "strMeasure10": null,
      "strMeasure11": null,
      "strMeasure12": null,
      "strMeasure13": null,
      "strMeasure14": null,
      "strMeasure15": null,
      "strImageSource": null,
      "strImageAttribution": null,
      "strCreativeCommonsConfirmed": "No",
      "dateModified": "2017-09-02 16:28:20"
    }
  ]
}
