{
    "admin_user": {
        "column": {
            "representive_id": true
        }
    },
    "sales_order": {
        "column": {
            "placed_by_salesperson": true,
            "salesperson_id": true
        }
    },
    "sales_order_grid": {
        "column": {
            "placed_by_salesperson": true,
            "salesperson_id": true
        }
    }
}
