<?xml version="1.0" encoding="UTF-8" standalone="no"?><svg xmlns="http://www.w3.org/2000/svg" xmlns:xlink="http://www.w3.org/1999/xlink" contentScriptType="application/ecmascript" contentStyleType="text/css" height="808px" preserveAspectRatio="none" style="width:807px;height:808px;background:#FFFFFF;" version="1.1" viewBox="0 0 807 808" width="807px" zoomAndPan="magnify"><defs><filter height="300%" id="f1bnjx1lumyti" width="300%" x="-1" y="-1"><feGaussianBlur result="blurOut" stdDeviation="2.0"/><feColorMatrix in="blurOut" result="blurOut2" type="matrix" values="0 0 0 0 0 0 0 0 0 0 0 0 0 0 0 0 0 0 .4 0"/><feOffset dx="4.0" dy="4.0" in="blurOut2" result="blurOut3"/><feBlend in="SourceGraphic" in2="blurOut3" mode="normal"/></filter></defs><g><text fill="#000000" font-family="sans-serif" font-size="18" lengthAdjust="spacing" textLength="292" x="255.25" y="29.4023">User Verification - AS-IS NON-UK</text><rect fill="#FFFFFF" filter="url(#f1bnjx1lumyti)" height="550.9238" style="stroke:#A80036;stroke-width:1.0;" width="10" x="118.5" y="154.998"/><rect fill="#FFFFFF" filter="url(#f1bnjx1lumyti)" height="71.6211" style="stroke:#A80036;stroke-width:1.0;" width="10" x="476.5" y="402.1719"/><rect fill="#FFFFFF" filter="url(#f1bnjx1lumyti)" height="203.8633" style="stroke:#A80036;stroke-width:1.0;" width="10" x="581.5" y="184.3086"/><rect fill="#FFFFFF" filter="url(#f1bnjx1lumyti)" height="29.3105" style="stroke:#A80036;stroke-width:1.0;" width="10" x="581.5" y="566.7246"/><rect fill="#FFFFFF" filter="url(#f1bnjx1lumyti)" height="29.3105" style="stroke:#A80036;stroke-width:1.0;" width="10" x="581.5" y="640.3008"/><rect fill="#FFFFFF" filter="url(#f1bnjx1lumyti)" height="29.3105" style="stroke:#A80036;stroke-width:1.0;" width="10" x="747.5" y="255.9297"/><rect fill="#FFFFFF" filter="url(#f1bnjx1lumyti)" height="59.6211" style="stroke:#000000;stroke-width:2.0;" width="221" x="538.5" y="300.2402"/><rect fill="#FFFFFF" filter="url(#f1bnjx1lumyti)" height="188.8184" style="stroke:#000000;stroke-width:2.0;" width="670" x="51" y="488.793"/><rect fill="#FFFFFF" height="73.5762" style="stroke:none;stroke-width:1.0;" width="670" x="51" y="604.0352"/><line style="stroke:#A80036;stroke-width:1.0;stroke-dasharray:5.0,5.0;" x1="28" x2="28" y1="123.6875" y2="723.9219"/><line style="stroke:#A80036;stroke-width:1.0;stroke-dasharray:5.0,5.0;" x1="123" x2="123" y1="123.6875" y2="723.9219"/><line style="stroke:#A80036;stroke-width:1.0;stroke-dasharray:5.0,5.0;" x1="274" x2="274" y1="123.6875" y2="723.9219"/><line style="stroke:#A80036;stroke-width:1.0;stroke-dasharray:5.0,5.0;" x1="398" x2="398" y1="123.6875" y2="723.9219"/><line style="stroke:#A80036;stroke-width:1.0;stroke-dasharray:5.0,5.0;" x1="481" x2="481" y1="123.6875" y2="723.9219"/><line style="stroke:#A80036;stroke-width:1.0;stroke-dasharray:5.0,5.0;" x1="586.5" x2="586.5" y1="123.6875" y2="723.9219"/><line style="stroke:#A80036;stroke-width:1.0;stroke-dasharray:5.0,5.0;" x1="752.5" x2="752.5" y1="123.6875" y2="723.9219"/><text fill="#000000" font-family="sans-serif" font-size="14" lengthAdjust="spacing" textLength="40" x="5" y="120.7344">Client</text><ellipse cx="28" cy="50.1992" fill="#FEFECE" filter="url(#f1bnjx1lumyti)" rx="8" ry="8" style="stroke:#A80036;stroke-width:2.0;"/><path d="M28,58.1992 L28,85.1992 M15,66.1992 L41,66.1992 M28,85.1992 L15,100.1992 M28,85.1992 L41,100.1992 " fill="none" filter="url(#f1bnjx1lumyti)" style="stroke:#A80036;stroke-width:2.0;"/><text fill="#000000" font-family="sans-serif" font-size="14" lengthAdjust="spacing" textLength="40" x="5" y="736.457">Client</text><ellipse cx="28" cy="749.4102" fill="#FEFECE" filter="url(#f1bnjx1lumyti)" rx="8" ry="8" style="stroke:#A80036;stroke-width:2.0;"/><path d="M28,757.4102 L28,784.4102 M15,765.4102 L41,765.4102 M28,784.4102 L15,799.4102 M28,784.4102 L41,799.4102 " fill="none" filter="url(#f1bnjx1lumyti)" style="stroke:#A80036;stroke-width:2.0;"/><rect fill="#FEFECE" filter="url(#f1bnjx1lumyti)" height="30.4883" style="stroke:#A80036;stroke-width:1.5;" width="121" x="61" y="88.1992"/><text fill="#000000" font-family="sans-serif" font-size="14" lengthAdjust="spacing" textLength="107" x="68" y="108.7344">Registration MS</text><rect fill="#FEFECE" filter="url(#f1bnjx1lumyti)" height="30.4883" style="stroke:#A80036;stroke-width:1.5;" width="121" x="61" y="722.9219"/><text fill="#000000" font-family="sans-serif" font-size="14" lengthAdjust="spacing" textLength="107" x="68" y="743.457">Registration MS</text><rect fill="#FEFECE" filter="url(#f1bnjx1lumyti)" height="30.4883" style="stroke:#A80036;stroke-width:1.5;" width="152" x="196" y="88.1992"/><text fill="#000000" font-family="sans-serif" font-size="14" lengthAdjust="spacing" textLength="138" x="203" y="108.7344">Account Verification</text><rect fill="#FEFECE" filter="url(#f1bnjx1lumyti)" height="30.4883" style="stroke:#A80036;stroke-width:1.5;" width="152" x="196" y="722.9219"/><text fill="#000000" font-family="sans-serif" font-size="14" lengthAdjust="spacing" textLength="138" x="203" y="743.457">Account Verification</text><rect fill="#FEFECE" filter="url(#f1bnjx1lumyti)" height="30.4883" style="stroke:#A80036;stroke-width:1.5;" width="69" x="362" y="88.1992"/><text fill="#000000" font-family="sans-serif" font-size="14" lengthAdjust="spacing" textLength="55" x="369" y="108.7344">Sphonic</text><rect fill="#FEFECE" filter="url(#f1bnjx1lumyti)" height="30.4883" style="stroke:#A80036;stroke-width:1.5;" width="69" x="362" y="722.9219"/><text fill="#000000" font-family="sans-serif" font-size="14" lengthAdjust="spacing" textLength="55" x="369" y="743.457">Sphonic</text><rect fill="#FEFECE" filter="url(#f1bnjx1lumyti)" height="30.4883" style="stroke:#A80036;stroke-width:1.5;" width="69" x="445" y="88.1992"/><text fill="#000000" font-family="sans-serif" font-size="14" lengthAdjust="spacing" textLength="55" x="452" y="108.7344">Iovation</text><rect fill="#FEFECE" filter="url(#f1bnjx1lumyti)" height="30.4883" style="stroke:#A80036;stroke-width:1.5;" width="69" x="445" y="722.9219"/><text fill="#000000" font-family="sans-serif" font-size="14" lengthAdjust="spacing" textLength="55" x="452" y="743.457">Iovation</text><rect fill="#FEFECE" filter="url(#f1bnjx1lumyti)" height="30.4883" style="stroke:#A80036;stroke-width:1.5;" width="72" x="548.5" y="88.1992"/><text fill="#000000" font-family="sans-serif" font-size="14" lengthAdjust="spacing" textLength="58" x="555.5" y="108.7344">OpenBet</text><rect fill="#FEFECE" filter="url(#f1bnjx1lumyti)" height="30.4883" style="stroke:#A80036;stroke-width:1.5;" width="72" x="548.5" y="722.9219"/><text fill="#000000" font-family="sans-serif" font-size="14" lengthAdjust="spacing" textLength="58" x="555.5" y="743.457">OpenBet</text><rect fill="#FEFECE" filter="url(#f1bnjx1lumyti)" height="30.4883" style="stroke:#A80036;stroke-width:1.5;" width="86" x="707.5" y="88.1992"/><text fill="#000000" font-family="sans-serif" font-size="14" lengthAdjust="spacing" textLength="72" x="714.5" y="108.7344">Call Credit</text><rect fill="#FEFECE" filter="url(#f1bnjx1lumyti)" height="30.4883" style="stroke:#A80036;stroke-width:1.5;" width="86" x="707.5" y="722.9219"/><text fill="#000000" font-family="sans-serif" font-size="14" lengthAdjust="spacing" textLength="72" x="714.5" y="743.457">Call Credit</text><rect fill="#FFFFFF" filter="url(#f1bnjx1lumyti)" height="550.9238" style="stroke:#A80036;stroke-width:1.0;" width="10" x="118.5" y="154.998"/><rect fill="#FFFFFF" filter="url(#f1bnjx1lumyti)" height="71.6211" style="stroke:#A80036;stroke-width:1.0;" width="10" x="476.5" y="402.1719"/><rect fill="#FFFFFF" filter="url(#f1bnjx1lumyti)" height="203.8633" style="stroke:#A80036;stroke-width:1.0;" width="10" x="581.5" y="184.3086"/><rect fill="#FFFFFF" filter="url(#f1bnjx1lumyti)" height="29.3105" style="stroke:#A80036;stroke-width:1.0;" width="10" x="581.5" y="566.7246"/><rect fill="#FFFFFF" filter="url(#f1bnjx1lumyti)" height="29.3105" style="stroke:#A80036;stroke-width:1.0;" width="10" x="581.5" y="640.3008"/><rect fill="#FFFFFF" filter="url(#f1bnjx1lumyti)" height="29.3105" style="stroke:#A80036;stroke-width:1.0;" width="10" x="747.5" y="255.9297"/><polygon fill="#A80036" points="106.5,150.998,116.5,154.998,106.5,158.998,110.5,154.998" style="stroke:#A80036;stroke-width:1.0;"/><line style="stroke:#A80036;stroke-width:1.0;" x1="28" x2="112.5" y1="154.998" y2="154.998"/><text fill="#000000" font-family="sans-serif" font-size="13" lengthAdjust="spacing" textLength="48" x="35" y="150.2559">register</text><polygon fill="#A80036" points="569.5,180.3086,579.5,184.3086,569.5,188.3086,573.5,184.3086" style="stroke:#A80036;stroke-width:1.0;"/><line style="stroke:#A80036;stroke-width:1.0;" x1="128.5" x2="575.5" y1="184.3086" y2="184.3086"/><text fill="#000000" font-family="sans-serif" font-size="13" lengthAdjust="spacing" textLength="97" x="135.5" y="179.5664">reqAccountAdd</text><line style="stroke:#A80036;stroke-width:1.0;" x1="591.5" x2="633.5" y1="213.6191" y2="213.6191"/><line style="stroke:#A80036;stroke-width:1.0;" x1="633.5" x2="633.5" y1="213.6191" y2="226.6191"/><line style="stroke:#A80036;stroke-width:1.0;" x1="592.5" x2="633.5" y1="226.6191" y2="226.6191"/><polygon fill="#A80036" points="602.5,222.6191,592.5,226.6191,602.5,230.6191,598.5,226.6191" style="stroke:#A80036;stroke-width:1.0;"/><text fill="#000000" font-family="sans-serif" font-size="13" lengthAdjust="spacing" textLength="92" x="598.5" y="208.877">create account</text><polygon fill="#A80036" points="735.5,251.9297,745.5,255.9297,735.5,259.9297,739.5,255.9297" style="stroke:#A80036;stroke-width:1.0;"/><line style="stroke:#A80036;stroke-width:1.0;" x1="591.5" x2="741.5" y1="255.9297" y2="255.9297"/><text fill="#000000" font-family="sans-serif" font-size="13" lengthAdjust="spacing" textLength="89" x="598.5" y="251.1875">verify account</text><polygon fill="#A80036" points="602.5,281.2402,592.5,285.2402,602.5,289.2402,598.5,285.2402" style="stroke:#A80036;stroke-width:1.0;"/><line style="stroke:#A80036;stroke-width:1.0;stroke-dasharray:2.0,2.0;" x1="596.5" x2="751.5" y1="285.2402" y2="285.2402"/><text fill="#000000" font-family="sans-serif" font-size="13" lengthAdjust="spacing" textLength="132" x="608.5" y="280.498">verification response</text><path d="M538.5,300.2402 L600.5,300.2402 L600.5,307.2402 L590.5,317.2402 L538.5,317.2402 L538.5,300.2402 " fill="#EEEEEE" style="stroke:#000000;stroke-width:1.0;"/><rect fill="none" height="59.6211" style="stroke:#000000;stroke-width:2.0;" width="221" x="538.5" y="300.2402"/><text fill="#000000" font-family="sans-serif" font-size="13" font-weight="bold" lengthAdjust="spacing" textLength="17" x="553.5" y="313.8086">alt</text><text fill="#000000" font-family="sans-serif" font-size="11" font-weight="bold" lengthAdjust="spacing" textLength="139" x="615.5" y="312.875">[Account NOT VERIFIED]</text><line style="stroke:#A80036;stroke-width:1.0;" x1="591.5" x2="633.5" y1="338.8613" y2="338.8613"/><line style="stroke:#A80036;stroke-width:1.0;" x1="633.5" x2="633.5" y1="338.8613" y2="351.8613"/><line style="stroke:#A80036;stroke-width:1.0;" x1="592.5" x2="633.5" y1="351.8613" y2="351.8613"/><polygon fill="#A80036" points="602.5,347.8613,592.5,351.8613,602.5,355.8613,598.5,351.8613" style="stroke:#A80036;stroke-width:1.0;"/><text fill="#000000" font-family="sans-serif" font-size="13" lengthAdjust="spacing" textLength="47" x="598.5" y="334.1191">set flag</text><polygon fill="#A80036" points="139.5,384.1719,129.5,388.1719,139.5,392.1719,135.5,388.1719" style="stroke:#A80036;stroke-width:1.0;"/><line style="stroke:#A80036;stroke-width:1.0;stroke-dasharray:2.0,2.0;" x1="133.5" x2="585.5" y1="388.1719" y2="388.1719"/><text fill="#000000" font-family="sans-serif" font-size="13" lengthAdjust="spacing" textLength="79" x="145.5" y="383.4297">response OK</text><polygon fill="#A80036" points="464.5,398.1719,474.5,402.1719,464.5,406.1719,468.5,402.1719" style="stroke:#A80036;stroke-width:1.0;"/><line style="stroke:#A80036;stroke-width:1.0;" x1="128.5" x2="470.5" y1="402.1719" y2="402.1719"/><line style="stroke:#A80036;stroke-width:1.0;" x1="486.5" x2="528.5" y1="431.4824" y2="431.4824"/><line style="stroke:#A80036;stroke-width:1.0;" x1="528.5" x2="528.5" y1="431.4824" y2="444.4824"/><line style="stroke:#A80036;stroke-width:1.0;" x1="487.5" x2="528.5" y1="444.4824" y2="444.4824"/><polygon fill="#A80036" points="497.5,440.4824,487.5,444.4824,497.5,448.4824,493.5,444.4824" style="stroke:#A80036;stroke-width:1.0;"/><text fill="#000000" font-family="sans-serif" font-size="13" lengthAdjust="spacing" textLength="81" x="493.5" y="426.7402">check device</text><polygon fill="#A80036" points="139.5,469.793,129.5,473.793,139.5,477.793,135.5,473.793" style="stroke:#A80036;stroke-width:1.0;"/><line style="stroke:#A80036;stroke-width:1.0;stroke-dasharray:2.0,2.0;" x1="133.5" x2="480.5" y1="473.793" y2="473.793"/><text fill="#000000" font-family="sans-serif" font-size="13" lengthAdjust="spacing" textLength="36" x="145.5" y="469.0508">result</text><path d="M51,488.793 L113,488.793 L113,495.793 L103,505.793 L51,505.793 L51,488.793 " fill="#EEEEEE" style="stroke:#000000;stroke-width:1.0;"/><rect fill="none" height="188.8184" style="stroke:#000000;stroke-width:2.0;" width="670" x="51" y="488.793"/><text fill="#000000" font-family="sans-serif" font-size="13" font-weight="bold" lengthAdjust="spacing" textLength="17" x="66" y="502.3613">alt</text><text fill="#000000" font-family="sans-serif" font-size="11" font-weight="bold" lengthAdjust="spacing" textLength="152" x="128" y="501.4277">[Iovation check is REVIEW]</text><path d="M462,511.1035 L462,536.1035 L707,536.1035 L707,521.1035 L697,511.1035 L462,511.1035 " fill="#FBFB77" filter="url(#f1bnjx1lumyti)" style="stroke:#A80036;stroke-width:1.0;"/><path d="M697,511.1035 L697,521.1035 L707,521.1035 L697,511.1035 " fill="#FBFB77" style="stroke:#A80036;stroke-width:1.0;"/><text fill="#000000" font-family="sans-serif" font-size="13" lengthAdjust="spacing" textLength="224" x="468" y="528.6719">TODO: clarify what is the flag name</text><polygon fill="#A80036" points="569.5,562.7246,579.5,566.7246,569.5,570.7246,573.5,566.7246" style="stroke:#A80036;stroke-width:1.0;"/><line style="stroke:#A80036;stroke-width:1.0;" x1="128.5" x2="575.5" y1="566.7246" y2="566.7246"/><text fill="#000000" font-family="sans-serif" font-size="13" lengthAdjust="spacing" textLength="152" x="135.5" y="561.9824">set soft flag for account</text><polygon fill="#A80036" points="139.5,592.0352,129.5,596.0352,139.5,600.0352,135.5,596.0352" style="stroke:#A80036;stroke-width:1.0;"/><line style="stroke:#A80036;stroke-width:1.0;stroke-dasharray:2.0,2.0;" x1="133.5" x2="585.5" y1="596.0352" y2="596.0352"/><text fill="#000000" font-family="sans-serif" font-size="13" lengthAdjust="spacing" textLength="57" x="145.5" y="591.293">response</text><line style="stroke:#000000;stroke-width:1.0;stroke-dasharray:2.0,2.0;" x1="51" x2="721" y1="605.0352" y2="605.0352"/><text fill="#000000" font-family="sans-serif" font-size="11" font-weight="bold" lengthAdjust="spacing" textLength="152" x="56" y="615.6699">[Iovation check is DENIED]</text><polygon fill="#A80036" points="569.5,636.3008,579.5,640.3008,569.5,644.3008,573.5,640.3008" style="stroke:#A80036;stroke-width:1.0;"/><line style="stroke:#A80036;stroke-width:1.0;" x1="128.5" x2="575.5" y1="640.3008" y2="640.3008"/><text fill="#000000" font-family="sans-serif" font-size="13" lengthAdjust="spacing" textLength="277" x="135.5" y="635.5586">set hard flag IOVATION_DENIED for account</text><polygon fill="#A80036" points="139.5,665.6113,129.5,669.6113,139.5,673.6113,135.5,669.6113" style="stroke:#A80036;stroke-width:1.0;"/><line style="stroke:#A80036;stroke-width:1.0;stroke-dasharray:2.0,2.0;" x1="133.5" x2="585.5" y1="669.6113" y2="669.6113"/><text fill="#000000" font-family="sans-serif" font-size="13" lengthAdjust="spacing" textLength="57" x="145.5" y="664.8691">response</text><polygon fill="#A80036" points="39,701.9219,29,705.9219,39,709.9219,35,705.9219" style="stroke:#A80036;stroke-width:1.0;"/><line style="stroke:#A80036;stroke-width:1.0;stroke-dasharray:2.0,2.0;" x1="33" x2="122.5" y1="705.9219" y2="705.9219"/><text fill="#000000" font-family="sans-serif" font-size="13" lengthAdjust="spacing" textLength="57" x="45" y="701.1797">response</text><!--MD5=[0902062c83bf1d8da960572374d35f31]
@startuml User Verification NON UK (AS-IS)

title User Verification - AS-IS NON-UK

actor Client as client
participant "Registration MS" as regMs
participant "Account Verification" as accountVer
participant Sphonic as sphonic
participant Iovation as iovation
participant OpenBet as ob
participant "Call Credit" as callCredit

client -> regMs: register
activate regMs
    regMs -> ob: reqAccountAdd
    activate ob
        ob -> ob: create account
        ob -> callCredit: verify account
        activate callCredit
            callCredit - -> ob: verification response
        deactivate callCredit
        alt Account NOT VERIFIED
            ob -> ob: set flag
        end
        ob - -> regMs: response OK
    deactivate ob
    regMs -> iovation
    activate iovation
        iovation -> iovation: check device
        iovation - -> regMs: result
    deactivate iovation
    alt Iovation check is REVIEW
        note over ob: TODO: clarify what is the flag name
        regMs -> ob: set soft flag for account
        activate ob
            ob - -> regMs: response
        deactivate ob
    else Iovation check is DENIED
        regMs -> ob: set hard flag IOVATION_DENIED for account
        activate ob
            ob - -> regMs: response
        deactivate ob
    end
    regMs - -> client: response
deactivate regMs
@enduml

PlantUML version 1.2021.7(Sun May 23 14:40:07 CEST 2021)
(GPL source distribution)
Java Runtime: Java(TM) SE Runtime Environment
JVM: Java HotSpot(TM) 64-Bit Server VM
Default Encoding: UTF-8
Language: en
Country: PL
--></g></svg>