@startuml User Creation - IT AS-IS
title User Creation - IT AS-IS

actor "Client App" as client
participant "GraphQL Gateway" as gql
participant "Accounts MS" as accounts
participant "Iovation" as iovation
participant "Open Bet" as ob
participant "SOGEI" as sogei

client -> gql: registerUserIt
activate gql
    gql -> accounts: POST /account
    activate accounts
        accounts -> ob: reqAddAccount
        activate ob
            ob -> ob: create account
            ob -> sogei: verify user identity
            activate sogei
                sogei --> ob: response
            deactivate sogei
            alt user is NOT verified
                note over ob: TODO: clarify what is the flag name
                ob -> ob: add flag to the user profile
            end
            ob --> accounts: response
        deactivate ob
        accounts -> iovation: verify device
        activate iovation
            iovation --> accounts: response
            alt Iovation check is REVIEW
                note over ob: TODO: clarify what is the flag name
                accounts -> ob: set soft flag for account
                activate ob
                    ob --> accounts: response
                deactivate ob
            else Iovation check is DENIED
                accounts -> ob: set hard flag IOVATION_DENIED for account
                activate ob
                    ob --> accounts: response
                deactivate ob
            end
        deactivate iovation
        accounts --> gql: response
    deactivate accounts
    gql --> client
deactivate gql
@enduml