<?xml version="1.0" encoding="utf-8"?>
<!-- Generator: Adobe Illustrator 17.0.0, SVG Export Plug-In . SVG Version: 6.00 Build 0)  -->
<!DOCTYPE svg PUBLIC "-//W3C//DTD SVG 1.1//EN" "http://www.w3.org/Graphics/SVG/1.1/DTD/svg11.dtd">
<svg version="1.1" id="Layer_1" xmlns="http://www.w3.org/2000/svg" xmlns:xlink="http://www.w3.org/1999/xlink" x="0px" y="0px"
	 width="100px" height="100px" viewBox="0 0 100 100" enable-background="new 0 0 100 100" xml:space="preserve">
<g>
	<path opacity="0.26" fill="#FFFFFF" enable-background="new    " d="M50,0l50,50l-50,50L0,50L50,0z"/>
	<path d="M69.678,38.305v31.933c0,3.081-2.521,5.602-5.602,5.602h-25.28c-3.081,0-5.602-2.521-5.602-5.602V29.692
		c0-3.081,2.521-5.602,5.602-5.602h16.667"/>
	<path d="M67.647,36.275v34.734c0,1.541-1.261,2.801-2.801,2.801H38.025c-1.541,0-2.801-1.261-2.801-2.801V28.922
		c0-1.541,1.261-2.801,2.801-2.801h19.328"/>
	<path d="M55.462,37.255c0.56,0,0.98,0.49,0.98,1.05c0,0.56-0.42,1.05-0.98,1.05s-0.98-0.49-0.98-1.05
		C54.482,37.675,54.902,37.255,55.462,37.255z"/>
	<path d="M55.462,24.09c0.56,0,0.98,0.49,0.98,1.05c0,0.56-0.42,1.05-0.98,1.05s-0.98-0.49-0.98-1.05
		C54.482,24.51,54.902,24.09,55.462,24.09z"/>
	<path d="M68.627,37.255c0.56,0,1.05,0.49,1.05,1.05c0,0.56-0.49,1.05-1.05,1.05s-1.05-0.49-1.05-1.05
		C67.647,37.675,68.067,37.255,68.627,37.255z"/>
	<path d="M54.482,25.07h2.031v13.165h-2.031V25.07z"/>
	<path d="M55.462,39.286v-2.031h13.165v2.031H55.462z"/>
	<path d="M54.762,25.77l1.401-1.471l13.165,13.235l-1.401,1.401L54.762,25.77z"/>
	<path d="M53.922,77.801c0,0.07,0,0.14,0,0.21c-0.07,0.28-0.35,0.42-0.63,0.35c-0.07,0-0.14-0.07-0.14-0.07l0,0l-2.171-1.681l0,0
		c-0.07-0.07-0.07-0.07-0.14-0.14l0,0L38.936,55.672l-0.21,0.14c-0.14,0.07-0.28,0.07-0.35,0.07c-0.14-0.07-0.21-0.14-0.28-0.21l0,0
		l-9.384-16.317l0,0c-0.07-0.14-0.07-0.28-0.07-0.42c0.07-0.14,0.14-0.21,0.21-0.28l0,0l3.081-1.821c0.14-0.07,0.28-0.07,0.35-0.07
		c0.14,0.07,0.21,0.14,0.28,0.21l0,0l1.19,2.031l0.77-0.49c0.14-0.07,0.28-0.07,0.35-0.07c0.14,0.07,0.28,0.14,0.28,0.28l0,0
		l4.902,9.244l0,0c0.07,0.14,0.07,0.21,0.07,0.35c-0.07,0.28-0.35,0.42-0.63,0.35c-0.14-0.07-0.28-0.14-0.28-0.28l0,0l-4.622-8.754
		l-0.35,0.21l7.633,13.305l0,0c0.07,0.14,0.07,0.28,0.07,0.42c-0.07,0.14-0.14,0.21-0.21,0.28l0,0l-0.21,0.14L53.431,74.79l0,0
		c0,0.07,0.07,0.14,0.07,0.21l0,0L53.922,77.801L53.922,77.801L53.922,77.801L53.922,77.801z"/>
	<path fill="#FFFFFF" d="M66.387,73.669c-0.21,0.07-0.49,0.14-0.77,0.14H52.941L41.667,54.062l0.21-0.14l0,0
		c0.14-0.07,0.21-0.14,0.21-0.28c0.07-0.14,0-0.28-0.07-0.42l-6.793-11.835v-0.77l4.132,7.843l0,0c0.07,0.14,0.14,0.21,0.28,0.28
		c0.28,0.07,0.56-0.07,0.63-0.35c0-0.14,0-0.28-0.07-0.35l0,0l-4.902-9.244l0,0c0-0.07-0.07-0.14-0.14-0.14V28.151
		c0-1.12,0.91-2.031,2.031-2.031h17.227v12.185c0,0.56,0.42,0.98,0.98,0.98h12.115v32.493
		C67.647,72.619,67.157,73.319,66.387,73.669z M56.513,27.521l9.734,9.734h-9.734V27.521z M38.025,55.602
		c0.07,0.14,0.14,0.21,0.28,0.21c0.14,0.07,0.28,0,0.35-0.07l0.21-0.14L49.23,73.74H37.255c-1.12,0-2.031-0.91-2.031-2.031V50.7
		L38.025,55.602z"/>
	<path fill="#DD2826" d="M63.025,57.703l0.63-0.35l-0.63-0.35l0.56-0.49l-0.7-0.21l0.42-0.56l-0.7-0.07l0.28-0.63l-0.7,0.07
		l0.21-0.7l-0.7,0.21l0.07-0.7l-0.63,0.28l-0.07-0.7l-0.56,0.42l-0.21-0.7l-0.49,0.56l-0.35-0.63l-0.35,0.63l-0.49-0.56l-0.21,0.7
		l-0.56-0.42l-0.07,0.7l-0.63-0.28l0.07,0.7l-0.7-0.21l0.21,0.7l-0.7-0.07l0.28,0.63l-0.7,0.07l0.42,0.56l-0.7,0.21l0.56,0.49
		l-0.63,0.35l0.63,0.35l-0.56,0.49l0.7,0.21l-0.42,0.56l0.7,0.07l-0.28,0.63l0.7-0.07l-0.21,0.7l0.7-0.21l-0.07,0.7l0.28-0.14
		l-1.471,6.513l1.821,1.961l1.751-7.633l0,0v-0.07l1.751,7.773l1.821-1.891l-1.541-6.653l0.28,0.14l-0.07-0.7l0.7,0.21l-0.21-0.7
		l0.7,0.07l-0.28-0.63l0.7-0.07l-0.42-0.56l0.7-0.21L63.025,57.703z"/>
	<path fill="#99B3DD" d="M39.286,32.213h9.104v0.98h-9.104V32.213z"/>
	<path fill="#99B3DD" d="M39.286,36.275v-0.98H50.42v0.98H39.286z"/>
</g>
</svg>
