{
  "pre-install-commands": [
    "echo \"deb https://deb.etcher.io stable etcher\" | sudo tee /etc/apt/sources.list.d/balena-etcher.list",
    "sudo apt-key adv --keyserver keyserver.ubuntu.com --recv-keys 379CE192D401AB61",
    "sudo apt-get update --yes",
    "echo oracle-java12-installer shared/accepted-oracle-license-v1-2 boolean true | sudo debconf-set-selections"
  ],
  "apt-repositories": [
    "ppa:obsproject/obs-studio",
    "ppa:daniruiz/flat-remix",
    "ppa:linuxuprising/java"
  ],
  "apt-packages": [
    "oracle-java12-installer",
    "inkscape",
    "gimp",
    "vlc",
    "gnome-tweak-tool",
    "flat-remix",
    "arc-theme",
    "balena-etcher-electron",
    "blueman",
    "obs-studio"
  ],
  "deb-packages": [
    {
      "name": "google-chrome-stable",
      "url": "https://dl.google.com/linux/direct/google-chrome-stable_current_amd64.deb"
    },
    {
      "name": "skypeforlinux",
      "url": "https://go.skype.com/skypeforlinux-64.deb"
    },
    {
      "name": "discord",
      "url": "https://discordapp.com/api/download?platform=linux&format=deb"
    },
    {
      "name": "teamviewer",
      "url": "https://download.teamviewer.com/download/linux/teamviewer_amd64.deb"
    },
    {
      "name": "virtualbox-6.0",
      "url": "https://download.oracle.com/virtualbox/6.0.10/virtualbox-6.0_6.0.10-132072~Ubuntu~bionic_amd64.deb"
    }
  ],
  "post-install-commands": [
    "sudo snap install telegram-desktop",
    "sudo snap install opera",
    "gsettings set org.gnome.desktop.interface gtk-theme 'Arc-Dark'",
    "gsettings set org.gnome.desktop.interface icon-theme 'Flat-Remix-Blue-Dark'",
    "gsettings set org.gnome.desktop.interface cursor-theme 'DMZ-Black'",
    "gsettings set org.gnome.desktop.interface cursor-size 18",
    "gsettings set org.gnome.desktop.wm.preferences theme 'Arc-Dark'",
    "gsettings set org.gnome.shell.extensions.dash-to-dock dash-max-icon-size 44",
    "sudo update-locale LC_TIME=en_US.UTF-8",
    "gsettings set org.gnome.desktop.interface clock-show-seconds true",
    "gsettings set org.gnome.desktop.interface clock-show-date  true",
    "gsettings set org.gnome.desktop.interface clock-show-weekday true",
    "gsettings set org.gnome.desktop.interface clock-format 12h",
    "gsettings set org.gnome.desktop.interface show-battery-percentage true",
    "rm -f ${HOME}/Pictures/background.png",
    "wget 'https://images.alphacoders.com/596/596630.jpg' -O ${HOME}/Pictures/background.jpg",
    "gsettings set org.gnome.desktop.background picture-uri \"file:///${HOME}/Pictures/background.jpg\"",
    "gsettings set org.gnome.desktop.screensaver picture-uri \"file:///${HOME}/Pictures/background.jpg\"",
    "gsettings set org.gnome.desktop.privacy report-technical-problems true",
    "gsettings set org.gnome.shell favorite-apps \"['org.gnome.Nautilus.desktop', 'gnome-control-center.desktop', 'google-chrome.desktop', 'telegram-desktop_telegramdesktop.desktop', 'discord.desktop', 'skypeforlinux.desktop']\"",
    "gsettings set org.gnome.desktop.wm.preferences button-layout 'close,minimize:'",
    "gsettings set org.gnome.mutter workspaces-only-on-primary false"
  ]
}
