{
  "apt-packages": [
    "git",
    "python3-pip",
    "vim",
    "tree",
    "openssh-server",
    "curl",
    "default-jre",
    "gdebi"
  ],
  "post-install-commands": [
    "git config --global alias.lg \"log --oneline --decorate --graph --all\"",
    "gsettings set org.gnome.desktop.input-sources sources \"[('xkb', 'us'), ('xkb', 'ua'), ('xkb', 'ru')]\""
  ]
}