[
  {
    "fields": {
      "name": "Категория",
      "sort_order": "1",
      "slug": "category",
      "title": "категория:",
      "h1": "",
      "description": "категория",
      "keyword": "категория",
      "robots": "index, follow",
      "categories": [
        1
      ]
    },
    "model": "attribute.attributegroup",
    "pk": 1
  },
  {
    "fields": {
      "name": "Размер",
      "sort_order": "2",
      "slug": "size",
      "title": "размер:",
      "h1": "размером",
      "description": "размер",
      "keyword": "размер",
      "robots": "index, follow",
      "categories": [
        1
      ]
    },
    "model": "attribute.attributegroup",
    "pk": 2
  },
  {
    "fields": {
      "name": "Высота",
      "sort_order": "3",
      "slug": "height",
      "title": "высота:",
      "h1": "высотой",
      "description": "высота",
      "keyword": "высота",
      "robots": "index, follow",
      "categories": [
        1
      ]
    },
    "model": "attribute.attributegroup",
    "pk": 3
  },
  {
    "fields": {
      "name": "Недорогие",
      "sort_order": "1",
      "slug": "nedorogie",
      "title": "недорогие",
      "h1": "недорогие",
      "description": "недорогие",
      "keyword": "недорогие",
      "attribute_group": "1"
    },
    "model": "attribute.attribute",
    "pk": 1
  },
  {
    "fields": {
      "name": "Премиум",
      "sort_order": "2",
      "slug": "premium",
      "title": "премиум",
      "h1": "премиум класса",
      "description": "премиум",
      "keyword": "премиум",
      "attribute_group": "1"
    },
    "model": "attribute.attribute",
    "pk": 2
  },
  {
    "fields": {
      "name": "Со скидкой",
      "sort_order": "3",
      "slug": "so-skidkoy",
      "title": "со скидкой",
      "h1": "со скидкой",
      "description": "со скидкой",
      "keyword": "со скидкой",
      "attribute_group": "1"
    },
    "model": "attribute.attribute",
    "pk": 3
  },
  {
    "fields": {
      "name": "90x190",
      "sort_order": "1",
      "slug": "90x190",
      "title": "90x190",
      "h1": "90x190",
      "description": "90 на 190",
      "keyword": "90x190",
      "attribute_group": "2"
    },
    "model": "attribute.attribute",
    "pk": 4
  },
  {
    "fields": {
      "name": "90x200",
      "sort_order": "2",
      "slug": "90x200",
      "title": "90x200",
      "h1": "90x200",
      "description": "90 на 200",
      "keyword": "90x200",
      "attribute_group": "2"
    },
    "model": "attribute.attribute",
    "pk": 5
  },
  {
    "fields": {
      "name": "100x190",
      "sort_order": "3",
      "slug": "100x190",
      "title": "100x190",
      "h1": "100x190",
      "description": "100 на 190",
      "keyword": "100x190",
      "attribute_group": "2"
    },
    "model": "attribute.attribute",
    "pk": 6
  },
  {
    "fields": {
      "name": "10 см",
      "sort_order": "1",
      "slug": "10cm",
      "title": "10 см",
      "h1": "10 см",
      "description": "10 см",
      "keyword": "10 см",
      "attribute_group": "3"
    },
    "model": "attribute.attribute",
    "pk": 7
  },
  {
    "fields": {
      "name": "11 см",
      "sort_order": "2",
      "slug": "11cm",
      "title": "11 см",
      "h1": "11 см",
      "description": "11 см",
      "keyword": "11 см",
      "attribute_group": "3"
    },
    "model": "attribute.attribute",
    "pk": 8
  },
  {
    "fields": {
      "name": "12 см",
      "sort_order": "3",
      "slug": "12cm",
      "title": "12 см",
      "h1": "12 см",
      "description": "12 см",
      "keyword": "12 см",
      "attribute_group": "3"
    },
    "model": "attribute.attribute",
    "pk": 9
  },
  {
    "fields": {
      "text": "<div class=\"container content\">\n    <section class=\"section columns ok-content\">\n        <article class=\"column\">\n            <a href=\"/matrasy/c4/category=so-skidkoy\" title=\"Скидки до 30% на ортопедические матрасы\">\n                <img src=\"/images/banner_discount.jpg\" alt=\"Скидки до 30% на ортопедические матрасы\">\n            </a>\n        </article>\n        <article class=\"column\">\n            <a href=\"/cashback-for-review\" title=\"Получите кешбэк 100 грн. за отзыв с фото\">\n                <img src=\"/images/banner_cashback.jpg\" alt=\"Получите кешбэк 100 грн. за отзыв с фото\">\n            </a>\n        </article>\n        <article class=\"column\">\n            <a href=\"/dostavka-i-oplata\" title=\"Бесплатная доставка топперов на диван транспортной компанией Meest Express\">\n                <img src=\"/images/banner_delivery.jpg\" alt=\"Бесплатная доставка топперов на диван транспортной компанией Meest Express\">\n            </a>\n        </article>\n    </section>\n    <section class=\"section\">\n        <header class=\"subtitle is-size-5\">Тонкие матрасы на диван</header>\n        <div class=\"columns is-multiline is-mobile\">\n            <article class=\"column is-half-mobile is-one-quarter-tablet box has-background-white-ter\">\n                <p class=\"ok-content-p\">Недорогие</p>\n                <a href=\"/toppery/c2/category=nedorogie\" title=\"Недорогие тонкие матрасы\">\n                    <figure class=\"image ok-content-figure\">\n                        <img src=\"/images/cache/Products/Product40/5e05ce5fca-1_350x350.jpg\" alt=\"Недорогие тонкие матрасы\">\n                    </figure>\n                </a>\n            </article>\n            <article class=\"column is-half-mobile is-one-quarter-tablet box has-background-white-ter\">\n                <p class=\"ok-content-p\">Премиум</p>\n                <a href=\"/toppery/c2/category=premium\" title=\"Премиум тонкие матрасы\">\n                    <figure class=\"image ok-content-figure\">\n                        <img src=\"/images/cache/Products/Product52/914e4dfba1-1_350x350.jpg\" alt=\"Премиум тонкие матрасы\">\n                    </figure>\n                </a>\n            </article>\n            <article class=\"column is-half-mobile is-one-quarter-tablet box has-background-white-ter\">\n                <p class=\"ok-content-p\">Из ортопедической пены</p>\n                <a href=\"/toppery/c2/fill=ergoflex\" title=\"Тонкие матрасы из ортопедической пены Ergoflex\">\n                    <figure class=\"image ok-content-figure\">\n                        <img src=\"/images/cache/Products/Product47/69198fa7a7-1_350x350.jpg\" alt=\"Тонкие матрасы из ортопедической пены Ergoflex\">\n                    </figure>\n                </a>\n            </article>\n            <article class=\"column is-half-mobile is-one-quarter-tablet box has-background-white-ter\">\n                <p class=\"ok-content-p\">Из мемори</p>\n                <a href=\"/toppery/c2/fill=memory-foam\" title=\"Тонкие матрасы из memory-foam\">\n                    <figure class=\"image ok-content-figure\">\n                        <img src=\"/images/cache/Products/Product46/50435b4d1c-1_350x350.jpg\" alt=\"Тонкие матрасы из мемори\">\n                    </figure>\n                </a>\n            </article>\n            <article class=\"column is-half-mobile is-one-quarter-tablet box has-background-white-ter\">\n                <p class=\"ok-content-p\">Из кокоса</p>\n                <a href=\"/toppery/c2/fill=kokosovaya-koyra\" title=\"Тонкие матрасы из кокосовой койры\">\n                    <figure class=\"image ok-content-figure\">\n                        <img src=\"/images/cache/Products/Product48/73fc58695a-1_350x350.jpg\" alt=\"Тонкие матрасы из кокосовой койры\">\n                    </figure>\n                </a>\n            </article>\n            <article class=\"column is-half-mobile is-one-quarter-tablet box has-background-white-ter\">\n                <p class=\"ok-content-p\">Мягкие</p>\n                <a href=\"/toppery/c2/zhestkost=myagkiy\" title=\"Мягкие тонкие матрасы\">\n                    <figure class=\"image ok-content-figure\">\n                        <img src=\"/images/cache/Products/Product53/69a62360ca-1_350x350.jpg\" alt=\"Мягкие тонкие матрасы\">\n                    </figure>\n                </a>\n            </article>\n            <article class=\"column is-half-mobile is-one-quarter-tablet box has-background-white-ter\">\n                <p class=\"ok-content-p\">Средней жесткости</p>\n                <a href=\"/toppery/c2/zhestkost=sredniy\" title=\"Тонкие матрасы средней жесткости\">\n                    <figure class=\"image ok-content-figure\">\n                        <img src=\"/images/cache/Products/Product50/0fc722bdbc-1_350x350.jpg\" alt=\"Тонкие матрасы средней жесткости\">\n                    </figure>\n                </a>\n            </article>\n            <article class=\"column is-half-mobile is-one-quarter-tablet box has-background-white-ter\">\n                <p class=\"ok-content-p\">Жесткие</p>\n                <a href=\"/toppery/c2/zhestkost=zhestkiy\" title=\"Жесткие тонкие матрасы\">\n                    <figure class=\"image ok-content-figure\">\n                        <img src=\"/images/cache/Products/Product41/870bcc6c04-1_350x350.jpg\" alt=\"Жесткие тонкие матрасы\">\n                    </figure>\n                </a>\n            </article>\n            <div class=\"is-clearfix\"></div>\n        </div>\n    </section>\n    <section class=\"section\">\n        <header class=\"subtitle is-size-5\">Ортопедические матрасы</header>\n        <div class=\"columns is-multiline is-mobile\">\n            <article class=\"column is-half-mobile is-one-quarter-tablet box has-background-white-ter\">\n                <p class=\"ok-content-p\">Со скидкой</p>\n                <a href=\"/matrasy/c4/category=so-skidkoy\" title=\"Ортопедические матрасы со скидкой\">\n                    <figure class=\"image ok-content-figure\">\n                        <img src=\"/images/cache/Products/Product59/8a943c002d-1_350x350.jpg\" alt=\"Ортопедические матрасы со скидкой\">\n                    </figure>\n                </a>\n            </article>\n            <article class=\"column is-half-mobile is-one-quarter-tablet box has-background-white-ter\">\n                <p class=\"ok-content-p\">Недорогие</p>\n                <a href=\"/matrasy/c4/category=nedorogie\" title=\"Недорогие ортопедические матрасы\">\n                    <figure class=\"image ok-content-figure\">\n                        <img src=\"/images/cache/Products/Product54/dcff357869-1_350x350.jpg\" alt=\"Недорогие ортопедические матрасы\">\n                    </figure>\n                </a>\n            </article>\n            <article class=\"column is-half-mobile is-one-quarter-tablet box has-background-white-ter\">\n                <p class=\"ok-content-p\">Беспружинные</p>\n                <a href=\"/matrasy/c4/type=bespruzhinnyy\" title=\"Беспружинные ортопедические матрасы\">\n                    <figure class=\"image ok-content-figure\">\n                        <img src=\"/images/cache/Products/Product69/8b4dee5af5-1_350x350.jpg\" alt=\"Беспружинные ортопедические матрасы\">\n                    </figure>\n                </a>\n            </article>\n            <article class=\"column is-half-mobile is-one-quarter-tablet box has-background-white-ter\">\n                <p class=\"ok-content-p\">Пружинные</p>\n                <a href=\"/matrasy/c4/type=pruzhinnyy\" title=\"Пружинные ортопедические матрасы\">\n                    <figure class=\"image ok-content-figure\">\n                        <img src=\"/images/cache/Products/Product86/2423a6efbc-1_350x350.jpg\" alt=\"Пружинные ортопедические матрасы\">\n                    </figure>\n                </a>\n            </article>\n            <article class=\"column is-half-mobile is-one-quarter-tablet box has-background-white-ter\">\n                <p class=\"ok-content-p\">Из мемори</p>\n                <a href=\"/matrasy/c4/fill=memory-foam\" title=\"Ортопедические матрасы из memory-foam\">\n                    <figure class=\"image ok-content-figure\">\n                        <img src=\"/images/cache/Products/Product74/3d7cc3f6f7-1_350x350.jpg\" alt=\"Ортопедические матрасы из мемори\">\n                    </figure>\n                </a>\n            </article>\n            <article class=\"column is-half-mobile is-one-quarter-tablet box has-background-white-ter\">\n                <p class=\"ok-content-p\">Из ортопедической пены</p>\n                <a href=\"/matrasy/c4/fill=ergoflex\" title=\"Ортопедические матрасы из пены Ergoflex\">\n                    <figure class=\"image ok-content-figure\">\n                        <img src=\"/images/cache/Products/Product75/61e538dc25-1_350x350.jpg\" alt=\"Ортопедические матрасы из пены Ergoflex\">\n                    </figure>\n                </a>\n            </article>\n            <article class=\"column is-half-mobile is-one-quarter-tablet box has-background-white-ter\">\n                <p class=\"ok-content-p\">Из кокоса</p>\n                <a href=\"/matrasy/c4/fill=kokosovaya-koyra\" title=\"Ортопедические матрасы из кокосовой койры\">\n                    <figure class=\"image ok-content-figure\">\n                        <img src=\"/images/cache/Products/Product67/671c66ac59-1_350x350.jpg\" alt=\"Ортопедические матрасы из кокосовой койры\">\n                    </figure>\n                </a>\n            </article>\n            <article class=\"column is-half-mobile is-one-quarter-tablet box has-background-white-ter\">\n                <p class=\"ok-content-p\">Из латекса</p>\n                <a href=\"/matrasy/c4/fill=latex\" title=\"Ортопедические матрасы из латекса\">\n                    <figure class=\"image ok-content-figure\">\n                        <img src=\"/images/cache/Products/Product81/0b7171fcfd-1_350x350.jpg\" alt=\"Ортопедические матрасы из латекса\">\n                    </figure>\n                </a>\n            </article>\n            <article class=\"column is-half-mobile is-one-quarter-tablet box has-background-white-ter\">\n                <p class=\"ok-content-p\">Мягкие</p>\n                <a href=\"/matrasy/c4/zhestkost=myagkiy\" title=\"Мягкие ортопедические матрасы\">\n                    <figure class=\"image ok-content-figure\">\n                        <img src=\"/images/cache/Products/Product54/dcff357869-1_350x350.jpg\" alt=\"Мягкие ортопедические матрасы\">\n                    </figure>\n                </a>\n            </article>\n            <article class=\"column is-half-mobile is-one-quarter-tablet box has-background-white-ter\">\n                <p class=\"ok-content-p\">Жесткие</p>\n                <a href=\"/matrasy/c4/zhestkost=zhestkiy\" title=\"Жесткие ортопедические матрасы\">\n                    <figure class=\"image ok-content-figure\">\n                        <img src=\"/images/cache/Products/Product76/ed0da14f7b-1_350x350.jpg\" alt=\"Жесткие ортопедические матрасы\">\n                    </figure>\n                </a>\n            </article>\n            <article class=\"column is-half-mobile is-one-quarter-tablet box has-background-white-ter\">\n                <p class=\"ok-content-p\">Для гостиниц</p>\n                <a href=\"/matrasy/c4/category=dlya-gostinic\" title=\"Ортопедические матрасы для гостиниц\">\n                    <figure class=\"image ok-content-figure\">\n                        <img src=\"/images/cache/Products/Product139/3b1fd2b318-1_350x350.jpg\" alt=\"Ортопедические матрасы для гостиниц\">\n                    </figure>\n                </a>\n            </article>\n            <article class=\"column is-half-mobile is-one-quarter-tablet box has-background-white-ter\">\n                <p class=\"ok-content-p\">Детские</p>\n                <a href=\"/matrasy/c4/category=detskie\" title=\"Детские ортопедические матрасы\">\n                    <figure class=\"image ok-content-figure\">\n                        <img src=\"/images/cache/Products/Product144/d88afceab1-1_350x350.jpg\" alt=\"Детские ортопедические матрасы\">\n                    </figure>\n                </a>\n            </article>\n            <div class=\"is-clearfix\"></div>\n        </div>\n    </section>\n\n    <section class=\"is-hidden-mobile\">\n        <div class=\"tile is-ancestor\">\n            <div class=\"tile is-parent\">\n                <article class=\"tile is-child\">\n                    <figure class=\"image\">\n                        <img src=\"/images/DSCF6917.jpg\" alt=\"Боковина тонкого матраса\">\n                    </figure>\n                </article>\n                <article class=\"tile is-child\">\n                    <figure class=\"image\">\n                        <img src=\"/images/DSCF6867.jpg\" alt=\"Чехол тонкого матраса\">\n                    </figure>\n                </article>\n                <article class=\"tile is-child\">\n                    <figure class=\"image\">\n                        <img src=\"/images/DSCF6948.jpg\" alt=\"Аэро-чехол тонкого матраса\">\n                    </figure>\n                </article>\n            </div>\n        </div>\n        <div class=\"tile is-ancestor\">\n            <div class=\"tile is-parent\">\n                <article class=\"tile is-child\">\n                    <figure class=\"image\">\n                        <img src=\"/images/DSCF6951.jpg\" alt=\"Тонкий матрас в рулоне\">\n                    </figure>\n                </article>\n                <article class=\"tile is-child\">\n                    <figure class=\"image\">\n                        <img src=\"/images/DSCF7032.jpg\" alt=\"Тонкий матрас - общий вид\">\n                    </figure>\n                </article>\n            </div>\n        </div>\n        <div class=\"tile is-ancestor\">\n            <div class=\"tile is-parent\">\n                <article class=\"tile is-child is-3\">\n                    <figure class=\"image\">\n                        <img src=\"/images/DSCF6976.jpg\" alt=\"Тонкий матрас в шкаф-купе\">\n                    </figure>\n                </article>\n                <article class=\"tile is-child\">\n                    <figure class=\"image\">\n                        <img src=\"/images/DSCF7044.jpg\" alt=\"Тонкий матрас на резинках\">\n                    </figure>\n                </article>\n                <article class=\"tile is-child\">\n                    <figure class=\"image\">\n                        <img src=\"/images/DSCF7071.jpg\" alt=\"Тонкий матрас в багажнике авто\">\n                    </figure>\n                </article>\n            </div>\n        </div>\n    </section>\n\n    <section class=\"section product-img-box is-hidden-tablet\">\n        <div class=\"MagicToolboxContainer selectorsBottom minWidth\">\n            <div class=\"magic-slide mt-active\" data-magic-slide=\"zoom\">\n                <a id=\"MagicZoomPlusImage38950\" class=\"MagicZoom\" href=\"/images/DSCF7032.jpg\" data-options=\"zoomWidth:600;zoomHeight:600;selectorTrigger:hover;lazyZoom:true;rightClick:true;zoomMode:preview;expandCaption:false;cssClass:white-bg;hint:off;\" data-mobile-options=\"zoomWidth:auto;zoomHeight:auto;lazyZoom:false;zoomMode:zoom;cssClass:;hint:off;textHoverZoomHint:Touch to zoom;textClickZoomHint:Дважды нажмите, чтобы увеличить;textExpandHint:Tap to expand;\">\n                    <figure class=\"mz-figure white-bg mz-hover-zoom\"><img itemprop=\"image\" src=\"/images/DSCF7032.jpg\" alt=\"Тонкий матрас - общий вид\" style=\"max-width: 656px; max-height: 492px;\"><div class=\"mz-lens\" style=\"top: 0px; transform: translate(-10000px, -10000px);\"><img src=\"data:image/gif;base64,R0lGODlhAQABAAD/ACwAAAAAAQABAAACADs=\" style=\"position: absolute; top: 0px; left: 0px; width: 0px; height: 0px;\"></div></figure>\n                </a>\n            </div>\n            <div class=\"magic-slide\" data-magic-slide=\"360\"></div>\n            <div class=\"MagicToolboxSelectorsContainer\">\n                <div id=\"MagicToolboxSelectors38950\" class=\"\">\n                    <a data-magic-slide-id=\"zoom\" data-zoom-id=\"MagicZoomPlusImage38950\" href=\"/images/DSCF7032.jpg\" data-image=\"/images/DSCF7032.jpg\" title=\"Тонкий матрас - общий вид\" class=\"mz-thumb-selected white-bg mz-thumb\"><img src=\"/images/DSCF7032_65.jpg\" alt=\"Тонкий матрас - общий вид\"></a>\n                    <a data-magic-slide-id=\"zoom\" data-zoom-id=\"MagicZoomPlusImage38950\" href=\"/images/DSCF6951.jpg\" data-image=\"/images/DSCF6951.jpg\" title=\"Тонкий матрас в рулоне\" class=\"white-bg mz-thumb\"><img src=\"/images/DSCF6951_65.jpg\" alt=\"Тонкий матрас в рулоне\"></a>\n                    <a data-magic-slide-id=\"zoom\" data-zoom-id=\"MagicZoomPlusImage38950\" href=\"/images/DSCF6867.jpg\" data-image=\"/images/DSCF6867.jpg\" title=\"Чехол тонкого матраса\" class=\"white-bg mz-thumb\"><img src=\"/images/DSCF6867_65.jpg\" alt=\"Чехол тонкого матраса\"></a>\n                    <a data-magic-slide-id=\"zoom\" data-zoom-id=\"MagicZoomPlusImage38950\" href=\"/images/DSCF7044.jpg\" data-image=\"/images/DSCF7044.jpg\" title=\"Тонкий матрас на резинках\" class=\"white-bg mz-thumb\"><img src=\"/images/DSCF7044_65.jpg\" alt=\"Тонкий матрас на резинках\"></a>\n                    <a data-magic-slide-id=\"zoom\" data-zoom-id=\"MagicZoomPlusImage38950\" href=\"/images/DSCF6948.jpg\" data-image=\"/images/DSCF6948.jpg\" title=\"Аэро-чехол тонкого матраса\" class=\"white-bg mz-thumb\"><img src=\"/images/DSCF6948_65.jpg\" alt=\"Аэро-чехол тонкого матраса\"></a>\n                    <a data-magic-slide-id=\"zoom\" data-zoom-id=\"MagicZoomPlusImage38950\" href=\"/images/DSCF6917.jpg\" data-image=\"/images/DSCF6917.jpg\" title=\"Боковина тонкого матраса\" class=\"white-bg mz-thumb\"><img src=\"/images/DSCF6917_65.jpg\" alt=\"Боковина тонкого матраса\"></a>\n                    <a data-magic-slide-id=\"zoom\" data-zoom-id=\"MagicZoomPlusImage38950\" href=\"/images/DSCF7071.jpg\" data-image=\"/images/DSCF7071.jpg\" title=\"Тонкий матрас в багажнике авто\" class=\"white-bg mz-thumb\"><img src=\"/images/DSCF7071_65.jpg\" alt=\"Тонкий матрас в багажнике авто\"></a>\n                </div>\n            </div>\n        </div>\n    </section>\n\n    <section class=\"section\">\n        <header><h1 class=\"is-size-5\">Интернет-магазин матрасов на диван, ортопедических матрасов и\n                спальных аксессуаров</h1></header>\n        <h2 class=\"is-size-6\">Тонкий матрас для дивана - доступный спальный аксессуар для каждого дома</h2>\n        <p>Наше здоровье во многом зависит от качества сна. Ведь сон является незаменимой составляющей жизни и\n            занимает 30%\n            ее\n            времени. Улучшить условия сна поможет ортопедический матрас на диван.\n        </p>\n        <h3 class=\"subtitle is-size-6\">Для чего нужен выравнивающий матрас на диван?</h3>\n        <p>\n        </p><ul>По отзывам покупателей плюсы от его покупки очевидны:\n            <li>- выравнивает поверхность старого дивана или матраса, если ваше спальное место пришло в негодность,\n                стало\n                неровным\n                или поломались некоторые пружины\n            </li>\n            <li>- обеспечивает дополнительными спальными местами, когда к вам пришли друзья и их негде разместить.\n                Достаньте\n                тонкий матрас и стелите туда ваших знакомых\n            </li>\n            <li>- делает поверхность для сна мягкой и комфортной - нежный наполнитель и приятная ткань чехла\n                обволакивают\n                вас и\n                способствуют крепкому сну\n            </li>\n            <li>- делает поверхность жестче при условии жесткого наполнителя - кокосовой койры</li>\n            <li>- заменяет коврик или каремат на пикнике. Это идеальное решение, если вы собрались с палаткой за\n                город.\n                Возьмите\n                тонкий матрас с ортопедическим эффектом, расстелите его в палатке - вы не почувствуете разницу между\n                сном в походных условиях\n                и дома\n            </li>\n            <li>- его используют как теплую и мягкую основу для пола в детскую комнату - ваш ребенок не простудится\n                и не\n                ударится на\n                полу во время своих игр\n            </li>\n            <li>- не спешите покупать новый дорогой матрас - купить тонкий матрас на диван можно в нашем интернет\n                магазине,\n                цена\n                которого\n                доступна для большинства потребителей. Это сэкономит средства на что-то другое\n            </li>\n            <li>- это прекрасный и нужный презент для ваших родных и близких, который никого не оставит равнодушным\n                и всегда\n                пригодится\n            </li>\n        </ul>\n        <p></p>\n        <h3 class=\"subtitle is-size-6\">Преимущества от покупки в нашем интернет-магазине</h3>\n        <p>\n        </p><ul>\n            <li>\n            <span class=\"icon is-large has-text-primary\"><i class=\"\" data-fa-i2svg=\"\"><svg class=\"svg-inline--fa fa-shipping-fast fa-w-20 fa-lg\" aria-hidden=\"true\" focusable=\"false\" data-prefix=\"fas\" data-icon=\"shipping-fast\" role=\"img\" xmlns=\"http://www.w3.org/2000/svg\" viewBox=\"0 0 640 512\" data-fa-i2svg=\"\"><path fill=\"currentColor\" d=\"M624 352h-16V243.9c0-12.7-5.1-24.9-14.1-33.9L494 110.1c-9-9-21.2-14.1-33.9-14.1H416V48c0-26.5-21.5-48-48-48H112C85.5 0 64 21.5 64 48v48H8c-4.4 0-8 3.6-8 8v16c0 4.4 3.6 8 8 8h272c4.4 0 8 3.6 8 8v16c0 4.4-3.6 8-8 8H40c-4.4 0-8 3.6-8 8v16c0 4.4 3.6 8 8 8h208c4.4 0 8 3.6 8 8v16c0 4.4-3.6 8-8 8H8c-4.4 0-8 3.6-8 8v16c0 4.4 3.6 8 8 8h208c4.4 0 8 3.6 8 8v16c0 4.4-3.6 8-8 8H64v128c0 53 43 96 96 96s96-43 96-96h128c0 53 43 96 96 96s96-43 96-96h48c8.8 0 16-7.2 16-16v-32c0-8.8-7.2-16-16-16zM160 464c-26.5 0-48-21.5-48-48s21.5-48 48-48 48 21.5 48 48-21.5 48-48 48zm320 0c-26.5 0-48-21.5-48-48s21.5-48 48-48 48 21.5 48 48-21.5 48-48 48zm80-208H416V144h44.1l99.9 99.9V256z\"></path></svg></i></span>\n                <a href=\"/dostavka-i-oplata\">\n                        <span class=\"ok-underline-dotted\">\n                            бесплатная доставка по всей Украине</span></a> - мы обеспечиваем бесплатную доставку\n                топперов на диван по всей территории Украины\n            </li>\n            <li><span class=\"icon is-large has-text-primary\"><i class=\"\" data-fa-i2svg=\"\"><svg class=\"svg-inline--fa fa-gift fa-w-16 fa-lg\" aria-hidden=\"true\" focusable=\"false\" data-prefix=\"fas\" data-icon=\"gift\" role=\"img\" xmlns=\"http://www.w3.org/2000/svg\" viewBox=\"0 0 512 512\" data-fa-i2svg=\"\"><path fill=\"currentColor\" d=\"M32 448c0 17.7 14.3 32 32 32h160V320H32v128zm256 32h160c17.7 0 32-14.3 32-32V320H288v160zm192-320h-42.1c6.2-12.1 10.1-25.5 10.1-40 0-48.5-39.5-88-88-88-41.6 0-68.5 21.3-103 68.3-34.5-47-61.4-68.3-103-68.3-48.5 0-88 39.5-88 88 0 14.5 3.8 27.9 10.1 40H32c-17.7 0-32 14.3-32 32v80c0 8.8 7.2 16 16 16h480c8.8 0 16-7.2 16-16v-80c0-17.7-14.3-32-32-32zm-326.1 0c-22.1 0-40-17.9-40-40s17.9-40 40-40c19.9 0 34.6 3.3 86.1 80h-86.1zm206.1 0h-86.1c51.4-76.5 65.7-80 86.1-80 22.1 0 40 17.9 40 40s-17.9 40-40 40z\"></path></svg></i></span>\n                сумка и ремни в подарок - дарим удобную сумку и ремни для фиксации\n            </li>\n            <li><span class=\"icon is-large has-text-primary\"><i class=\"\" data-fa-i2svg=\"\"><svg class=\"svg-inline--fa fa-handshake fa-w-20 fa-lg\" aria-hidden=\"true\" focusable=\"false\" data-prefix=\"fas\" data-icon=\"handshake\" role=\"img\" xmlns=\"http://www.w3.org/2000/svg\" viewBox=\"0 0 640 512\" data-fa-i2svg=\"\"><path fill=\"currentColor\" d=\"M434.7 64h-85.9c-8 0-15.7 3-21.6 8.4l-98.3 90c-.1.1-.2.3-.3.4-16.6 15.6-16.3 40.5-2.1 56 12.7 13.9 39.4 17.6 56.1 2.7.1-.1.3-.1.4-.2l79.9-73.2c6.5-5.9 16.7-5.5 22.6 1 6 6.5 5.5 16.6-1 22.6l-26.1 23.9L504 313.8c2.9 2.4 5.5 5 7.9 7.7V128l-54.6-54.6c-5.9-6-14.1-9.4-22.6-9.4zM544 128.2v223.9c0 17.7 14.3 32 32 32h64V128.2h-96zm48 223.9c-8.8 0-16-7.2-16-16s7.2-16 16-16 16 7.2 16 16-7.2 16-16 16zM0 384h64c17.7 0 32-14.3 32-32V128.2H0V384zm48-63.9c8.8 0 16 7.2 16 16s-7.2 16-16 16-16-7.2-16-16c0-8.9 7.2-16 16-16zm435.9 18.6L334.6 217.5l-30 27.5c-29.7 27.1-75.2 24.5-101.7-4.4-26.9-29.4-24.8-74.9 4.4-101.7L289.1 64h-83.8c-8.5 0-16.6 3.4-22.6 9.4L128 128v223.9h18.3l90.5 81.9c27.4 22.3 67.7 18.1 90-9.3l.2-.2 17.9 15.5c15.9 13 39.4 10.5 52.3-5.4l31.4-38.6 5.4 4.4c13.7 11.1 33.9 9.1 45-4.7l9.5-11.7c11.2-13.8 9.1-33.9-4.6-45.1z\"></path></svg></i></span>\n                оплата по факту получения - вам нет необходимости вносить какую-либо предоплату заранее. Оплатить\n                заказ можно наложенным платежом при получении\n            </li>\n            <li><span class=\"icon is-large has-text-primary\"><i class=\"\" data-fa-i2svg=\"\"><svg class=\"svg-inline--fa fa-certificate fa-w-16 fa-lg\" aria-hidden=\"true\" focusable=\"false\" data-prefix=\"fas\" data-icon=\"certificate\" role=\"img\" xmlns=\"http://www.w3.org/2000/svg\" viewBox=\"0 0 512 512\" data-fa-i2svg=\"\"><path fill=\"currentColor\" d=\"M458.622 255.92l45.985-45.005c13.708-12.977 7.316-36.039-10.664-40.339l-62.65-15.99 17.661-62.015c4.991-17.838-11.829-34.663-29.661-29.671l-61.994 17.667-15.984-62.671C337.085.197 313.765-6.276 300.99 7.228L256 53.57 211.011 7.229c-12.63-13.351-36.047-7.234-40.325 10.668l-15.984 62.671-61.995-17.667C74.87 57.907 58.056 74.738 63.046 92.572l17.661 62.015-62.65 15.99C.069 174.878-6.31 197.944 7.392 210.915l45.985 45.005-45.985 45.004c-13.708 12.977-7.316 36.039 10.664 40.339l62.65 15.99-17.661 62.015c-4.991 17.838 11.829 34.663 29.661 29.671l61.994-17.667 15.984 62.671c4.439 18.575 27.696 24.018 40.325 10.668L256 458.61l44.989 46.001c12.5 13.488 35.987 7.486 40.325-10.668l15.984-62.671 61.994 17.667c17.836 4.994 34.651-11.837 29.661-29.671l-17.661-62.015 62.65-15.99c17.987-4.302 24.366-27.367 10.664-40.339l-45.984-45.004z\"></path></svg></i></span>\n                <a href=\"/about-us\">\n                    <span class=\"ok-underline-dotted\">вся продукция сертифицирована</span></a> - все изделия имеют\n                сертификаты соответствия от производителя установленного образца\n            </li>\n            <li><span class=\"icon is-large has-text-primary\"><i class=\"\" data-fa-i2svg=\"\"><svg class=\"svg-inline--fa fa-thumbs-up fa-w-16 fa-lg\" aria-hidden=\"true\" focusable=\"false\" data-prefix=\"fas\" data-icon=\"thumbs-up\" role=\"img\" xmlns=\"http://www.w3.org/2000/svg\" viewBox=\"0 0 512 512\" data-fa-i2svg=\"\"><path fill=\"currentColor\" d=\"M104 224H24c-13.255 0-24 10.745-24 24v240c0 13.255 10.745 24 24 24h80c13.255 0 24-10.745 24-24V248c0-13.255-10.745-24-24-24zM64 472c-13.255 0-24-10.745-24-24s10.745-24 24-24 24 10.745 24 24-10.745 24-24 24zM384 81.452c0 42.416-25.97 66.208-33.277 94.548h101.723c33.397 0 59.397 27.746 59.553 58.098.084 17.938-7.546 37.249-19.439 49.197l-.11.11c9.836 23.337 8.237 56.037-9.308 79.469 8.681 25.895-.069 57.704-16.382 74.757 4.298 17.598 2.244 32.575-6.148 44.632C440.202 511.587 389.616 512 346.839 512l-2.845-.001c-48.287-.017-87.806-17.598-119.56-31.725-15.957-7.099-36.821-15.887-52.651-16.178-6.54-.12-11.783-5.457-11.783-11.998v-213.77c0-3.2 1.282-6.271 3.558-8.521 39.614-39.144 56.648-80.587 89.117-113.111 14.804-14.832 20.188-37.236 25.393-58.902C282.515 39.293 291.817 0 312 0c24 0 72 8 72 81.452z\"></path></svg></i></span>\n                <a href=\"/kontrol-kachestva\">\n                    <span class=\"ok-underline-dotted\">контроль качества</span></a> - каждое изделие перед отгрузкой\n                покупателю проходит несколько этапов проверки качества\n            </li>\n            <li><span class=\"icon is-large has-text-primary\"><i class=\"\" data-fa-i2svg=\"\"><svg class=\"svg-inline--fa fa-clone fa-w-16 fa-lg\" aria-hidden=\"true\" focusable=\"false\" data-prefix=\"fas\" data-icon=\"clone\" role=\"img\" xmlns=\"http://www.w3.org/2000/svg\" viewBox=\"0 0 512 512\" data-fa-i2svg=\"\"><path fill=\"currentColor\" d=\"M464 0c26.51 0 48 21.49 48 48v288c0 26.51-21.49 48-48 48H176c-26.51 0-48-21.49-48-48V48c0-26.51 21.49-48 48-48h288M176 416c-44.112 0-80-35.888-80-80V128H48c-26.51 0-48 21.49-48 48v288c0 26.51 21.49 48 48 48h288c26.51 0 48-21.49 48-48v-48H176z\"></path></svg></i></span>\n                большой выбор размеров: матрас на диван 160х200, другие стандартные размеры, также изготавливаем\n                топперы любой формы и размеров.\n            </li>\n        </ul>\n        <p></p>\n        <hr>\n        <h2 class=\"is-size-6\">Ортопедические матрасы</h2>\n        <p>Задача любого ортопедического матраса состоит в равномерном распределении нагрузки. Давление на любую\n            точку тела\n            должно быть одинаковым. В этом случае достигается максимальный ортопедический эффект.\n        </p>\n        <h3 class=\"subtitle is-size-6\">Купить ортопедический матрас: пружинный или беспружинный?</h3>\n        <p>Все матрасы классифицируются на <a href=\"/matrasy/c4/type=pruzhinnyy\">\n                        <span class=\"ok-underline-dotted\">\n                            пружинные</span></a> с блоком пружин Bonnel или с независимым блоком Pocket Spring и\n            беспружинные.\n        </p>\n        <p>Bonnel состоит из цельного пружинного блока, в связи с чем обеспечивает начальный ортопедический\n            эффект.\n            Такой вариант подойдет больницам, поликлиникам, недорогим отелям, хостелам, а также при ограниченном\n            бюджете.\n        </p>\n        <p>Изделия с блоком независимых пружин Pocket Spring оказывают точечную и равномерную нагрузку на тело.\n            Каждая пружина\n            находится в отдельном чехле, сжимается независимо от других. Это дает хороший ортопедический эффект. А\n            большой\n            ассортимент верхних слоев и тканей чехла позволят сделать правильный выбор.\n        </p>\n        <p>\n            <a href=\"/matrasy/c4/type=bespruzhinnyy\">\n                        <span class=\"ok-underline-dotted\">\n                            Матрас беспружинный</span></a> равномерно обволакивает контуры спящего, чем гарантирует\n            максимальную ортопедичность. Во время\n            сна тело находится в естественном положении, сосуды не пережимаются и не нарушается кровообращение.\n        </p>\n        <p>В любом случае, лучший выбор - это выбор с учетом ваших индивидуальных\n            предпочтений и\n            особенностей с учетом размера, жесткости, вида наполнителя, вашего возврата, веса и бюджета.\n        </p>\n        <p>Купить ортопедический матрас от производителя можно в нашем интернет-магазине. Мы предоставляем большой\n            выбор односпальных и двуспальных матрасов, производство нестандартных размеров, оплату по факту\n            получения, мгновенную рассрочку за 5\n            минут, адресную доставку в любую\n            точку Украины.\n            Стоимость адресной доставки до вашего дома 150-600 грн (в зависимости от размера). Заказы свыше 5000\n            грн. доставляем\n            бесплатно.\n        </p>\n    </section>\n\n    <section class=\"section\">\n        <header class=\"title is-size-5\">Серии матрасов</header>\n        <div class=\"columns is-multiline is-mobile\">\n            <article class=\"column is-half-mobile is-one-quarter-tablet\">\n                <a href=\"/series-sleep-fly-silver-edition/s1\">\n                    <figure class=\" image\">\n                        <img src=\"/images/series-sleep-fly-silver-edition.jpg\" alt=\"Серия матрасов Sleep&amp;Fly Silver Edition\">\n                    </figure>\n                </a>\n            </article>\n            <article class=\"column is-half-mobile is-one-quarter-tablet\">\n                <a href=\"/series-sleep-fly/s2\">\n                    <figure class=\"image\">\n                        <img src=\"/images/series-sleep-fly.jpg\" alt=\"Серия матрасов Sleep&amp;Fly\">\n                    </figure>\n                </a>\n            </article>\n            <article class=\"column is-half-mobile is-one-quarter-tablet\">\n                <a href=\"/series-sleep-fly-fintess/s3\">\n                    <figure class=\"image\">\n                        <img src=\"/images/series-sleep-fly-fitness.jpg\" alt=\"Серия матрасов Sleep&amp;Fly Silver Fitness\">\n                    </figure>\n                </a>\n            </article>\n            <article class=\"column is-half-mobile is-one-quarter-tablet\">\n                <a href=\"/series-sleep-fly-organic/s4\">\n                    <figure class=\"image\">\n                        <img src=\"/images/series-sleep-fly-organic.jpg\" alt=\"Серия матрасов Sleep&amp;Fly Silver Organic\">\n                    </figure>\n                </a>\n            </article>\n            <article class=\"column is-half-mobile is-one-quarter-tablet\">\n                <a href=\"/series-take-go/s5\">\n                    <figure class=\"image\">\n                        <img src=\"/images/series-take-go.jpg\" alt=\"Серия матрасов Take&amp;Go\">\n                    </figure>\n                </a>\n            </article>\n            <article class=\"column is-half-mobile is-one-quarter-tablet\">\n                <a href=\"/series-take-go-bamboo/s6\">\n                    <figure class=\"image\">\n                        <img src=\"/images/series-take-go-bamboo.jpg\" alt=\"Серия матрасов Take&amp;Go Bamboo\">\n                    </figure>\n                </a>\n            </article>\n            <article class=\"column is-half-mobile is-one-quarter-tablet\">\n                <a href=\"/series-evolution/s7\">\n                    <figure class=\"image\">\n                        <img src=\"/images/series-evolution.jpg\" alt=\"Серия матрасов Evolution\">\n                    </figure>\n                </a>\n            </article>\n            <article class=\"column is-half-mobile is-one-quarter-tablet\">\n                <a href=\"/series-doctor-health/s8\" <figure=\"\" class=\"image\">\n                    <img src=\"/images/series-doctor-health.jpg\" alt=\"Серия матрасов Doctor Health\">\n                \n                </a>\n            </article>\n            <article class=\"column is-half-mobile is-one-quarter-tablet\">\n                <a href=\"/series-herbalis-kids/s9\">\n                    <figure class=\"image\">\n                        <img src=\"/images/series-herbalis-kids.jpg\" alt=\"Серия матрасов Herbalis Kids\">\n                    </figure>\n                </a>\n            </article>\n            <article class=\"column is-half-mobile is-one-quarter-tablet\">\n                <a href=\"/series-eco/s10\">\n                    <figure class=\"image\">\n                        <img src=\"/images/series-eco.jpg\" alt=\"Серия матрасов Эко\">\n                    </figure>\n                </a>\n            </article>\n            <article class=\"column is-half-mobile is-one-quarter-tablet\">\n                <a href=\"/series-sleep-fly-hotel/s15\">\n                    <figure class=\"image\">\n                        <img src=\"/images/series-sleep-fly-hotel.jpg\" alt=\"Серия матрасов Sleep&amp;Fly Hotel\">\n                    </figure>\n                </a>\n            </article>\n            <article class=\"column is-half-mobile is-one-quarter-tablet\">\n                <a href=\"/series-ortomed/s11\">\n                    <figure class=\"image\">\n                        <img src=\"/images/series-ortomed.jpg\" alt=\"Серия матрасов Ortomed\">\n                    </figure>\n                </a>\n            </article>\n            <article class=\"column is-half-mobile is-one-quarter-tablet\">\n                <a href=\"/series-shans/s13\">\n                    <figure class=\"image\">\n                        <img src=\"/images/series-shans.jpg\" alt=\"Серия матрасов Шанс\">\n                    </figure>\n                </a>\n            </article>\n            <article class=\"column is-half-mobile is-one-quarter-tablet\">\n                <a href=\"/series-comfort/s12\">\n                    <figure class=\"image\">\n                        <img src=\"/images/series-comfort.jpg\" alt=\"Серия матрасов Comfort\">\n                    </figure>\n                </a>\n            </article>\n            <article class=\"column is-half-mobile is-one-quarter-tablet\">\n                <a href=\"/series-sleep-fly-mini/s14\">\n                    <figure class=\"image\">\n                        <img src=\"/images/series-sleep-fly-mini.jpg\" alt=\"Серия матрасов Sleep&amp;Fly Mini\">\n                    </figure>\n                </a>\n            </article>\n            <article class=\"column is-half-mobile is-one-quarter-tablet\">\n                <a href=\"/series-day-night/s16\">\n                    <figure class=\"image\">\n                        <img src=\"/images/series-day-night.jpg\" alt=\"Спальные аксессуары серии Day&amp;Night\">\n                    </figure>\n                </a>\n            </article>\n        </div>\n    </section>\n</div>",
      "title": "Тонкие матрасы на диван и ортопедические матрасы | Купить в Днепре, Киеве, Харькове, Львове: цена, отзывы, продажа",
      "h1": "Интернет-магазин матрасов на диван, ортопедических матрасов и\n                спальных аксессуаров",
      "description": "Выравнивающие матрасы на диван, ортопедические матрасы от производителя | Цены | Бесплатная доставка матрасов для дивана по Украине",
      "keyword": "матрасы на диван, купить матрас на диван, ортопедические матрасы, купить ортопедический матрас",
      "category": null,
      "attribute": null
    },
    "model": "attribute.categoryattribute",
    "pk": 1
  },
  {
    "fields": {
      "text": "<section class=\"container content section ok-content\">\n    <div class=\"tile is-ancestor\">\n        <div class=\"tile is-parent\">\n            <article class=\"tile is-child\">\n                <figure class=\"image\">\n                    <img src=\"/images/DSCF6987.jpg\"\n                         alt=\"Топпер на диван в рулоне\"/>\n                </figure>\n            </article>\n            <article class=\"tile is-child\">\n                <figure class=\"image\">\n                    <img src=\"/images/DSCF6838.jpg\"\n                         alt=\"Топпер на диван - общий вид\"/>\n                </figure>\n            </article>\n        </div>\n    </div>\n    <div class=\"tile is-ancestor\">\n        <div class=\"tile is-parent\">\n            <article class=\"tile is-child\">\n                <figure class=\"image\">\n                    <img src=\"/images/DSCF6800.jpg\"\n                         alt=\"Ткань топпера на диван\"/>\n                </figure>\n            </article>\n            <article class=\"tile is-child is-3\">\n                <figure class=\"image\">\n                    <img src=\"/images/DSCF7015.jpg\"\n                         alt=\"Топпер на диван в шкаф-купе\"/>\n                </figure>\n            </article>\n            <article class=\"tile is-child\">\n                <figure class=\"image\">\n                    <img src=\"/images/DSCF6848.jpg\"\n                         alt=\"Топпер на диван с фиксирующими резинками\"/>\n                </figure>\n            </article>\n        </div>\n    </div>\n    <div class=\"tile is-ancestor\">\n        <div class=\"tile is-parent\">\n            <article class=\"tile is-child\">\n                <figure class=\"image\">\n                    <img src=\"/images/DSCF6840.jpg\"\n                         alt=\"Вид топпера на диван\"/>\n                </figure>\n            </article>\n            <article class=\"tile is-child\">\n                <figure class=\"image\">\n                    <img src=\"/images/DSCF7065.jpg\"\n                         alt=\"Топпер на диван в автобагажнике\"/>\n                </figure>\n            </article>\n        </div>\n    </div>\n</section>\n<section class=\"container content section\">\n    <p>Матрас топпер - тонкий матрас, который стелется поверх основного матраса или кровати. Он\n        регулирует жесткость, делает её мягче, или наоборот, жестче, выравнивает поверхность, является полезным\n        аксессуаром в доме.</p>\n    <h2 class=\"subtitle is-size-5\">Преимущества ортопедического матраса топпера</h2>\n    <p>Основное назначение - улучшить сон.</p>\n    <ul>Вот дополнительные преимущества:\n        <li>- придает ровную поверхность старой или неровной кровати, угловому дивану</li>\n        <li>- дает дополнительные спальные места</li>\n        <li>- заменяет каремат в палатке</li>\n        <li>- обеспечивает комфорт и тепло детям на полу</li>\n        <li>- придает жесткость мягкой кровати при использовании кокосовой койры или плотной ортопедической пены\n        </li>\n        <li>- обеспечивает мягкость слишком жесткому матрасу в случае выбора изделия из мягких наполнителей</li>\n        <li>- экономит деньги - не всегда есть средства для обновления матраса. Цена топпера на диван дешевле нового\n            матраса\n        </li>\n        <li>- это универсальный и полезный подарок друзьям, родственникам, знакомым</li>\n    </ul>\n    <h2 class=\"subtitle is-size-5\">Как выбрать топпер на диван?</h2>\n    <p><span class=\"has-text-weight-bold\">Размеры</span> бывают стандартными и нестандартными. Стандартные\n        соответствуют общепринятым размерам, топпер 160х200 см, например. Также по вашему заказу мы можем изготовить\n        топпер\n        на диван\n        нестандартного размера.</p>\n    <p><span class=\"has-text-weight-bold\">Высота</span> колеблется от 5 до 8 см. Основная толщина 7-8 см. Это золотая\n        середина между комфортом и удобством: 10 см неудобно хранить или перевозить из-за габаритов, а 2 см вряд ли\n        добавит\n        уюта спальному месту.</p>\n    <p>\n        <span class=\"has-text-weight-bold\">Чехол</span> разнообразен по ткани и дизайну. Используются, в основном,\n        жаккард и\n        стрейч.</p>\n    <ul>\n        <span class=\"has-text-weight-bold\">Натуральные наполнители:</span>\n        <li>- утиное перо - упругий, легкий, стойкий против сваливания в комки природный наполнитель</li>\n        <li>- гусиный пух - один из самых ценных природных наполнителей благодаря уникальным теплоизоляционным свойствам\n        </li>\n        <li>- кокосовая койра - изготавливается из кожуры орехов кокосовых пальм</li>\n    </ul>\n    <ul>\n        <span class=\"has-text-weight-bold\">Искусственные наполнители:</span>\n        <li>- ортопедическая пена - синтетический и износостойкий материал. Широко используется в матрасном производстве\n        </li>\n        <li>- мемори - материал с \"эффектом памяти\". Если опустить руку на матрас и резко отпустить, то он не сразу\n            выпрямится, а с задержкой\n        </li>\n    </ul>\n    <p><span class=\"has-text-weight-bold\">Стирка</span>. Некоторые модели сделаны со съемным чехлом, что удобно для\n        эксплуатации.</p>\n    <p>Каждый выравнивающий матрас топпер свернут в компактную вакуумную упаковку и по отзывам покупателей прост в\n        транспортировке и хранении. Изделие идет резиновыми ремнями для фиксации к матрасу.</p>\n    <p>Купить матрас топпер на диван от производителя можно в нашем интернет магазине. Мы предоставляем бесплатную\n        доставку\n        по Украине.</p>\n</section>",
      "title": "Топперы на диван | Купить в Днепре, Киеве, Харькове: цена, отзывы, продажа",
      "h1": "Матрасы топперы",
      "description": "Выравнивающие матрасы топперы на диван купить в интернет магазине | Цены | Бесплатная доставка по Украине",
      "keyword": "матрас топпер, топпер купить, топпер на диван, купить топпер, топпер 160х200 цена",
      "category": "1",
      "attribute": null
    },
    "model": "attribute.categoryattribute",
    "pk": 2
  },
  {
    "fields": {
      "text": "<section class=\"container content section\">\n    <h2 class=\"subtitle is-size-5\">Купить матрас на диван недорого - хороший выбор при ограниченном бюджете</h2>\n    <p>Если у вас нет возможности купить полноценный ортопедический матрас или нужно сделать комфортным сон на\n        мягком\n        диване, который несколько потерял свои свойства, то купить топпер недорого - это лучший вариант для решения\n        проблемы.\n        При\n        своей небольшой цене эти изделия способны решить вопросы, связанные со сном: сгладить неровности спальной\n        поверхности, придать жесткость, или наоборот, мягкость, расширить спальные места для внезапных гостей.\n        Недорогие\n        матрасы на диван компактны, не занимают много места и просты при транспортировке.\n        Это изделие, которое:</p>\n    <ul>\n        <li>- устраняет неровности спального места;</li>\n        <li>- нивелирует зазоры между подушками мягкого дивана и тем самым обеспечивает ночной комфорт;</li>\n        <li>- не требует больших вложений средств;</li>\n        <li>- подобрав модель определенного дизайна, можно значительно улучшить внешний вид дивана и добавить\n            помещению стиля и новизны;\n        </li>\n        <li>- это изделие поможет организовать спальное место на полу для гостей или отдых на даче;</li>\n        <li>- помогает сделать диван жестче или мягче, если вы выберете правильный тип наполнителя.</li>\n    </ul>\n    <h2 class=\"subtitle is-size-5\">Как выбрать тонкие матрасы на диван недорого?</h2>\n    <p>Чтобы сделать изделие более доступным по цене, производители используют менее дорогостоящие материалы. В\n        качестве\n        наполнителя применяют кокосовую койру или ортопедическую пену Ergoflex, а для чехла в основном используют\n        жаккард.\n        Также можно сэкономить, выбрав матрас с небольшой толщиной около 5 см.</p>\n    <h2 class=\"subtitle is-size-5\">Используемые материалы в недорогих матрасах топперах</h2>\n    <p>Для наполнения используются недорогие, но качественные материалы. Самым популярным материалом для жестких\n        топперов является кокосовая койра. Это натуральный материал из волокон кокосового ореха. Он используется для\n        наполнения\n        топпера в виде спрессованных листов. Кокосовое волокно не гниет, быстро сохнет, хорошо вентилируется. В нем\n        не живут пылевые клещи и бактерии. Часто кокосовая койра используется в виде латексированных листов - пласт\n        волокна\n        пропитывают латексом. Такой способ позволяет материалу становиться упругим, эластичным, долговечным.</p>\n    <p>Еще один недорогой наполнитель, но уже для более мягкого топпера - ортопедическая пена ErgoFlex. Это\n        материал высокого уровня плотности, микропористый. Пена нетоксична, гипоаллергенна, долговечна. Изделие с\n        наполнителем из такой пены обеспечит правильную поддержку позвоночника во время сна, равномерно распределяя\n        давление на все\n        участки тела. Ночной сон на таком матрасе улучшает кровообращение и обеспечивает расслабление мышц и комфортный\n        отдых.</p>\n    <p>В производстве тонких матрасов в качестве материала для чехла чаще всего используют жаккард. Это\n        прочная, износостойкая ткань, благодаря специальному переплетению нитей хорошо пропускающая воздух. Она\n        обеспечивает\n        вентиляцию, защищает его от загрязнений и имеет прекрасный декоративный эффект.</p>\n    <p>Купить матрас на диван недорого просто - выбираете модель в нашем интернет магазине в\n        рамках вашего бюджета. По отзывам довольных покупателей это прекрасная альтернатива для обновления вашего дивана\n        и улучшения комфортного ночного отдыха.</p>\n</section>",
      "title": "Матрас на диван недорого от производителя | Купить в Днепре, Киеве, Харькове: цена, отзывы, продажа",
      "h1": "Недорогие матрасы для дивана",
      "description": "Тонкие матрасы на диван недорого купить в интернет магазине | Цены | Доставка по Украине",
      "keyword": "купить матрас на диван недорого, купить топпер недорого, недорогие матрасы на диван, тонкие матрасы на диван недорого",
      "category": "1",
      "attribute": "1"
    },
    "model": "attribute.categoryattribute",
    "pk": 3
  },
  {
    "fields": {
      "text": "<section class=\"container content section\">\n    <p>В нашем интернет магазине вы можете купить ортопедические премиум матрасы на диван высокого\n        качества. Эти изделия произведены из качественных материалов: хлопок, мериносовая шерсть, гусиный и утиный пух и\n        перо, пена с эффектом памяти Memory-foam. Каждый матрас имеет четыре резиновых затяжки по углам, чтобы он не\n        ерзал.\n        Прекрасное качество чехла из хлопка не дают\n        простыни двигаться. А продуманная прошивка препятствует передвижению наполнителя внутри изделия из угла в\n        угол.</p>\n    <ul>Если вы хотите:\n        <li>- получать непревзойденный комфорт и отдых во время сна</li>\n        <li>- сделать спальное ложе особенно мягким и теплым</li>\n        <li>- сделать ценный подарок близким и друзьям, который они запомнят надолго</li>\n        мы советуем купить премиум тонкий матрас для дивана.\n    </ul>\n    <h2 class=\"subtitle is-size-5\">Особенности премиум матрасов топперов</h2>\n    <p>Используется натуральный хлопок для чехла. Он мягкий, легкий и дышащий. Используются натуральные наполнители:\n        мериносовая шерсть - это натуральная шерсть из особой породы овец - меринос.\n        Волокна этой шерсти тонкие, но прочные.\n        Благодаря этим свойствам изделия из мериноса получаются мягкие, теплые, износостойкие и приятные на ощупь\n        утиный и гусиный пух и перо - натуральные природные наполнители: топперы получаются легкими и упругими, теплыми.\n        Высота 5-8 см. Это дает приятные ощущения во время сна - вы как будто лежите на облаке.</p>\n</section>\n",
      "title": "Премиум матрасы для дивана | Купить в Днепре, Киеве, Харькове: цена, отзывы, продажа",
      "h1": "Премиум матрасы на диван",
      "description": "Премиум тонкие матрасы на диван купить в интернет магазине | Цены | Бесплатная доставка по Украине",
      "keyword": "премиум матрасы на диван, купить премиум матрас на диван",
      "category": "1",
      "attribute": "2"
    },
    "model": "attribute.categoryattribute",
    "pk": 4
  },
  {
    "fields": {
      "text": "",
      "title": "Матрасы для дивана со скидкой | Купить в Днепре, Киеве, Харькове: цена, отзывы, продажа",
      "h1": "Матрасы на диван со скидкой",
      "description": "Матрасы на диван со скидкой купить в интернет магазине | Цены | Бесплатная доставка по Украине",
      "keyword": "матрасы на диван по распродаже, купить матрас на диван со скидкой",
      "category": "1",
      "attribute": "3"
    },
    "model": "attribute.categoryattribute",
    "pk": 5
  },
  {
    "fields": {
      "text": "",
      "title": "Матрасы для дивана 90 на 190 | Купить в Днепре, Киеве, Харькове: цена, отзывы, продажа",
      "h1": "Матрасы на диван 90x190",
      "description": "Матрасы на диван 90*190 купить в интернет магазине | Цены | Бесплатная доставка по Украине",
      "keyword": "матрасы на диван 90x190, купить матрас на диван 90x190",
      "category": "1",
      "attribute": "4"
    },
    "model": "attribute.categoryattribute",
    "pk": 6
  },
  {
    "fields": {
      "text": "",
      "title": "Матрасы для дивана 90 на 200 | Купить в Днепре, Киеве, Харькове: цена, отзывы, продажа",
      "h1": "Матрасы на диван 90x200",
      "description": "Матрасы на диван 90*200 купить в интернет магазине | Цены | Бесплатная доставка по Украине",
      "keyword": "матрасы на диван 90x200, купить матрас на диван 90x200",
      "category": "1",
      "attribute": "5"
    },
    "model": "attribute.categoryattribute",
    "pk": 7
  },
  {
    "fields": {
      "text": "",
      "title": "Матрасы для дивана 120 на 200 | Купить в Днепре, Киеве, Харькове: цена, отзывы, продажа",
      "h1": "Матрасы на диван 120x200",
      "description": "Матрасы на диван 120*200 купить в интернет магазине | Цены | Бесплатная доставка по Украине",
      "keyword": "матрасы на диван 120x200, купить матрас на диван 120x200",
      "category": "1",
      "attribute": "6"
    },
    "model": "attribute.categoryattribute",
    "pk": 8
  }
]
