[gd_scene load_steps=4 format=3 uid="uid://dj4km34bwwqjk"]

[ext_resource type="Script" path="res://scripts/SceneTransition.gd" id="1_iffrl"]

[sub_resource type="Animation" id="Animation_m22xc"]
resource_name = "fade"
length = 0.3
step = 0.01
tracks/0/type = "value"
tracks/0/imported = false
tracks/0/enabled = true
tracks/0/path = NodePath(".:modulate")
tracks/0/interp = 1
tracks/0/loop_wrap = true
tracks/0/keys = {
"times": PackedFloat32Array(0, 0.3),
"transitions": PackedFloat32Array(1, 1),
"update": 0,
"values": [Color(0, 0, 0, 0), Color(0, 0, 0, 1)]
}

[sub_resource type="AnimationLibrary" id="AnimationLibrary_j1veg"]
_data = {
"fade": SubResource("Animation_m22xc")
}

[node name="SceneTransition" type="Node2D"]
script = ExtResource("1_iffrl")

[node name="CanvasLayer" type="CanvasLayer" parent="."]
layer = 100

[node name="ColorRect" type="ColorRect" parent="CanvasLayer"]
modulate = Color(0, 0, 0, 0)
anchors_preset = 15
anchor_right = 1.0
anchor_bottom = 1.0
grow_horizontal = 2
grow_vertical = 2
size_flags_horizontal = 3
size_flags_vertical = 3
color = Color(0, 0, 0, 1)

[node name="AnimationPlayer" type="AnimationPlayer" parent="CanvasLayer/ColorRect"]
libraries = {
"": SubResource("AnimationLibrary_j1veg")
}
