[gd_scene load_steps=2 format=3 uid="uid://d1cdq0pgh482f"]

[ext_resource type="Script" path="res://scripts/camp.gd" id="1_f5236"]

[node name="campEasy" type="Node2D"]
script = ExtResource("1_f5236")
enemies = [Vector2(10, -22), Vector2(23, 20), Vector2(-17, -9), Vector2(-21, 22)]
coins = [Vector2(0, 0)]
max_level = 3
large = false
ultra = false
