<?xml version="1.0" encoding="UTF-8" standalone="no"?>
<svg
   xmlns:dc="http://purl.org/dc/elements/1.1/"
   xmlns:cc="http://creativecommons.org/ns#"
   xmlns:rdf="http://www.w3.org/1999/02/22-rdf-syntax-ns#"
   xmlns:svg="http://www.w3.org/2000/svg"
   xmlns="http://www.w3.org/2000/svg"
   xmlns:sodipodi="http://sodipodi.sourceforge.net/DTD/sodipodi-0.dtd"
   xmlns:inkscape="http://www.inkscape.org/namespaces/inkscape"
   sodipodi:docname="pie-4-of-5.svg"
   inkscape:version="1.0 (4035a4fb49, 2020-05-01)"
   width="227.09961mm"
   height="229.26584mm"
   viewBox="0 0 227.09961 229.26584"
   version="1.1"
   id="svg8">
  <defs
     id="defs2">
    <filter
       inkscape:collect="always"
       style="color-interpolation-filters:sRGB"
       id="filter2479"
       x="-0.025600687"
       width="1.0512013"
       y="-0.025443353"
       height="1.0508868">
      <feGaussianBlur
         inkscape:collect="always"
         stdDeviation="2.2700396"
         id="feGaussianBlur2481" />
    </filter>
  </defs>
  <sodipodi:namedview
     fit-margin-bottom="0"
     fit-margin-right="0"
     fit-margin-left="0"
     fit-margin-top="0"
     id="base"
     pagecolor="#ffffff"
     bordercolor="#666666"
     borderopacity="1.0"
     inkscape:pageopacity="0.0"
     inkscape:pageshadow="2"
     inkscape:zoom="0.5"
     inkscape:cx="390.88578"
     inkscape:cy="282.35713"
     inkscape:document-units="px"
     inkscape:current-layer="g2398"
     inkscape:document-rotation="0"
     showgrid="false"
     showborder="true"
     inkscape:object-nodes="false"
     inkscape:snap-smooth-nodes="true"
     inkscape:snap-center="true"
     inkscape:window-width="1916"
     inkscape:window-height="1036"
     inkscape:window-x="0"
     inkscape:window-y="20"
     inkscape:window-maximized="1" />
  <metadata
     id="metadata5">
    <rdf:RDF>
      <cc:Work
         rdf:about="">
        <dc:format>image/svg+xml</dc:format>
        <dc:type
           rdf:resource="http://purl.org/dc/dcmitype/StillImage" />
        <dc:title></dc:title>
      </cc:Work>
    </rdf:RDF>
  </metadata>
  <g
     transform="translate(5.6013203,-38.641099)"
     inkscape:label="Layer 1"
     inkscape:groupmode="layer"
     id="layer1" />
  <g
     transform="translate(5.6013203,-38.641099)"
     id="g853"
     inkscape:label="Chart-Layer: apples:3,bananas:5,oranges:10,pears:4"
     inkscape:groupmode="layer" />
  <g
     transform="translate(5.6013203,-38.641099)"
     id="g904"
     inkscape:label="Chart-Layer: apples:3,bananas:5,oranges:10,pears:4"
     inkscape:groupmode="layer" />
  <g
     transform="translate(5.6013203,-38.641099)"
     id="g941"
     inkscape:label="Chart-Layer: apples:1,thres: 2"
     inkscape:groupmode="layer" />
  <g
     transform="translate(5.6013203,-38.641099)"
     id="g986"
     inkscape:label="Chart-Layer: apples:1,thres: 1,boop:1"
     inkscape:groupmode="layer" />
  <g
     transform="translate(5.6013203,-38.641099)"
     id="g1930"
     inkscape:label="Chart-Layer: apples:1,thres: 1,boop:1"
     inkscape:groupmode="layer" />
  <g
     transform="translate(5.6013203,-38.641099)"
     id="g2398"
     inkscape:label="Chart-Layer: apples:1,thres: 1,boop:1, crunch: 1, b: 1"
     inkscape:groupmode="layer">
    <g
       id="g2433"
       transform="translate(15.730564,20.558693)"
       style="filter:url(#filter2479)">
      <path
         id="path2418"
         style="fill:#b3b3b3;fill-opacity:1;stroke:none;stroke-width:3.00011;stroke-miterlimit:4;stroke-dasharray:none;stroke-opacity:1"
         sodipodi:end="1.2566368"
         sodipodi:start="0"
         sodipodi:ry="100"
         sodipodi:rx="100"
         sodipodi:cy="139.77229"
         sodipodi:cx="99.729134"
         sodipodi:type="arc"
         sodipodi:arc-type="slice"
         d="m 199.72913,139.77229 a 100,100 0 0 1 -69.09827,95.10565 L 99.729134,139.77229 Z" />
      <path
         id="path2420"
         style="fill:#b3b3b3;fill-opacity:1;stroke:none;stroke-width:3.00011;stroke-miterlimit:4;stroke-dasharray:none;stroke-opacity:1"
         sodipodi:end="2.5132736"
         sodipodi:start="1.2566368"
         sodipodi:ry="100"
         sodipodi:rx="100"
         sodipodi:cy="141.90015"
         sodipodi:cx="92.776825"
         sodipodi:type="arc"
         sodipodi:arc-type="slice"
         d="M 123.67855,237.00579 A 100,100 0 0 1 11.875156,200.67871 l 80.901669,-58.77856 z" />
      <path
         id="path2422"
         style="fill:#b3b3b3;fill-opacity:1;stroke:none;stroke-width:3.00011;stroke-miterlimit:4;stroke-dasharray:none;stroke-opacity:1"
         sodipodi:end="3.7699104"
         sodipodi:start="2.5132736"
         sodipodi:ry="100"
         sodipodi:rx="100"
         sodipodi:cy="134.69873"
         sodipodi:cx="87.509117"
         sodipodi:type="arc"
         sodipodi:arc-type="slice"
         d="M 6.6074484,193.4773 A 100,100 0 0 1 6.6073716,75.920269 L 87.509117,134.69873 Z" />
      <path
         id="path2424"
         style="fill:#b3b3b3;fill-opacity:1;stroke:none;stroke-width:3.00011;stroke-miterlimit:4;stroke-dasharray:none;stroke-opacity:1"
         sodipodi:end="5.0265472"
         sodipodi:start="3.7699104"
         sodipodi:ry="100"
         sodipodi:rx="100"
         sodipodi:cy="127.77368"
         sodipodi:cx="92.208527"
         sodipodi:type="arc"
         sodipodi:arc-type="slice"
         d="M 11.306781,68.99522 A 100,100 0 0 1 123.11013,32.667998 L 92.208527,127.77368 Z" />
      <path
         id="path2426"
         style="fill:#b3b3b3;fill-opacity:1;stroke:none;stroke-width:3.00011;stroke-miterlimit:4;stroke-dasharray:none;stroke-opacity:1"
         sodipodi:end="6.283184"
         sodipodi:start="5.0265472"
         sodipodi:ry="100"
         sodipodi:rx="100"
         sodipodi:cy="130.88597"
         sodipodi:cx="100.31963"
         sodipodi:type="arc"
         sodipodi:arc-type="slice"
         d="m 131.22123,35.780287 a 100,100 0 0 1 69.0984,95.105553 l -100,1.3e-4 z" />
    </g>
    <path
       id="path2372"
       style="fill:#ff00ff;fill-opacity:1;stroke:#000000;stroke-width:3.00011;stroke-miterlimit:4;stroke-dasharray:none;stroke-opacity:1"
       sodipodi:end="1.2566368"
       sodipodi:start="0"
       sodipodi:ry="100"
       sodipodi:rx="100"
       sodipodi:cy="152.14525"
       sodipodi:cx="108.11612"
       sodipodi:type="arc"
       sodipodi:arc-type="slice"
       d="m 208.11612,152.14525 a 100,100 0 0 1 -69.09828,95.10564 l -30.90172,-95.10564 z" />
    <path
       id="path2378"
       style="fill:#800080;fill-opacity:1;stroke:#000000;stroke-width:3.00011;stroke-miterlimit:4;stroke-dasharray:none;stroke-opacity:1"
       sodipodi:end="2.5132736"
       sodipodi:start="1.2566368"
       sodipodi:ry="100"
       sodipodi:rx="100"
       sodipodi:cy="154.2731"
       sodipodi:cx="101.16381"
       sodipodi:type="arc"
       sodipodi:arc-type="slice"
       d="M 132.06554,249.37875 A 100,100 0 0 1 20.262142,213.05167 L 101.16381,154.2731 Z" />
    <path
       id="path2384"
       style="fill:#ff00ff;fill-opacity:1;stroke:#000000;stroke-width:3.00011;stroke-miterlimit:4;stroke-dasharray:none;stroke-opacity:1"
       sodipodi:end="3.7699104"
       sodipodi:start="2.5132736"
       sodipodi:ry="100"
       sodipodi:rx="100"
       sodipodi:cy="147.07169"
       sodipodi:cx="95.896103"
       sodipodi:type="arc"
       sodipodi:arc-type="slice"
       d="M 14.994434,205.85025 A 100,100 0 0 1 14.994357,88.293224 L 95.896103,147.07169 Z" />
    <path
       id="path2390"
       style="fill:#ff00ff;fill-opacity:1;stroke:#000000;stroke-width:3.00011;stroke-miterlimit:4;stroke-dasharray:none;stroke-opacity:1"
       sodipodi:end="5.0265472"
       sodipodi:start="3.7699104"
       sodipodi:ry="100"
       sodipodi:rx="100"
       sodipodi:cy="140.14664"
       sodipodi:cx="100.59551"
       sodipodi:type="arc"
       sodipodi:arc-type="slice"
       d="M 19.693767,81.368175 A 100,100 0 0 1 131.49711,45.040953 l -30.9016,95.105687 z" />
    <path
       id="path2396"
       style="fill:#ff00ff;fill-opacity:1;stroke:#000000;stroke-width:3.00011;stroke-miterlimit:4;stroke-dasharray:none;stroke-opacity:1"
       sodipodi:end="6.283184"
       sodipodi:start="5.0265472"
       sodipodi:ry="100"
       sodipodi:rx="100"
       sodipodi:cy="143.25893"
       sodipodi:cx="108.70662"
       sodipodi:type="arc"
       sodipodi:arc-type="slice"
       d="m 139.60822,48.153242 a 100,100 0 0 1 69.0984,95.105558 l -100,1.3e-4 z" />
  </g>
</svg>
