^C:\USERS\000\SOURCE\REPOS\HOMEWORK18\V2 (CHAR)\X64\DEBUG\V2 (CHAR).OBJ
C:\USERS\000\SOURCE\REPOS\HOMEWORK18\V2 (CHAR)\X64\DEBUG\V2 (CHAR).EXE
C:\USERS\000\SOURCE\REPOS\HOMEWORK18\V2 (CHAR)\X64\DEBUG\V2 (CHAR).ILK
C:\USERS\000\SOURCE\REPOS\HOMEWORK18\V2 (CHAR)\X64\DEBUG\V2 (CHAR).PDB
