^C:\USERS\000\SOURCE\REPOS\HOMEWORK18\V2 (CHAR)\V2 (CHAR).CPP
C:\USERS\000\SOURCE\REPOS\HOMEWORK18\V2 (CHAR)\X64\DEBUG\VC143.PDB
C:\USERS\000\SOURCE\REPOS\HOMEWORK18\V2 (CHAR)\X64\DEBUG\VC143.IDB
C:\USERS\000\SOURCE\REPOS\HOMEWORK18\V2 (CHAR)\X64\DEBUG\V2 (CHAR).OBJ
