
./octez-client --protocol PtLimaPtLMwfNinJi9rCfDPWea8dFgTZ1MeJ9f1m2SRic6ayiwW --mode mockup --no-base-dir-warnings typecheck script tests_python/contracts_015/opcodes/dropn.tz --details
Well typed
Gas remaining: 1039994.587 units remaining
{ parameter (pair (pair (pair (pair nat nat) nat) nat) nat) ;
  storage nat ;
  code { CAR
         /* [ pair (pair (pair (pair nat nat) nat) nat) nat ] */ ;
         UNPAIR
         /* [ pair (pair (pair nat nat) nat) nat : nat ] */ ;
         UNPAIR
         /* [ pair (pair nat nat) nat : nat : nat ] */ ;
         UNPAIR
         /* [ pair nat nat : nat : nat : nat ] */ ;
         UNPAIR
         /* [ nat : nat : nat : nat : nat ] */ ;
         DROP 4
         /* [ nat ] */ ;
         NIL operation
         /* [ list operation : nat ] */ ;
         PAIR
         /* [ pair (list operation) nat ] */ } }
