
./octez-client --protocol PtLimaPtLMwfNinJi9rCfDPWea8dFgTZ1MeJ9f1m2SRic6ayiwW --mode mockup --no-base-dir-warnings typecheck script tests_python/contracts_015/opcodes/sets.tz --details
Well typed
Gas remaining: 1039953.534 units remaining
{ parameter unit ;
  storage unit ;
  code { DROP
         /* [] */ ;
         PUSH (set nat) { 0 ; 1 ; 3 }
         /* [ set nat ] */ ;
         DROP
         /* [] */ ;
         PUSH (set int) { -1 ; 0 ; 3 }
         /* [ set int ] */ ;
         DROP
         /* [] */ ;
         PUSH (set mutez) { 1 ; 4 ; 5 ; 10 ; 1923 }
         /* [ set mutez ] */ ;
         DROP
         /* [] */ ;
         PUSH (set timestamp)
              { -1 ; 0 ; "2017-09-16T08:38:04Z" ; "2019-09-16T08:38:05Z" }
         /* [ set timestamp ] */ ;
         DROP
         /* [] */ ;
         PUSH (set bool) {}
         /* [ set bool ] */ ;
         DROP
         /* [] */ ;
         PUSH (set bool) { True }
         /* [ set bool ] */ ;
         DROP
         /* [] */ ;
         PUSH (set bool) { False }
         /* [ set bool ] */ ;
         DROP
         /* [] */ ;
         PUSH (set bool) { False ; True }
         /* [ set bool ] */ ;
         DROP
         /* [] */ ;
         PUSH (set string) { "" ; "A" ; "B" ; "a" ; "aa" ; "b" }
         /* [ set string ] */ ;
         DROP
         /* [] */ ;
         PUSH (set bytes) { 0x ; 0x01 ; 0x02 ; 0xaabbcc }
         /* [ set bytes ] */ ;
         DROP
         /* [] */ ;
         PUSH (set key_hash)
              { "tz1KqTpEZ7Yob7QbPE4Hy4Wo8fHG8LhKxZSx" ;
                "tz1ddb9NMYHZi5UzPdzTZMYQQZoMub195zgv" }
         /* [ set key_hash ] */ ;
         DROP
         /* [] */ ;
         PUSH (set address)
              { "tz1KqTpEZ7Yob7QbPE4Hy4Wo8fHG8LhKxZSx" ;
                "tz1ddb9NMYHZi5UzPdzTZMYQQZoMub195zgv" ;
                "KT1TZCh8fmUbuDqFxetPWC2fsQanAHzLx4W9" }
         /* [ set address ] */ ;
         DROP
         /* [] */ ;
         UNIT
         /* [ unit ] */ ;
         NIL operation
         /* [ list operation : unit ] */ ;
         PAIR
         /* [ pair (list operation) unit ] */ } }
