
./octez-client --protocol PtKathmankSpLLDALzWw7CGD2j2MtyveTwboEYokqUCP4a1LxMg --mode mockup --no-base-dir-warnings typecheck script tests_python/contracts_014/opcodes/comb-set-2.tz --details
Well typed
Gas remaining: 1039991.581 units remaining
{ parameter (pair nat nat nat unit) ;
  storage (option (pair int nat string bytes)) ;
  code { CAR
         /* [ pair nat nat nat unit ] */ ;
         PUSH int 2
         /* [ int : pair nat nat nat unit ] */ ;
         UPDATE 1
         /* [ pair int nat nat unit ] */ ;
         PUSH string "toto"
         /* [ string : pair int nat nat unit ] */ ;
         UPDATE 5
         /* [ pair int nat string unit ] */ ;
         PUSH bytes 0x01
         /* [ bytes : pair int nat string unit ] */ ;
         UPDATE 6
         /* [ pair int nat string bytes ] */ ;
         SOME
         /* [ option (pair int nat string bytes) ] */ ;
         NIL operation
         /* [ list operation : option (pair int nat string bytes) ] */ ;
         PAIR
         /* [ pair (list operation) (option (pair int nat string bytes)) ] */ } }
