
./octez-client --protocol PtLimaPtLMwfNinJi9rCfDPWea8dFgTZ1MeJ9f1m2SRic6ayiwW --mode mockup --no-base-dir-warnings typecheck script tests_python/contracts_015/macros/set_caddaadr.tz --details
Well typed
Gas remaining: 1039970.670 units remaining
{ parameter mutez ;
  storage (pair (pair nat (pair nat (pair (pair (pair (nat %p) (mutez %value)) nat) nat))) nat) ;
  code { DUP
         /* [ pair mutez (pair nat nat (pair (pair nat mutez) nat) nat) nat
            : pair mutez (pair nat nat (pair (pair nat mutez) nat) nat) nat ] */ ;
         CAR
         /* [ mutez : pair mutez (pair nat nat (pair (pair nat mutez) nat) nat) nat ] */ ;
         SWAP
         /* [ pair mutez (pair nat nat (pair (pair nat mutez) nat) nat) nat : mutez ] */ ;
         CDR
         /* [ pair (pair nat nat (pair (pair nat mutez) nat) nat) nat : mutez ] */ ;
         SET_CADDAADR @toplevel_pair_name %value ;
         NIL operation
         /* [ list operation : pair (pair nat nat (pair (pair nat mutez) nat) nat) nat ] */ ;
         PAIR
         /* [ pair (list operation) (pair nat nat (pair (pair nat mutez) nat) nat) nat ] */ } }
