
./octez-client --protocol ProtoALphaALphaALphaALphaALphaALphaALphaALphaDdp3zK --mode mockup --no-base-dir-warnings typecheck script tests_python/contracts_alpha/mini_scenarios/authentication.tz --details
Well typed
Gas remaining: 1039979.836 units remaining
{ parameter (pair (lambda unit (list operation)) signature) ;
  storage (pair (nat %counter) key) ;
  code { UNPPAIPAIR ;
         DUUUP
         /* [ nat : lambda unit (list operation) : signature : nat : key ] */ ;
         DUUP
         /* [ lambda unit (list operation) : nat : lambda unit (list operation)
            : signature : nat : key ] */ ;
         SELF
         /* [ contract (pair (lambda unit (list operation)) signature)
            : lambda unit (list operation) : nat : lambda unit (list operation)
            : signature : nat : key ] */ ;
         CHAIN_ID
         /* [ chain_id : contract (pair (lambda unit (list operation)) signature)
            : lambda unit (list operation) : nat : lambda unit (list operation)
            : signature : nat : key ] */ ;
         PPAIPAIR ;
         PACK
         /* [ bytes : lambda unit (list operation) : signature : nat : key ] */ ;
         DIP { SWAP /* [ signature : lambda unit (list operation) : nat : key ] */ }
         /* [ bytes : signature : lambda unit (list operation) : nat : key ] */ ;
         DUUUUUP
         /* [ key : bytes : signature : lambda unit (list operation) : nat : key ] */ ;
         DIP { SWAP /* [ signature : bytes : lambda unit (list operation) : nat : key ] */ }
         /* [ key : signature : bytes : lambda unit (list operation) : nat : key ] */ ;
         DUUUP
         /* [ bytes : key : signature : bytes : lambda unit (list operation) : nat
            : key ] */ ;
         DIP { CHECK_SIGNATURE /* [ bool : lambda unit (list operation) : nat : key ] */ }
         /* [ bytes : bool : lambda unit (list operation) : nat : key ] */ ;
         SWAP
         /* [ bool : bytes : lambda unit (list operation) : nat : key ] */ ;
         IF { DROP /* [ lambda unit (list operation) : nat : key ] */ } { FAILWITH /* [] */ } ;
         UNIT
         /* [ unit : lambda unit (list operation) : nat : key ] */ ;
         EXEC
         /* [ list operation : nat : key ] */ ;
         DIP { PUSH nat 1 /* [ nat : nat : key ] */ ; ADD /* [ nat : key ] */ }
         /* [ list operation : nat : key ] */ ;
         PAPAIR } }
