
./octez-client --protocol PtLimaPtLMwfNinJi9rCfDPWea8dFgTZ1MeJ9f1m2SRic6ayiwW --mode mockup --no-base-dir-warnings typecheck script tests_python/contracts_015/opcodes/loop_left.tz --details
Well typed
Gas remaining: 1039987.396 units remaining
{ parameter (list string) ;
  storage (list string) ;
  code { CAR
         /* [ list string ] */ ;
         NIL string
         /* [ list string : list string ] */ ;
         SWAP
         /* [ list string : list string ] */ ;
         PAIR
         /* [ pair (list string) (list string) ] */ ;
         LEFT (list string)
         /* [ or (pair (list string) (list string)) (list string) ] */ ;
         LOOP_LEFT
           { DUP
             /* [ pair (list string) (list string) : pair (list string) (list string) ] */ ;
             CAR
             /* [ list string : pair (list string) (list string) ] */ ;
             DIP { CDR /* [ list string ] */ }
             /* [ list string : list string ] */ ;
             IF_CONS
               { SWAP
                 /* [ list string : string : list string ] */ ;
                 DIP { CONS /* [ list string ] */ }
                 /* [ list string : list string ] */ ;
                 PAIR
                 /* [ pair (list string) (list string) ] */ ;
                 LEFT (list string)
                 /* [ or (pair (list string) (list string)) (list string) ] */ }
               { RIGHT
                   (pair (list string) (list string))
                 /* [ or (pair (list string) (list string)) (list string) ] */ } }
         /* [ list string ] */ ;
         NIL operation
         /* [ list operation : list string ] */ ;
         PAIR
         /* [ pair (list operation) (list string) ] */ } }
