
./octez-client --protocol PtLimaPtLMwfNinJi9rCfDPWea8dFgTZ1MeJ9f1m2SRic6ayiwW --mode mockup --no-base-dir-warnings typecheck script tests_python/contracts_015/opcodes/empty_map.tz --details
Well typed
Gas remaining: 1039994.366 units remaining
{ storage (map string string) ;
  parameter unit ;
  code { DROP
         /* [] */ ;
         EMPTY_MAP string string
         /* [ map string string ] */ ;
         PUSH string "world"
         /* [ string : map string string ] */ ;
         SOME
         /* [ option string : map string string ] */ ;
         PUSH string "hello"
         /* [ string : option string : map string string ] */ ;
         UPDATE
         /* [ map string string ] */ ;
         NIL operation
         /* [ list operation : map string string ] */ ;
         PAIR
         /* [ pair (list operation) (map string string) ] */ } }
