
./octez-client --protocol ProtoALphaALphaALphaALphaALphaALphaALphaALphaDdp3zK --mode mockup --no-base-dir-warnings typecheck script tests_python/contracts_alpha/opcodes/ediv_mutez.tz --details
Well typed
Gas remaining: 1039990.621 units remaining
{ parameter (pair mutez (or mutez nat)) ;
  storage (or (option (pair nat mutez)) (option (pair mutez mutez))) ;
  code { CAR
         /* [ pair mutez (or mutez nat) ] */ ;
         UNPAIR
         /* [ mutez : or mutez nat ] */ ;
         SWAP
         /* [ or mutez nat : mutez ] */ ;
         IF_LEFT
           { SWAP
             /* [ mutez : mutez ] */ ;
             EDIV
             /* [ option (pair nat mutez) ] */ ;
             LEFT (option (pair mutez mutez))
             /* [ or (option (pair nat mutez)) (option (pair mutez mutez)) ] */ }
           { SWAP
             /* [ mutez : nat ] */ ;
             EDIV
             /* [ option (pair mutez mutez) ] */ ;
             RIGHT
               (option (pair nat mutez))
             /* [ or (option (pair nat mutez)) (option (pair mutez mutez)) ] */ } ;
         NIL operation
         /* [ list operation : or (option (pair nat mutez)) (option (pair mutez mutez)) ] */ ;
         PAIR
         /* [ pair (list operation) (or (option (pair nat mutez)) (option (pair mutez mutez))) ] */ } }
