
./octez-client --protocol PtLimaPtLMwfNinJi9rCfDPWea8dFgTZ1MeJ9f1m2SRic6ayiwW --mode mockup --no-base-dir-warnings typecheck script tests_python/contracts_015/opcodes/add_timestamp_delta.tz --details
Well typed
Gas remaining: 1039994.398 units remaining
{ parameter (pair timestamp int) ;
  storage (option timestamp) ;
  code { CAR
         /* [ pair timestamp int ] */ ;
         DUP
         /* [ pair timestamp int : pair timestamp int ] */ ;
         CAR
         /* [ timestamp : pair timestamp int ] */ ;
         DIP { CDR /* [ int ] */ }
         /* [ timestamp : int ] */ ;
         ADD
         /* [ timestamp ] */ ;
         SOME
         /* [ option timestamp ] */ ;
         NIL operation
         /* [ list operation : option timestamp ] */ ;
         PAIR
         /* [ pair (list operation) (option timestamp) ] */ } }
