
./octez-client --protocol PtLimaPtLMwfNinJi9rCfDPWea8dFgTZ1MeJ9f1m2SRic6ayiwW --mode mockup --no-base-dir-warnings typecheck script tests_python/contracts_015/opcodes/loop_failwith.tz --details
Well typed
Gas remaining: 1039996.957 units remaining
{ parameter bool ;
  storage unit ;
  code { UNPAIR
         /* [ bool : unit ] */ ;
         LOOP { FAILWITH /* [] */ }
         /* [ unit ] */ ;
         NIL operation
         /* [ list operation : unit ] */ ;
         PAIR
         /* [ pair (list operation) unit ] */ } }
