
./octez-client --protocol PtKathmankSpLLDALzWw7CGD2j2MtyveTwboEYokqUCP4a1LxMg --mode mockup --no-base-dir-warnings typecheck script tests_python/contracts_014/opcodes/self_address_after_fib_view.tz --details
Well typed
Gas remaining: 1039986.567 units remaining
{ parameter address ;
  storage address ;
  code { CAR
         /* [ address ] */ ;
         DUP
         /* [ address : address ] */ ;
         PUSH nat 3
         /* [ nat : address : address ] */ ;
         VIEW "fib" nat
         /* [ option nat : address ] */ ;
         ASSERT_SOME ;
         DROP
         /* [ address ] */ ;
         CONTRACT nat
         /* [ option (contract nat) ] */ ;
         ASSERT_SOME ;
         PUSH mutez 1500
         /* [ mutez : contract nat ] */ ;
         PUSH nat 0
         /* [ nat : mutez : contract nat ] */ ;
         TRANSFER_TOKENS
         /* [ operation ] */ ;
         SELF_ADDRESS
         /* [ address : operation ] */ ;
         SWAP
         /* [ operation : address ] */ ;
         NIL operation
         /* [ list operation : operation : address ] */ ;
         SWAP
         /* [ operation : list operation : address ] */ ;
         CONS
         /* [ list operation : address ] */ ;
         PAIR
         /* [ pair (list operation) address ] */ } }
