
./octez-client --protocol PtKathmankSpLLDALzWw7CGD2j2MtyveTwboEYokqUCP4a1LxMg --mode mockup --no-base-dir-warnings typecheck script tests_python/contracts_014/opcodes/cons.tz --details
Well typed
Gas remaining: 1039997.240 units remaining
{ parameter int ;
  storage (list int) ;
  code { UNPAIR
         /* [ int : list int ] */ ;
         CONS
         /* [ list int ] */ ;
         NIL operation
         /* [ list operation : list int ] */ ;
         PAIR
         /* [ pair (list operation) (list int) ] */ } }
