
./octez-client --protocol PtKathmankSpLLDALzWw7CGD2j2MtyveTwboEYokqUCP4a1LxMg --mode mockup --no-base-dir-warnings typecheck script tests_python/contracts_014/opcodes/map_id.tz --details
Well typed
Gas remaining: 1039997.454 units remaining
{ parameter (map nat nat) ;
  storage (map nat nat) ;
  code { CAR
         /* [ map nat nat ] */ ;
         NIL operation
         /* [ list operation : map nat nat ] */ ;
         PAIR
         /* [ pair (list operation) (map nat nat) ] */ } }
