
./octez-client --protocol PtKathmankSpLLDALzWw7CGD2j2MtyveTwboEYokqUCP4a1LxMg --mode mockup --no-base-dir-warnings typecheck script tests_python/contracts_014/opcodes/unpair.tz --details
Well typed
Gas remaining: 1039904.519 units remaining
{ parameter (unit :param_unit) ;
  storage (unit :u1) ;
  code { DROP
         /* [] */ ;
         UNIT
         /* [ unit ] */ ;
         UNIT
         /* [ unit : unit ] */ ;
         PAIR
         /* [ pair unit unit ] */ ;
         UNPAIR
         /* [ unit : unit ] */ ;
         DROP 2
         /* [] */ ;
         UNIT @b
         /* [ unit ] */ ;
         UNIT @a
         /* [ unit : unit ] */ ;
         PAIR
         /* [ pair unit unit ] */ ;
         UNPAIR @c @d
         /* [ unit : unit ] */ ;
         DROP 2
         /* [] */ ;
         UNIT @b
         /* [ unit ] */ ;
         UNIT @a
         /* [ unit : unit ] */ ;
         PAIR %@ %@
         /* [ pair unit unit ] */ ;
         DUP
         /* [ pair unit unit : pair unit unit ] */ ;
         UNPAIR %a %b
         /* [ unit : unit : pair unit unit ] */ ;
         DROP 2
         /* [ pair unit unit ] */ ;
         DUP
         /* [ pair unit unit : pair unit unit ] */ ;
         UNPAIR % %b
         /* [ unit : unit : pair unit unit ] */ ;
         DROP 2
         /* [ pair unit unit ] */ ;
         DUP
         /* [ pair unit unit : pair unit unit ] */ ;
         UNPAIR %a %
         /* [ unit : unit : pair unit unit ] */ ;
         DROP 2
         /* [ pair unit unit ] */ ;
         DUP
         /* [ pair unit unit : pair unit unit ] */ ;
         UNPAIR % %
         /* [ unit : unit : pair unit unit ] */ ;
         DROP 2
         /* [ pair unit unit ] */ ;
         DUP
         /* [ pair unit unit : pair unit unit ] */ ;
         UNPAIR %a
         /* [ unit : unit : pair unit unit ] */ ;
         DROP 2
         /* [ pair unit unit ] */ ;
         DUP
         /* [ pair unit unit : pair unit unit ] */ ;
         UNPAIR %
         /* [ unit : unit : pair unit unit ] */ ;
         DROP 2
         /* [ pair unit unit ] */ ;
         DUP
         /* [ pair unit unit : pair unit unit ] */ ;
         UNPAIR
         /* [ unit : unit : pair unit unit ] */ ;
         DROP 2
         /* [ pair unit unit ] */ ;
         DUP
         /* [ pair unit unit : pair unit unit ] */ ;
         UNPAIR %a %b @a @b
         /* [ unit : unit : pair unit unit ] */ ;
         DROP 2
         /* [ pair unit unit ] */ ;
         DUP
         /* [ pair unit unit : pair unit unit ] */ ;
         UNPAIR @a @b %a %b
         /* [ unit : unit : pair unit unit ] */ ;
         DROP 2
         /* [ pair unit unit ] */ ;
         DUP
         /* [ pair unit unit : pair unit unit ] */ ;
         UNPAIR @a @% %a %b
         /* [ unit : unit : pair unit unit ] */ ;
         DROP 2
         /* [ pair unit unit ] */ ;
         DUP
         /* [ pair unit unit : pair unit unit ] */ ;
         UNPAIR @% @% %a %b
         /* [ unit : unit : pair unit unit ] */ ;
         DROP 2
         /* [ pair unit unit ] */ ;
         DUP
         /* [ pair unit unit : pair unit unit ] */ ;
         UNPAIR @% @b %a %b
         /* [ unit : unit : pair unit unit ] */ ;
         DROP 2
         /* [ pair unit unit ] */ ;
         DROP
         /* [] */ ;
         UNIT @d
         /* [ unit ] */ ;
         UNIT @c
         /* [ unit : unit ] */ ;
         PAIR %a %b
         /* [ pair unit unit ] */ ;
         DUP
         /* [ pair unit unit : pair unit unit ] */ ;
         UNPAIR %a %b
         /* [ unit : unit : pair unit unit ] */ ;
         DROP 2
         /* [ pair unit unit ] */ ;
         DUP
         /* [ pair unit unit : pair unit unit ] */ ;
         UNPAIR % %b
         /* [ unit : unit : pair unit unit ] */ ;
         DROP 2
         /* [ pair unit unit ] */ ;
         DUP
         /* [ pair unit unit : pair unit unit ] */ ;
         UNPAIR %a %
         /* [ unit : unit : pair unit unit ] */ ;
         DROP 2
         /* [ pair unit unit ] */ ;
         DUP
         /* [ pair unit unit : pair unit unit ] */ ;
         UNPAIR % %
         /* [ unit : unit : pair unit unit ] */ ;
         DROP 2
         /* [ pair unit unit ] */ ;
         DUP
         /* [ pair unit unit : pair unit unit ] */ ;
         UNPAIR %a
         /* [ unit : unit : pair unit unit ] */ ;
         DROP 2
         /* [ pair unit unit ] */ ;
         DUP
         /* [ pair unit unit : pair unit unit ] */ ;
         UNPAIR %
         /* [ unit : unit : pair unit unit ] */ ;
         DROP 2
         /* [ pair unit unit ] */ ;
         DUP
         /* [ pair unit unit : pair unit unit ] */ ;
         UNPAIR
         /* [ unit : unit : pair unit unit ] */ ;
         DROP 2
         /* [ pair unit unit ] */ ;
         DUP
         /* [ pair unit unit : pair unit unit ] */ ;
         UNPAIR %a %b @a @b
         /* [ unit : unit : pair unit unit ] */ ;
         DROP 2
         /* [ pair unit unit ] */ ;
         DUP
         /* [ pair unit unit : pair unit unit ] */ ;
         UNPAIR @a @b %a %b
         /* [ unit : unit : pair unit unit ] */ ;
         DROP 2
         /* [ pair unit unit ] */ ;
         DUP
         /* [ pair unit unit : pair unit unit ] */ ;
         UNPAIR @a @% %a %b
         /* [ unit : unit : pair unit unit ] */ ;
         DROP 2
         /* [ pair unit unit ] */ ;
         DUP
         /* [ pair unit unit : pair unit unit ] */ ;
         UNPAIR @% @% %a %b
         /* [ unit : unit : pair unit unit ] */ ;
         DROP 2
         /* [ pair unit unit ] */ ;
         DUP
         /* [ pair unit unit : pair unit unit ] */ ;
         UNPAIR @% @b %a %b
         /* [ unit : unit : pair unit unit ] */ ;
         DROP 2
         /* [ pair unit unit ] */ ;
         DROP
         /* [] */ ;
         UNIT
         /* [ unit ] */ ;
         UNIT
         /* [ unit : unit ] */ ;
         PAIR %a %b
         /* [ pair unit unit ] */ ;
         DUP
         /* [ pair unit unit : pair unit unit ] */ ;
         UNPAIR %a %b
         /* [ unit : unit : pair unit unit ] */ ;
         DROP 2
         /* [ pair unit unit ] */ ;
         DUP
         /* [ pair unit unit : pair unit unit ] */ ;
         UNPAIR % %b
         /* [ unit : unit : pair unit unit ] */ ;
         DROP 2
         /* [ pair unit unit ] */ ;
         DUP
         /* [ pair unit unit : pair unit unit ] */ ;
         UNPAIR %a %
         /* [ unit : unit : pair unit unit ] */ ;
         DROP 2
         /* [ pair unit unit ] */ ;
         DUP
         /* [ pair unit unit : pair unit unit ] */ ;
         UNPAIR % %
         /* [ unit : unit : pair unit unit ] */ ;
         DROP 2
         /* [ pair unit unit ] */ ;
         DUP
         /* [ pair unit unit : pair unit unit ] */ ;
         UNPAIR %a
         /* [ unit : unit : pair unit unit ] */ ;
         DROP 2
         /* [ pair unit unit ] */ ;
         DUP
         /* [ pair unit unit : pair unit unit ] */ ;
         UNPAIR %
         /* [ unit : unit : pair unit unit ] */ ;
         DROP 2
         /* [ pair unit unit ] */ ;
         DUP
         /* [ pair unit unit : pair unit unit ] */ ;
         UNPAIR
         /* [ unit : unit : pair unit unit ] */ ;
         DROP 2
         /* [ pair unit unit ] */ ;
         DUP
         /* [ pair unit unit : pair unit unit ] */ ;
         UNPAIR %a %b @a @b
         /* [ unit : unit : pair unit unit ] */ ;
         DROP 2
         /* [ pair unit unit ] */ ;
         DUP
         /* [ pair unit unit : pair unit unit ] */ ;
         UNPAIR @a @b %a %b
         /* [ unit : unit : pair unit unit ] */ ;
         DROP 2
         /* [ pair unit unit ] */ ;
         DUP
         /* [ pair unit unit : pair unit unit ] */ ;
         UNPAIR @a @% %a %b
         /* [ unit : unit : pair unit unit ] */ ;
         DROP 2
         /* [ pair unit unit ] */ ;
         DUP
         /* [ pair unit unit : pair unit unit ] */ ;
         UNPAIR @% @% %a %b
         /* [ unit : unit : pair unit unit ] */ ;
         DROP 2
         /* [ pair unit unit ] */ ;
         DUP
         /* [ pair unit unit : pair unit unit ] */ ;
         UNPAIR @% @b %a %b
         /* [ unit : unit : pair unit unit ] */ ;
         DROP 2
         /* [ pair unit unit ] */ ;
         DROP
         /* [] */ ;
         UNIT
         /* [ unit ] */ ;
         UNIT
         /* [ unit : unit ] */ ;
         PAIR %a %b @p
         /* [ pair unit unit ] */ ;
         DUP
         /* [ pair unit unit : pair unit unit ] */ ;
         UNPAIR @%% @b
         /* [ unit : unit : pair unit unit ] */ ;
         DROP 2
         /* [ pair unit unit ] */ ;
         DUP
         /* [ pair unit unit : pair unit unit ] */ ;
         UNPAIR @a @%%
         /* [ unit : unit : pair unit unit ] */ ;
         DROP 2
         /* [ pair unit unit ] */ ;
         DUP
         /* [ pair unit unit : pair unit unit ] */ ;
         UNPAIR @%% @%%
         /* [ unit : unit : pair unit unit ] */ ;
         DROP 2
         /* [ pair unit unit ] */ ;
         DUP
         /* [ pair unit unit : pair unit unit ] */ ;
         UNPAIR @% @%%
         /* [ unit : unit : pair unit unit ] */ ;
         DROP 2
         /* [ pair unit unit ] */ ;
         DUP
         /* [ pair unit unit : pair unit unit ] */ ;
         UNPAIR @%% @%
         /* [ unit : unit : pair unit unit ] */ ;
         DROP 2
         /* [ pair unit unit ] */ ;
         DROP
         /* [] */ ;
         UNIT @b
         /* [ unit ] */ ;
         UNIT @a
         /* [ unit : unit ] */ ;
         PAIR @c
         /* [ pair unit unit ] */ ;
         UNPAIR @b @a
         /* [ unit : unit ] */ ;
         DROP 2
         /* [] */ ;
         UNIT
         /* [ unit ] */ ;
         NIL operation
         /* [ list operation : unit ] */ ;
         PAIR
         /* [ pair (list operation) unit ] */ } }
