
./octez-client --protocol ProtoALphaALphaALphaALphaALphaALphaALphaALphaDdp3zK --mode mockup --no-base-dir-warnings typecheck script tests_python/contracts_alpha/mini_scenarios/ticket_builder_fungible.tz --details
Well typed
Gas remaining: 1039974.006 units remaining
{ parameter
    (or (ticket %burn unit)
        (pair %mint (contract %destination (ticket unit)) (nat %amount))) ;
  storage address ;
  code { AMOUNT
         /* [ mutez
            : pair (or (ticket unit) (pair (contract (ticket unit)) nat)) address ] */ ;
         PUSH mutez
              0
         /* [ mutez : mutez
            : pair (or (ticket unit) (pair (contract (ticket unit)) nat)) address ] */ ;
         ASSERT_CMPEQ ;
         UNPAIR
         /* [ or (ticket unit) (pair (contract (ticket unit)) nat) : address ] */ ;
         IF_LEFT
           { READ_TICKET
             /* [ pair address unit nat : ticket unit : address ] */ ;
             CAR
             /* [ address : ticket unit : address ] */ ;
             SELF_ADDRESS
             /* [ address : address : ticket unit : address ] */ ;
             ASSERT_CMPEQ ;
             DROP
             /* [ address ] */ ;
             NIL operation
             /* [ list operation : address ] */ }
           { DUP @manager 2
             /* [ address : pair (contract (ticket unit)) nat : address ] */ ;
             SENDER
             /* [ address : address : pair (contract (ticket unit)) nat : address ] */ ;
             ASSERT_CMPEQ ;
             UNPAIR
             /* [ contract (ticket unit) : nat : address ] */ ;
             SWAP
             /* [ nat : contract (ticket unit) : address ] */ ;
             UNIT
             /* [ unit : nat : contract (ticket unit) : address ] */ ;
             TICKET
             /* [ option (ticket unit) : contract (ticket unit) : address ] */ ;
             ASSERT_SOME ;
             PUSH mutez 0
             /* [ mutez : ticket unit : contract (ticket unit) : address ] */ ;
             SWAP
             /* [ ticket unit : mutez : contract (ticket unit) : address ] */ ;
             TRANSFER_TOKENS
             /* [ operation : address ] */ ;
             NIL operation
             /* [ list operation : operation : address ] */ ;
             SWAP
             /* [ operation : list operation : address ] */ ;
             CONS
             /* [ list operation : address ] */ } ;
         PAIR
         /* [ pair (list operation) address ] */ } }
