
./octez-client --protocol ProtoALphaALphaALphaALphaALphaALphaALphaALphaDdp3zK --mode mockup --no-base-dir-warnings typecheck script tests_python/contracts_alpha/opcodes/reverse_loop.tz --details
Well typed
Gas remaining: 1039990.243 units remaining
{ parameter (list string) ;
  storage (list string) ;
  code { CAR
         /* [ list string ] */ ;
         NIL string
         /* [ list string : list string ] */ ;
         SWAP
         /* [ list string : list string ] */ ;
         PUSH bool True
         /* [ bool : list string : list string ] */ ;
         LOOP { IF_CONS
                  { SWAP
                    /* [ list string : string : list string ] */ ;
                    DIP { CONS /* [ list string ] */ }
                    /* [ list string : list string ] */ ;
                    PUSH bool True
                    /* [ bool : list string : list string ] */ }
                  { NIL string
                    /* [ list string : list string ] */ ;
                    PUSH bool False
                    /* [ bool : list string : list string ] */ } }
         /* [ list string : list string ] */ ;
         DROP
         /* [ list string ] */ ;
         NIL operation
         /* [ list operation : list string ] */ ;
         PAIR
         /* [ pair (list operation) (list string) ] */ } }
