(12782.215982290563, 'Index', '2c3446263cd8d990c71ed8dd1fcc02d27c84efd79980116518f15d37d2275a6e', 'http://lns.geopher.com/location.html', <location href="http://lns.geopher.com/location.html" lat="0.00000000" lon="0.00000000" name="Index">Index</location>, '0.00000000', '0.00000000', '37.42242500', '-122.08755550')
(18480.74462715278, 'Aamot Software', '8e6092c77a7d9b88b1bbd977474c9b71e3db504c1f5bc87d23f4a82a3df85f35', 'https://www.aamotsoftware.com/location.html', <location href="https://www.aamotsoftware.com/location.html" lat="59.929196399999995" lon="10.7901335" name="Aamot Software">\n<p><a href="https://www.aamotsoftware.com/">Aamot Software</a><br/>\n\tOslo, Norway</p>\n</location>, '59.929196399999995', '10.7901335', '37.42242500', '-122.08755550')
(10771.751445411954, 'Google, Inc.', '8e6092c77a7d9b88b1bbd977474c9b71e3db504c1f5bc87d23f4a82a3df85f35', 'https://www.google.com/', <location href="https://www.google.com/" lat="37.4219999" lon="-122.0862462" name="Google, Inc.">\n<p><a href="https://www.google.com/">Google, Inc.</a><br/>\n\t1600 Amphitheatre Pkwy<br/>\n\tMountain View<br/>\n\tCA 94043<br/>\n\tUnited States</p>\n</location>, '37.4219999', '-122.0862462', '37.42242500', '-122.08755550')
(12991.80391983702, 'Vivaldi', '8e6092c77a7d9b88b1bbd977474c9b71e3db504c1f5bc87d23f4a82a3df85f35', 'https://www.vivaldi.com/', <location href="https://www.vivaldi.com/" lat="42.5779373" lon="-70.7142551" name="Vivaldi">\n<p><a href="https://www.vivaldi.com/">Vivaldi Technology AS</a><br/>\n\tInnovation House<br/>\n\t18 Norman Ave<br/>\n\tGloucester MA 01930<br/>\n\tUnited States</p>\n</location>, '42.5779373', '-70.7142551', '37.42242500', '-122.08755550')
