%YAML 1.1
%TAG !u! tag:unity3d.com,2011:
--- !u!1045 &1
EditorBuildSettings:
  m_ObjectHideFlags: 0
  serializedVersion: 2
  m_Scenes:
  - enabled: 1
    path: Assets/Scenes/MainMenu.unity
    guid: 37d933615ff0cf9489ad5338daf7c164
  - enabled: 1
    path: Assets/Scenes/Level1.unity
    guid: 8263419cab84a2543abbe49e36c4bda4
  - enabled: 1
    path: Assets/Scenes/Level2.unity
    guid: 6d1fa9c9f4f78784195484e17dde62cc
  - enabled: 1
    path: Assets/Scenes/Level3.unity
    guid: 400edb67a9a592849be687a123470a76
  - enabled: 1
    path: Assets/Scenes/Level4.unity
    guid: f91061295124f76448b6fd824a778690
  - enabled: 1
    path: Assets/Scenes/Level5.unity
    guid: 154e37617e87db3438130e57bbe81cdb
  - enabled: 1
    path: Assets/Scenes/WIN.unity
    guid: bbb91b51b0376e64fa9edba94f1aac29
  - enabled: 0
    path: Assets/Scenes/Test Level.unity
    guid: 2cda990e2423bbf4892e6590ba056729
  m_configObjects: {}
