%YAML 1.1
%TAG !u! tag:unity3d.com,2011:
--- !u!162 &1
EditorUserSettings:
  m_ObjectHideFlags: 0
  serializedVersion: 4
  m_ConfigSettings:
    RecentlyUsedSceneGuid-0:
      value: 5b04055f57045b0b0f0c597141265a44174f407d7a7d7e367f2f4d67e0b63261
      flags: 0
    RecentlyUsedSceneGuid-1:
      value: 5204000356025f0a5a0b547514210c44454f49797c2d73672f2b186bb3e3303a
      flags: 0
    RecentlyUsedSceneGuid-2:
      value: 5b030255510450580c0c547611710a4445161a28297c7f357e7f1e67e0e4356c
      flags: 0
    RecentlyUsedSceneGuid-3:
      value: 0153565f54575c0a0f5e5f75462609441016412f282a2769792f4c32e3e36661
      flags: 0
    RecentlyUsedSceneGuid-4:
      value: 515250075c0c595e5f5a5e71122159444e4e4a2f7a7d7f602f284d66b4b76661
      flags: 0
    RecentlyUsedSceneGuid-5:
      value: 0508055653045b02585f5e7616740944424f1a7c2a2c7e6279284a64bab66d68
      flags: 0
    RecentlyUsedSceneGuid-6:
      value: 5701040301575f0c0c570d77497107444f151d7c747f27617f7a4964b2e1636e
      flags: 0
    RecentlyUsedSceneGuid-7:
      value: 55550500040c0a020b5a0a7548740744474e4d7e747c23617a2d1936b4b2373b
      flags: 0
    RecentlyUsedSceneGuid-8:
      value: 5006505f56065f0a58080a72132506444e4e192e797b756829281b64e1b1626c
      flags: 0
    vcSharedLogLevel:
      value: 0d5e400f0650
      flags: 0
  m_VCAutomaticAdd: 1
  m_VCDebugCom: 0
  m_VCDebugCmd: 0
  m_VCDebugOut: 0
  m_SemanticMergeMode: 2
  m_DesiredImportWorkerCount: 3
  m_StandbyImportWorkerCount: 2
  m_IdleImportWorkerShutdownDelay: 60000
  m_VCShowFailedCheckout: 1
  m_VCOverwriteFailedCheckoutAssets: 1
  m_VCProjectOverlayIcons: 1
  m_VCHierarchyOverlayIcons: 1
  m_VCOtherOverlayIcons: 1
  m_VCAllowAsyncUpdate: 1
  m_ArtifactGarbageCollection: 1
