C:\Users\olan\- Olans Stuff\07 Projects\bank-management-system\src\main\java\bank\project\olan\data\Accounts.java
C:\Users\olan\- Olans Stuff\07 Projects\bank-management-system\src\main\java\bank\project\olan\cli\BankInterface.java
C:\Users\olan\- Olans Stuff\07 Projects\bank-management-system\src\main\java\bank\project\olan\data\Data.java
C:\Users\olan\- Olans Stuff\07 Projects\bank-management-system\src\main\java\bank\project\olan\cli\BankInterfaceSetup.java
C:\Users\olan\- Olans Stuff\07 Projects\bank-management-system\src\main\java\bank\project\olan\data\Transactions.java
