// Jest Snapshot v1, https://goo.gl/fbAQLP

exports[`<Loader> Renders correctly with defaults 1`] = `
<div
  style={
    Object {
      "height": 100,
      "width": 100,
    }
  }
>
  <img
    src="loading.svg"
  />
</div>
`;

exports[`<Loader> Renders correctly with size props 1`] = `
<div
  style={
    Object {
      "height": 150,
      "width": 150,
    }
  }
>
  <img
    src="loading.svg"
  />
</div>
`;
