{
    "hosting": {
        "public": "functions",
        "rewrites": [{
            "source": "/webhook",
            "function": "app"
        }],
        "ignore": [
            "firebase.json",
            "**/.*",
            "**/node_modules/**"
        ]
    },
    "database": {
        "rules": "database.rules.json"
    }
}
