<!DOCTYPE html PUBLIC "-//W3C//DTD HTML 4.0 Transitional//EN" "http://www.w3.org/TR/REC-html40/loose.dtd">
<html><body>
<b>some</b> rich text<br/><br/><table class="pimcore_debug_information">
                                    <tr><th colspan="2">Debug information</th></tr><tr><td class="pimcore_label_column">From:</td><td>noreply@avrist-home.alfabeta.co.id (Ryan Kurniawan)</td></tr><tr><td class="pimcore_label_column">To: </td><td>mkemalw@gmail.com, ryankurniawanrk2012@gmail.com</td></tr></table></body></html>