{
  "consumer": {
    "name": "consumer"
  },
  "provider": {
    "name": "provider"
  },
  "interactions": [
    {
      "description": "get all todos",
      "providerState": "todo exists",
      "request": {
        "method": "GET",
        "path": "/api"
      },
      "response": {
        "status": 200,
        "headers": {
          "Content-Type": "application/json; charset=utf-8"
        },
        "body": [
          {
            "text": "Movie 1"
          }
        ],
        "matchingRules": {
          "$.body": {
            "min": 1
          },
          "$.body[*].*": {
            "match": "type"
          },
          "$.body[*].text": {
            "match": "type"
          }
        }
      }
    }
  ],
  "metadata": {
    "pactSpecification": {
      "version": "2.0.0"
    }
  }
}