@startuml
hide footbox
actor User as "User with xcDOT\non Astar"
control Contract
database Pool as "LS Pool on Relay Chain"

User -> Contract: Stake()
User --> Contract: Contract transfers xcDOT from user (Astar)
Contract --> User: Contract transfers lDOT to user (Astar)
Contract --> Pool: Contract transfers DOT to Pool (Relay Chain)
@enduml
