{
	"info": {
		"_postman_id": "1f606f32-d6c5-431d-b25d-11fe6fd0bc2a",
		"name": "Node.js Activity 1",
		"schema": "https://schema.getpostman.com/json/collection/v2.1.0/collection.json"
	},
	"item": [
		{
			"name": "GET all users",
			"request": {
				"method": "GET",
				"header": [],
				"url": {
					"raw": "http://localhost:4000/api/users",
					"protocol": "http",
					"host": [
						"localhost"
					],
					"port": "4000",
					"path": [
						"api",
						"users"
					]
				}
			},
			"response": []
		},
		{
			"name": "GET specific user",
			"request": {
				"method": "GET",
				"header": [],
				"url": {
					"raw": "http://localhost:4000/api/users/123",
					"protocol": "http",
					"host": [
						"localhost"
					],
					"port": "4000",
					"path": [
						"api",
						"users",
						"123"
					]
				}
			},
			"response": []
		},
		{
			"name": "PUT specific user",
			"request": {
				"method": "PUT",
				"header": [],
				"url": {
					"raw": "http://localhost:4000/api/users/123",
					"protocol": "http",
					"host": [
						"localhost"
					],
					"port": "4000",
					"path": [
						"api",
						"users",
						"123"
					]
				}
			},
			"response": []
		},
		{
			"name": "DELETE specific user",
			"request": {
				"method": "DELETE",
				"header": [],
				"url": {
					"raw": "http://localhost:4000/api/users/123",
					"protocol": "http",
					"host": [
						"localhost"
					],
					"port": "4000",
					"path": [
						"api",
						"users",
						"123"
					]
				}
			},
			"response": []
		},
		{
			"name": "POST new user",
			"request": {
				"method": "GET",
				"header": []
			},
			"response": []
		}
	]
}