Shelter,Animal ID#,Intake Date,Intake Type,Intake Condition,Animal Type,Group,Breed 1,Breed 2
N CENTRA,A0270930,08/09/2011,OWNER SUR,ALIVE,DOG,SHEPHERD,GERM SHEPHERD,MIX
W VALLEY,A0272469,09/27/2011,OWNER SUR,LOST,DOG,SHEPHERD,GERM SHEPHERD,MIX
S LA,A0272691,01/25/2011,OWNER SUR,ALIVE,DOG,POODLE,POODLE STND,MIX
W LA,A0276685,05/23/2011,POS OWNER,ALIVE,DOG,SPANIEL,COCKER SPAN,
S LA,A0065002,09/11/2011,OWNER SUR,LOST,DOG,,STAFF TERRIE,MIX
N CENTRA,A0138937,05/26/2012,OWNER SUR,ALIVE,DOG,SPITZ,CHOW CHOW,
W VALLEY,A0191077,03/12/2011,OWNER SUR,LOST,DOG,SHEPHERD,GERM SHEPHERD,MIX
W LA,A0191196,03/11/2013,STRAY,ALIVE,DOG,SPANIEL,COCKER SPAN,POODLE MIN
N CENTRA,A0191772,04/20/2011,POS OWNER,ALIVE,DOG,SPANIEL,ENG SPRNGR SPAN,MIX
N CENTRA,A0191772,06/15/2011,POS OWNER,ALIVE,DOG,SPANIEL,ENG SPRNGR SPAN,MIX
N CENTRA,A0193478,05/29/2012,OWNER SUR,LOST,DOG,SHEPHERD,GERM SHEPHERD,MIX
N CENTRA,A0198859,06/10/2013,OWNER SUR,LOST,DOG,SETTER/RETRIEVE,LABRADOR RETR,MIX
W VALLEY,A0200576,09/10/2012,OWNER SUR,ALIVE,DOG,TERRIER,TERRIER MIX,MIX
S LA,A0258688,08/26/2011,OWNER SUR,LOST,DOG,MASTIFF,STAFFORDSHIRE,
S LA,A0259297,05/30/2013,OWNER SUR,ALIVE,DOG,SETTER/RETRIEVE,LABRADOR RETR,MIX
S LA,A0259346,02/03/2011,OWNER SUR,ALIVE,DOG,SETTER/RETRIEVE,LABRADOR RETR,
W VALLEY,A0259674,01/22/2013,OWNER SUR,LOST,DOG,TOY,CHIHUAHUA SH,MIX
S LA,A0261820,05/13/2013,OWNER SUR,LOST,DOG,,TERRIER X,MIX
E VALLEY,A0264059,02/19/2012,OWNER SUR,LOST,DOG,TOY,DACHSHUND WH,MIX
E VALLEY,A0264106,11/10/2011,STRAY,LOST,DOG,MASTIFF,ROTTWEILER,
S LA,A0203351,02/14/2011,OWNER SUR,LOST,DOG,SETTER/RETRIEVE,GOLDEN RETR,MIX
S LA,A0203560,12/01/2011,OWNER SUR,ALIVE,DOG,SHEPHERD,GERM SHEPHERD,MIX
S LA,A0203708,10/29/2011,OWNER SUR,ALIVE,DOG,TERRIER,TERRIER,MIX
E VALLEY,A0203801,10/23/2011,OWNER SUR,ALIVE,DOG,TERRIER,TERRIER MIX,
E VALLEY,A0207171,12/11/2012,OWNER SUR,ALIVE,DOG,SHEPHERD,GERM SHEPHERD,MIX
W VALLEY,A0210690,06/28/2012,STRAY,ALIVE,DOG,SETTER/RETRIEVE,LABRADOR RETR,MIX
W LA,A0212458,02/08/2011,POS OWNER,ALIVE,DOG,SPANIEL,ENG COCKER SPAN,MIX
HARBOR,A0243086,08/31/2011,OWNER SUR,ALIVE,DOG,SETTER/RETRIEVE,GOLDEN RETR,
HARBOR,A0246446,01/31/2011,OWNER SUR,LOST,DOG,POODLE,POODLE MIN,
E VALLEY,A0249404,09/20/2012,OWNER SUR,LOST,DOG,COLLIE,AUST SHEPHERD,MIX
S LA,A0249596,03/03/2011,OWNER SUR,ALIVE,DOG,,GERMAN SHEP,MIX
W VALLEY,A0249598,05/05/2011,OWNER SUR,LOST,DOG,,ROTTWEILER,MIX
N CENTRA,A0252232,09/14/2012,OWNER SUR,ALIVE,DOG,SETTER/RETRIEVE,LABRADOR RETR,MIX
HARBOR,A0281087,03/15/2013,OWNER SUR,LOST,DOG,,GERMAN SHEP,
HARBOR,A0281424,02/03/2011,OWNER SUR,LOST,DOG,MASTIFF,PIT BULL,
HARBOR,A0282584,12/30/2012,OWNER SUR,LOST,DOG,MASTIFF,PIT BULL,
E VALLEY,A0078396,02/17/2011,OWNER SUR,ALIVE,DOG,SETTER/RETRIEVE,LABRADOR RETR,MIX
E VALLEY,A0122656,08/28/2011,OWNER SUR,LOST,DOG,TOY,DACHSHUND SMH,
S LA,A0133303,09/15/2011,OWNER SUR,ALIVE,DOG,SHEPHERD,GERM SHEPHERD,MIX
W VALLEY,A0181290,11/24/2012,POS OWNER,ALIVE,DOG,,LABRADOR RET,MIX
HARBOR,A0185170,10/01/2011,POS OWNER,ALIVE,DOG,TOY,PEKINGESE,
S LA,A0186871,10/20/2011,OWNER SUR,ALIVE,DOG,TERRIER,YORKSHIRE TERR,MIX
N CENTRA,A0187660,08/28/2011,OWNER SUR,ALIVE,DOG,SPANIEL,COCKER SPAN,MIX
W VALLEY,A0188816,01/27/2012,OWNER SUR,LOST,DOG,POODLE,CURLYCOAT RETR,
W VALLEY,A0229255,05/06/2012,OWNER SUR,LOST,DOG,TOY,CHIHUAHUA SH,
W LA,A0232283,08/17/2011,OWNER SUR,ALIVE,DOG,MASTIFF,ROTTWEILER,
N CENTRA,A0238563,08/18/2011,POS OWNER,ALIVE,DOG,SETTER/RETRIEVE,LABRADOR RETR,GERM SHEPHERD
N CENTRA,A0238563,08/19/2011,OWNER SUR,ALIVE,DOG,SETTER/RETRIEVE,LABRADOR RETR,GERM SHEPHERD
E VALLEY,A0240667,06/05/2012,OWNER SUR,ALIVE,DOG,SPANIEL,COCKER SPAN,MIX
S LA,A0294506,11/26/2011,OWNER SUR,LOST,DOG,SPANIEL,COCKER SPAN,MIX
S LA,A0295129,03/23/2011,OWNER SUR,ALIVE,DOG,SIGHTHOUND,GREYHOUND,
N CENTRA,A0295947,11/14/2012,OWNER SUR,ALIVE,DOG,COLLIE,AUST CATTLE DOG,MIX
S LA,A0123495,06/21/2011,OWNER SUR,LOST,DOG,SHEPHERD,GERM SHEPHERD,MIX
S LA,A0133409,05/11/2011,OWNER SUR,LOST,DOG,SETTER/RETRIEVE,LABRADOR RETR,MIX
S LA,A0177169,06/07/2012,OWNER SUR,LOST,DOG,SHEPHERD,GERM SHEPHERD,
E VALLEY,A0181694,05/28/2012,POS OWNER,ALIVE,DOG,SHEPHERD,GERM SHEPHERD,
S LA,A0183846,06/18/2012,PERS PROP,ALIVE,DOG,SETTER/RETRIEVE,LABRADOR RETR,MIX
HARBOR,A0184976,01/29/2011,OWNER SUR,LOST,DOG,SHEPHERD,GERM SHEPHERD,MIX
S LA,A0186780,03/27/2011,OWNER SUR,ALIVE,DOG,SHEPHERD,GERM SHEPHERD,MIX
W VALLEY,A0228600,08/07/2011,OWNER SUR,LOST,DOG,,LABRADOR RET,MIX
N CENTRA,A0230863,08/09/2012,OWNER SUR,LOST,DOG,HOUND,BEAGLE,
N CENTRA,A0230864,06/13/2013,OWNER SUR,LOST,DOG,TERRIER,TERRIER MIX,MIX
N CENTRA,A0231065,02/14/2012,OWNER SUR,ALIVE,DOG,SPITZ,CHOW CHOW,MIX
N CENTRA,A0231110,06/29/2013,OWNER SUR,LOST,DOG,SETTER/RETRIEVE,LABRADOR RETR,MIX
N CENTRA,A0231481,03/22/2011,OWNER SUR,LOST,DOG,POINTER,DALMATIAN,
E VALLEY,A0232056,09/02/2012,OWNER SUR,LOST,DOG,SPITZ,CHOW CHOW,MIX
W VALLEY,A0233040,01/28/2013,OWNER SUR,LOST,DOG,SETTER/RETRIEVE,GOLDEN RETR,
W LA,A0236158,09/17/2013,OWNER SUR,ALIVE,DOG,SPITZ,CHOW CHOW,MIX
HARBOR,A0052405,10/13/2013,OWNER SUR,LOST,DOG,,SPANIEL X,MIX
N CENTRA,A0053081,07/13/2012,OWNER SUR,ALIVE,DOG,COLLIE,AUST SHEPHERD,MIX
N CENTRA,A0054674,04/29/2011,OWNER SUR,ALIVE,CAT,SHORTHAIR,DOMESTIC SH,
W VALLEY,A0121431,01/14/2011,OWNER SUR,LOST,DOG,TERRIER,TERRIER MIX,MIX
S LA,A0168046,02/07/2012,OWNER SUR,ALIVE,DOG,SHEPHERD,GERM SHEPHERD,MIX
W VALLEY,A0173206,02/06/2012,OWNER SUR,LOST,DOG,TOY,LHASA APSO,MIX
N CENTRA,A0215901,01/29/2011,OWNER SUR,LOST,DOG,TERRIER,TERRIER MIX,MIX
S LA,A0218335,03/20/2012,OWNER SUR,LOST,DOG,MASTIFF,BOXER,MIX
S LA,A0218676,10/26/2013,OWNER SUR,LOST,DOG,,TERRIER X,MIX
S LA,A0219004,08/16/2011,OWNER SUR,ALIVE,DOG,HOUND,BEAGLE,MIX
S LA,A0219054,04/10/2012,OWNER SUR,LOST,DOG,SHEPHERD,WELSH CORGI PEM,MIX
S LA,A0219094,04/16/2011,OWNER SUR,ALIVE,DOG,MASTIFF,STAFFORDSHIRE,MIX
S LA,A0219395,01/02/2011,OWNER SUR,ALIVE,DOG,SHEPHERD,GERM SHEPHERD,MIX
E VALLEY,A0221186,05/21/2012,OWNER SUR,ALIVE,DOG,,AMER COCKER,MIX
N CENTRA,A0221473,06/30/2013,POS OWNER,ALIVE,DOG,,COCKAPOO,MIX
HARBOR,A0222274,07/07/2012,OWNER SUR,LOST,DOG,TOY,CHIHUAHUA SH,
HARBOR,A0222779,02/15/2011,OWNER SUR,LOST,DOG,SHEPHERD,GERM SHEPHERD,MIX
W VALLEY,A0223752,10/04/2012,OWNER SUR,LOST,DOG,TOY,CHIHUAHUA SH,
E VALLEY,A0227348,07/29/2013,OWNER SUR,LOST,DOG,,BEAGLE,MIX
E VALLEY,A0227933,08/15/2013,OWNER SUR,LOST,DOG,MASTIFF,STAFFORDSHIRE,MIX
N CENTRA,A0268630,07/10/2012,OWNER SUR,ALIVE,DOG,,DALMATIAN,
S LA,A0270294,05/18/2011,OWNER SUR,ALIVE,DOG,POINTER,DALMATIAN,MIX
W VALLEY,A0270570,05/26/2012,POS OWNER,ALIVE,DOG,,TERRIER X,MIX
W VALLEY,A0274990,03/11/2011,POS OWNER,ALIVE,DOG,SHEPHERD,GERM SHEPHERD,MIX
N CENTRA,A0276006,01/22/2011,POS OWNER,ALIVE,DOG,COLLIE,BORDER COLLIE,
N CENTRA,A0276586,01/25/2011,OWNER SUR,ALIVE,DOG,MASTIFF,AMERICAN STAFF,
HARBOR,A0009893,11/09/2011,OWNER SUR,ALIVE,DOG,SPITZ,SIBERIAN HUSKY,MIX
S LA,A0155078,05/12/2011,OWNER SUR,ALIVE,DOG,SPITZ,JINDO,MIX
N CENTRA,A0158737,04/10/2012,STRAY,ALIVE,DOG,SPITZ,CHOW CHOW,MIX
HARBOR,A0202889,10/11/2012,OWNER SUR,ALIVE,DOG,SPITZ,CHOW CHOW,MIX
E VALLEY,A0204896,09/30/2011,POS OWNER,ALIVE,DOG,TOY,CHIHUAHUA SH,MIX
