
SUMMARY
--------------------------------------------------------------------------------
TICKET    NAME                          ENQUEUE   BOARD     ARRIVE    SEAT      
--------------------------------------------------------------------------------
