!PADS-POWERPCB-V4.0-METRIC! DESIGN DATABASE ASCII FILE 1.0
*REMARK* PXCT                                    Revised: Monday, July 26, 2021
*REMARK* K:\WORK\ORCAD\PXCT\PXCT-A0-1.DSN        Revision: A0
*REMARK* INCAA Computers BV
*REMARK* Puttenstein 20
*REMARK* 7339 BD Apeldoorn
*REMARK* The Netherlands
*REMARK* 

*PART*
*REMARK* Ref PCBfootprint/Value
C10 0402
C11 0402
C12 0402
C13 0402
C14 0402
C15 0402
C16 0402
C17 0402
C18 0402
C19 0402
C2 0402
C20 0402
C21 0402
C22 0402
C23 0402
C24 0402
C25 0402
C26 0402
C5 0603
C51 0603
C52 0603
C53 0402
C54 0603
C55 0402
C56 0402
C57 0402
C58 0402
C59 0402
C6 0603
C60 0402
C61 0402
C62 0402
C63 0603
C64 0603
C65 0402
C66 0402
C67 0402
C68 0402
C69 0402
C7 0402
C70 0402
C71 0402
C72 0402
C73 0402
C74 0402
C75 0402
C76 0402
C77 0402
C78 0402
C79 0402
C80 0603
C81 0603
C82 0402
D1 0402
D2 SOD323
D3 SOD323
D4 SOD323
DS1 LED\SMD\1.5\RA
DS2 LED\SMD\1.5\RA\B
FD1 FIDUCIAL
FD2 FIDUCIAL
FD3 FIDUCIAL
H2 MTBRACKET/METAL/A
H4 KM6-RF/3U
J1 DB9-HF
MH1 CPCI_ESD_STRIP
MH2 MTHOLE27W
MH3 MTHOLE27W
MH4 CPCI_ESD_STRIP
N1 ASSEMBLYNOTE
P1 TC2030-MCP
P2 SMB/M/4CM
Q1 SOT23
R1 0603
R2 0603
R3 0603
R4 0603
R47 0402
R48 0402
R49 0402
R5 0603
R50 0402
R51 0402
R52 0402
R53 0402
R54 0402
R55 0402
R56 0402
R57 0402
R58 0402
R59 0402
R60 0402
R61 0402
R62 0402
R63 0402
R64 0402
R65 0402
R66 0402
R67 0402
R68 0402
R69 0402
R70 0402
R71 0402
R72 0402
R73 1218
R74 0402
R75 0402
R76 0402
R77 0402
R78 1218
R79 0402
R80 0402
R81 0402
R82 0402
R83 0402
R84 0402
R85 0402
R86 0402
R87 0402
R88 0402
TJ1 CPCIE-XJ3
TJ2 CPCIE-XJ3
TP1 TESTPOINT_S1751
TP2 TESTVIA
U10 SSOP20
U11 SSOP20
U12 SSOP20
U13 SSOP20
U14 SSOP20
U15 SOT23-6
U16 SOT23-6
U2 SOPT40X640-48
U22 D2PAK5
U23 QFPS12X12-80
U24 TSSOP16
U25 SOT23-6
U26 SO8
U27 SO8
U28 SOT23-6
U29 SO8
U5 TSSOP14
U6 TSSOP14
U7 TSSOP14
U8 TSSOP14
U9 TSSOP14
XJ4 CPCIE-XJ4
Y1 OSC4-32X25

*NET*
*SIGNAL* +12V
XJ4.A3 XJ4.B3 C53.1 C51.1 U22.2 U22.1 C52.1 
*SIGNAL* +3.3V
U24.16 C81.1 U29.1 U29.8 C80.1 C79.1 U28.1 U25.6 
C72.1 R55.1 P1.1 R56.2 C58.1 C57.1 C59.1 C60.1 
R64.2 DS2.1 R58.2 U23.10 U23.8 U23.21 U23.42 U23.56 
U23.77 U23.34 U23.67 U23.16 C61.1 R66.2 R57.2 C55.1 
C56.1 C62.1 R52.2 R53.2 C5.1 XJ4.C4 XJ4.D4 XJ4.E4 
R51.2 C6.1 R50.2 R49.2 C7.1 C2.1 U2.15 U6.14 
C14.1 U7.14 C11.1 U5.14 C13.1 U15.5 U8.14 C10.1 
U9.14 C25.1 C12.1 U12.10 U12.13 U12.18 C21.1 C18.1 
C15.1 C17.1 C19.1 U13.10 U13.13 U13.18 U10.10 U10.13 
U10.18 C16.1 U14.10 U14.13 U14.18 C22.1 C23.1 U16.5 
C26.1 C24.1 C20.1 U11.10 U11.13 U11.18 R86.2 
*SIGNAL* +5V
C74.1 D2.1 C77.1 C76.1 U28.6 C78.1 U25.1 C75.1 
U27.8 R70.2 C73.1 U26.7 R47.2 C54.1 U22.4 
*SIGNAL* 5VAUX
XJ4.A2 
*SIGNAL* ADC_MISO
U29.6 U23.46 
*SIGNAL* ADC_SCLK
U29.7 U23.47 
*SIGNAL* ADC_SS_N
U29.5 U23.48 
*SIGNAL* CHASSIS
MH1.1 MH4.1 R1.1 R4.1 R5.1 J1.10 J1.11 C71.2 
*SIGNAL* CLK10
U2.12 U15.3 U16.3 
*SIGNAL* DSTAR
U12.4 U13.4 U10.4 U14.4 U16.4 U11.4 
*SIGNAL* DSTAR_OUT
U23.35 U16.1 
*SIGNAL* DSTAR_SEL
U23.36 U16.6 R85.1 
*SIGNAL* GA0
U23.64 U2.2 
*SIGNAL* GA1
U23.63 U2.3 
*SIGNAL* GA2
U23.62 U2.4 
*SIGNAL* GA3
U23.61 U2.5 
*SIGNAL* GA4
U23.39 U2.6 
*SIGNAL* GND
R2.2 R3.2 R5.2 TP1.1 U24.10 U24.8 U24.15 C70.2 
J1.5 C69.2 D4.2 D3.2 C81.2 D1.2 Q1.2 C74.2 
R79.1 U29.4 U29.3 R83.1 C80.2 C79.2 R80.1 C77.2 
P2.2 P2.3 P2.4 P2.5 C76.2 U28.5 U28.2 C78.2 
U25.5 U25.2 C75.2 U27.5 U27.4 U27.3 C72.2 C73.2 
U26.4 C64.1 R65.2 P1.5 C58.2 C57.2 C59.2 C60.2 
R63.2 U23.24 U23.33 U23.43 U23.57 U23.9 U23.66 U23.78 
U23.12 C63.1 C61.2 DS1.1 R67.2 R59.1 C55.2 C56.2 
C62.2 Y1.2 Y1.4 C5.2 XJ4.D5 XJ4.B6 XJ4.D7 XJ4.B8 
XJ4.B2 XJ4.C3 XJ4.D3 XJ4.E3 XJ4.A4 XJ4.B4 XJ4.F1 XJ4.F2 
XJ4.F3 XJ4.F4 XJ4.F5 XJ4.F6 XJ4.F7 XJ4.F8 C53.2 C54.2 
C6.2 R48.1 C51.2 U22.6 U22.3 C52.2 C7.2 C2.2 
U2.48 U2.47 U2.8 U2.17 U2.32 U2.41 U6.7 C14.2 
U7.7 C11.2 U5.7 C13.2 U15.2 U8.7 C10.2 U9.7 
C25.2 C12.2 U12.1 U12.6 U12.3 C21.2 C18.2 C15.2 
C17.2 C19.2 U13.1 U13.6 U13.3 U10.1 U10.6 U10.3 
C16.2 U14.1 U14.6 U14.3 C22.2 C23.2 U16.2 C26.2 
C24.2 C20.2 U11.1 U11.6 U11.3 TJ2.cd1 TJ2.cd2 TJ2.cd3 
TJ2.cd4 TJ2.cd5 TJ2.cd6 TJ2.cd7 TJ2.cd8 TJ2.cd9 TJ2.cd10 TJ1.ef1 
TJ1.ef2 TJ1.ef3 TJ1.ef4 TJ1.ef5 TJ1.ef6 TJ1.ef7 TJ1.ef8 TJ1.ef9 
TJ1.ef10 TJ2.ef1 TJ2.ef2 TJ2.ef3 TJ2.ef4 TJ2.ef5 TJ2.ef6 TJ2.ef7 
TJ2.ef8 TJ2.ef9 TJ2.ef10 TJ1.cd1 TJ1.cd2 TJ1.cd3 TJ1.cd4 TJ1.cd5 
TJ1.cd6 TJ1.cd7 TJ1.cd8 TJ1.cd9 TJ1.cd10 TJ1.ab1 TJ1.ab2 TJ1.ab3 
TJ1.ab4 TJ1.ab5 TJ1.ab6 TJ1.ab7 TJ1.ab8 TJ1.ab9 TJ1.ab10 TJ2.ab1 
TJ2.ab2 TJ2.ab3 TJ2.ab4 TJ2.ab5 TJ2.ab6 TJ2.ab7 TJ2.ab8 TJ2.ab9 
TJ2.ab10 R84.1 R85.2 R88.2 C65.2 C66.2 C71.1 C82.2 
*SIGNAL* ISP_N
R55.2 U23.41 
*SIGNAL* LBL6
U23.50 U2.19 
*SIGNAL* LBR6
U23.49 U2.16 
*SIGNAL* LED_STATG
R62.2 U23.73 
*SIGNAL* LED_STATR
R61.2 U23.72 
*SIGNAL* LED_STATY
U23.71 R60.2 
*SIGNAL* MODE
U23.17 R66.1 R67.1 
*SIGNAL* N24031
XJ4.E6 R87.1 
*SIGNAL* N41347
MH4.2 R2.1 
*SIGNAL* N41380
MH1.2 R3.1 
*SIGNAL* N41447
MH4.3 R1.2 
*SIGNAL* N42032
MH1.3 R4.2 
*SIGNAL* N45969
XJ4.D6 R54.1 
*SIGNAL* N8135126
R64.1 U23.14 
*SIGNAL* N8942997
DS1.2 R60.1 
*SIGNAL* N8947395
R61.1 DS2.2 
*SIGNAL* N8964455
R62.1 DS2.3 
*SIGNAL* N9662218
U24.1 C68.1 
*SIGNAL* N9662225
U24.3 C68.2 
*SIGNAL* N9662275
U24.4 C67.1 
*SIGNAL* N9662353
U24.6 C69.1 
*SIGNAL* N9662360
U24.2 C70.1 
*SIGNAL* N9662410
U24.5 C67.2 
*SIGNAL* N9665080
R80.2 R71.1 U27.1 R70.1 
*SIGNAL* N9665120
R71.2 U27.6 
*SIGNAL* N9665330
D3.1 Q1.3 D2.2 R81.2 R73.1 R78.1 U26.6 
*SIGNAL* N9665388
R72.1 U26.8 
*SIGNAL* N9665532
U25.3 U26.3 
*SIGNAL* N9665574
D4.1 R75.1 R74.2 
*SIGNAL* N9665586
R75.2 R79.2 U27.2 
*SIGNAL* N9665598
R76.1 U27.7 
*SIGNAL* N9665602
R76.2 U28.4 
*SIGNAL* N9665606
R77.1 U28.3 
*SIGNAL* N9665630
R81.1 U26.2 
*SIGNAL* N9803648
U29.2 R83.2 R82.1 C82.1 
*SIGNAL* PXIE_DSTARA0_N
U10.19 TJ2.B2 
*SIGNAL* PXIE_DSTARA0_P
U10.20 TJ2.A2 
*SIGNAL* PXIE_DSTARA10_N
U11.19 TJ2.F6 
*SIGNAL* PXIE_DSTARA10_P
U11.20 TJ2.E6 
*SIGNAL* PXIE_DSTARA11_N
U11.14 TJ2.F9 
*SIGNAL* PXIE_DSTARA11_P
U11.15 TJ2.E9 
*SIGNAL* PXIE_DSTARA12_N
U12.19 TJ1.F2 
*SIGNAL* PXIE_DSTARA12_P
U12.20 TJ1.E2 
*SIGNAL* PXIE_DSTARA13_N
U12.11 TJ1.F5 
*SIGNAL* PXIE_DSTARA13_P
U12.12 TJ1.E5 
*SIGNAL* PXIE_DSTARA14_N
U13.14 TJ1.F8 
*SIGNAL* PXIE_DSTARA14_P
U13.15 TJ1.E8 
*SIGNAL* PXIE_DSTARA15_N
U14.19 TJ1.F10 
*SIGNAL* PXIE_DSTARA15_P
U14.20 TJ1.E10 
*SIGNAL* PXIE_DSTARA16_N
U12.16 TJ1.D3 
*SIGNAL* PXIE_DSTARA16_P
U12.17 TJ1.C3 
*SIGNAL* PXIE_DSTARA1_N
U10.11 TJ2.B5 
*SIGNAL* PXIE_DSTARA1_P
U10.12 TJ2.A5 
*SIGNAL* PXIE_DSTARA2_N
U11.16 TJ2.B8 
*SIGNAL* PXIE_DSTARA2_P
U11.17 TJ2.A8 
*SIGNAL* PXIE_DSTARA3_N
U11.11 TJ1.B1 
*SIGNAL* PXIE_DSTARA3_P
U11.12 TJ1.A1 
*SIGNAL* PXIE_DSTARA4_N
U12.14 TJ1.B4 
*SIGNAL* PXIE_DSTARA4_P
U12.15 TJ1.A4 
*SIGNAL* PXIE_DSTARA5_N
U13.19 TJ1.B7 
*SIGNAL* PXIE_DSTARA5_P
U13.20 TJ1.A7 
*SIGNAL* PXIE_DSTARA6_N
U13.11 TJ1.B10 
*SIGNAL* PXIE_DSTARA6_P
U13.12 TJ1.A10 
*SIGNAL* PXIE_DSTARA7_N
U13.16 TJ1.D7 
*SIGNAL* PXIE_DSTARA7_P
U13.17 TJ1.C7 
*SIGNAL* PXIE_DSTARA8_N
U10.16 TJ2.F2 
*SIGNAL* PXIE_DSTARA8_P
U10.17 TJ2.E2 
*SIGNAL* PXIE_DSTARA9_N
U10.14 TJ2.F3 
*SIGNAL* PXIE_DSTARA9_P
U10.15 TJ2.E3 
*SIGNAL* PXIE_DSTARB0_N
TJ2.B1 TJ2.B3 
*SIGNAL* PXIE_DSTARB0_P
TJ2.A1 TJ2.A3 
*SIGNAL* PXIE_DSTARB10_N
TJ2.F5 TJ2.F7 
*SIGNAL* PXIE_DSTARB10_P
TJ2.E5 TJ2.E7 
*SIGNAL* PXIE_DSTARB11_N
TJ2.F8 TJ2.F10 
*SIGNAL* PXIE_DSTARB11_P
TJ2.E8 TJ2.E10 
*SIGNAL* PXIE_DSTARB12_N
TJ1.F1 TJ1.F3 
*SIGNAL* PXIE_DSTARB12_P
TJ1.E1 TJ1.E3 
*SIGNAL* PXIE_DSTARB13_N
TJ1.F4 TJ1.F6 
*SIGNAL* PXIE_DSTARB13_P
TJ1.E4 TJ1.E6 
*SIGNAL* PXIE_DSTARB14_N
TJ1.F7 TJ1.F9 
*SIGNAL* PXIE_DSTARB14_P
TJ1.E7 TJ1.E9 
*SIGNAL* PXIE_DSTARB15_N
TJ1.D9 TJ1.D10 
*SIGNAL* PXIE_DSTARB15_P
TJ1.C9 TJ1.C10 
*SIGNAL* PXIE_DSTARB16_N
TJ2.D10 TJ1.D6 
*SIGNAL* PXIE_DSTARB16_P
TJ2.C10 TJ1.C6 
*SIGNAL* PXIE_DSTARB1_N
TJ2.D3 TJ2.B4 
*SIGNAL* PXIE_DSTARB1_P
TJ2.C3 TJ2.A4 
*SIGNAL* PXIE_DSTARB2_N
TJ2.B6 TJ2.B7 
*SIGNAL* PXIE_DSTARB2_P
TJ2.A6 TJ2.A7 
*SIGNAL* PXIE_DSTARB3_N
TJ2.B9 TJ2.B10 
*SIGNAL* PXIE_DSTARB3_P
TJ2.A9 TJ2.A10 
*SIGNAL* PXIE_DSTARB4_N
TJ1.B2 TJ1.B3 
*SIGNAL* PXIE_DSTARB4_P
TJ1.A2 TJ1.A3 
*SIGNAL* PXIE_DSTARB5_N
TJ1.B5 TJ1.B6 
*SIGNAL* PXIE_DSTARB5_P
TJ1.A5 TJ1.A6 
*SIGNAL* PXIE_DSTARB6_N
TJ1.B8 TJ1.B9 
*SIGNAL* PXIE_DSTARB6_P
TJ1.A8 TJ1.A9 
*SIGNAL* PXIE_DSTARB7_N
TJ1.D1 TJ1.D4 
*SIGNAL* PXIE_DSTARB7_P
TJ1.C1 TJ1.C4 
*SIGNAL* PXIE_DSTARB8_N
TJ2.D1 TJ2.F1 
*SIGNAL* PXIE_DSTARB8_P
TJ2.C1 TJ2.E1 
*SIGNAL* PXIE_DSTARB9_N
TJ2.D2 TJ2.F4 
*SIGNAL* PXIE_DSTARB9_P
TJ2.C2 TJ2.E4 
*SIGNAL* PXI_CLK10
U2.36 R87.2 R86.1 
*SIGNAL* PXI_GA0
R52.1 XJ4.E1 U2.46 
*SIGNAL* PXI_GA1
R53.1 XJ4.D1 U2.45 
*SIGNAL* PXI_GA2
XJ4.C1 R49.1 U2.44 
*SIGNAL* PXI_GA3
XJ4.B1 R50.1 U2.43 
*SIGNAL* PXI_GA4
XJ4.A1 R51.1 U2.42 
*SIGNAL* PXI_LBL6
XJ4.D8 U2.30 
*SIGNAL* PXI_LBR6
XJ4.E8 U2.33 
*SIGNAL* PXI_STAR
R54.2 U2.25 
*SIGNAL* PXI_STAR0
U5.3 TJ2.C4 
*SIGNAL* PXI_STAR1
U5.6 TJ2.D4 
*SIGNAL* PXI_STAR10
U7.8 TJ2.C9 
*SIGNAL* PXI_STAR11
U7.11 TJ2.D9 
*SIGNAL* PXI_STAR12
U8.3 TJ1.C2 
*SIGNAL* PXI_STAR13
U8.6 TJ1.D2 
*SIGNAL* PXI_STAR14
U8.8 TJ1.C5 
*SIGNAL* PXI_STAR15
U8.11 TJ1.D5 
*SIGNAL* PXI_STAR16
U9.3 TJ1.C8 
*SIGNAL* PXI_STAR2
U5.8 TJ2.C5 
*SIGNAL* PXI_STAR3
U5.11 TJ2.D5 
*SIGNAL* PXI_STAR4
U6.3 TJ2.C6 
*SIGNAL* PXI_STAR5
U6.6 TJ2.D6 
*SIGNAL* PXI_STAR6
U6.8 TJ2.C7 
*SIGNAL* PXI_STAR7
U6.11 TJ2.D7 
*SIGNAL* PXI_STAR8
U7.3 TJ2.C8 
*SIGNAL* PXI_STAR9
U7.6 TJ2.D8 
*SIGNAL* PXI_TRIG0
XJ4.B7 U2.28 
*SIGNAL* PXI_TRIG1
XJ4.A7 U2.27 
*SIGNAL* PXI_TRIG2
XJ4.A6 U2.29 
*SIGNAL* PXI_TRIG3
XJ4.A5 U2.40 
*SIGNAL* PXI_TRIG4
XJ4.B5 U2.39 
*SIGNAL* PXI_TRIG5
XJ4.C5 U2.31 
*SIGNAL* PXI_TRIG6
XJ4.E5 U2.38 
*SIGNAL* PXI_TRIG7
XJ4.E7 U2.35 
*SIGNAL* RX
U24.13 R69.1 
*SIGNAL* RXD
R69.2 J1.3 C66.1 
*SIGNAL* STAR
U6.2 U6.5 U6.9 U6.12 U7.2 U7.5 U7.9 U7.12 
U5.2 U5.5 U5.9 U5.12 U15.4 U8.2 U8.5 U8.9 
U8.12 U9.2 U9.5 U9.9 U9.12 
*SIGNAL* STAR_EN
R63.1 U23.26 U6.1 U6.4 U6.10 U6.13 U7.1 U7.4 
U7.10 U7.13 U5.1 U5.4 U5.10 U5.13 U8.1 U8.4 
U8.10 U8.13 U9.1 U9.4 U9.10 U9.13 U12.2 U13.2 
U10.2 U14.2 U11.2 
*SIGNAL* STAR_IN
U23.44 U2.24 R88.1 
*SIGNAL* STAR_OUT
U23.25 U15.1 
*SIGNAL* STAR_SEL
R65.1 U23.27 U15.6 
*SIGNAL* SWCLK
P1.4 U23.5 R59.2 
*SIGNAL* SWDIO
P1.2 R58.1 U23.3 
*SIGNAL* SWO
P1.6 U23.1 R57.1 
*SIGNAL* SWRST_N
P1.3 R56.1 U23.4 
*SIGNAL* TEST
U23.32 TP2.1 
*SIGNAL* TRIG
D1.1 R82.2 P2.1 R74.1 R73.2 R78.2 
*SIGNAL* TRIG0
U23.60 U2.21 
*SIGNAL* TRIG1
U23.59 U2.22 
*SIGNAL* TRIG2
U23.58 U2.20 
*SIGNAL* TRIG3
U23.55 U2.7 
*SIGNAL* TRIG4
U23.54 U2.9 
*SIGNAL* TRIG5
U23.53 U2.18 
*SIGNAL* TRIG6
U23.52 U2.10 
*SIGNAL* TRIG7
U23.51 U2.13 
*SIGNAL* TRIG_IN
R77.2 U23.28 
*SIGNAL* TRIG_OE
R72.2 U23.30 
*SIGNAL* TRIG_OUT
U25.4 U23.29 
*SIGNAL* TRIG_TSEL
Q1.1 U23.31 R84.2 
*SIGNAL* TX
U24.14 R68.1 
*SIGNAL* TXD
R68.2 J1.2 C65.1 
*SIGNAL* UART_RXD
U24.12 U23.80 
*SIGNAL* UART_TXD
U24.11 U23.79 
*SIGNAL* VADJ
R47.1 R48.2 U22.5 
*SIGNAL* XTAL1
U23.19 C63.2 Y1.1 
*SIGNAL* XTAL2
C64.2 U23.20 Y1.3 



*MISC*      MISCELLANEOUS PARAMETERS

ATTRIBUTE VALUES
{
PART C10
{
"Hyperlynx.Model" 100nF
}
PART C11
{
"Hyperlynx.Model" 100nF
}
PART C12
{
"Hyperlynx.Model" 100nF
}
PART C13
{
"Hyperlynx.Model" 100nF
}
PART C14
{
"Hyperlynx.Model" 100nF
}
PART C15
{
"Hyperlynx.Model" 100nF
}
PART C16
{
"Hyperlynx.Model" 10nF
}
PART C17
{
"Hyperlynx.Model" 100nF
}
PART C18
{
"Hyperlynx.Model" 10nF
}
PART C19
{
"Hyperlynx.Model" 100nF
}
PART C2
{
"Hyperlynx.Model" 100nF
}
PART C20
{
"Hyperlynx.Model" 10nF
}
PART C21
{
"Hyperlynx.Model" 100nF
}
PART C22
{
"Hyperlynx.Model" 10nF
}
PART C23
{
"Hyperlynx.Model" 100nF
}
PART C24
{
"Hyperlynx.Model" 10nF
}
PART C25
{
"Hyperlynx.Model" 100nF
}
PART C26
{
"Hyperlynx.Model" 100nF
}
PART C5
{
"Hyperlynx.Model" 10000nF
}
PART C51
{
"Hyperlynx.Model" 10000nF
}
PART C53
{
"Hyperlynx.Model" 100nF
}
PART C54
{
"Hyperlynx.Model" 10000nF
}
PART C55
{
"Hyperlynx.Model" 100nF
}
PART C56
{
"Hyperlynx.Model" 100nF
}
PART C57
{
"Hyperlynx.Model" 100nF
}
PART C58
{
"Hyperlynx.Model" 100nF
}
PART C59
{
"Hyperlynx.Model" 100nF
}
PART C60
{
"Hyperlynx.Model" 100nF
}
PART C61
{
"Hyperlynx.Model" 10nF
}
PART C62
{
"Hyperlynx.Model" 10nF
}
PART C63
{
"Hyperlynx.Model" 22pF
}
PART C64
{
"Hyperlynx.Model" 22pF
}
PART C65
{
"Hyperlynx.Model" 1nF
}
PART C66
{
"Hyperlynx.Model" 1nF
}
PART C67
{
"Hyperlynx.Model" 100nF
}
PART C68
{
"Hyperlynx.Model" 100nF
}
PART C69
{
"Hyperlynx.Model" 100nF
}
PART C7
{
"Hyperlynx.Model" 100nF
}
PART C70
{
"Hyperlynx.Model" 100nF
}
PART C71
{
"Hyperlynx.Model" 1nF
}
PART C72
{
"Hyperlynx.Model" 10nF
}
PART C73
{
"Hyperlynx.Model" 10nF
}
PART C74
{
"Hyperlynx.Model" 100nF
}
PART C75
{
"Hyperlynx.Model" 10nF
}
PART C76
{
"Hyperlynx.Model" 100nF
}
PART C77
{
"Hyperlynx.Model" 10nF
}
PART C78
{
"Hyperlynx.Model" 10nF
}
PART C79
{
"Hyperlynx.Model" 10nF
}
PART C80
{
"Hyperlynx.Model" 10000nF
}
PART C82
{
"Hyperlynx.Model" 1nF
}
PART R1
{
"Hyperlynx.Model" 1M
}
PART R2
{
"Hyperlynx.Model" 1M
}
PART R3
{
"Hyperlynx.Model" 1M
}
PART R4
{
"Hyperlynx.Model" 1M
}
PART R47
{
"Hyperlynx.Model" 4700
}
PART R48
{
"Hyperlynx.Model" 1500
}
PART R49
{
"Hyperlynx.Model" 10000
}
PART R5
{
"Hyperlynx.Model" 1M
}
PART R50
{
"Hyperlynx.Model" 10000
}
PART R51
{
"Hyperlynx.Model" 10000
}
PART R52
{
"Hyperlynx.Model" 10000
}
PART R53
{
"Hyperlynx.Model" 10000
}
PART R54
{
"Hyperlynx.Model" 0
}
PART R55
{
"Hyperlynx.Model" 10000
}
PART R56
{
"Hyperlynx.Model" 10000
}
PART R57
{
"Hyperlynx.Model" 10000
}
PART R58
{
"Hyperlynx.Model" 10000
}
PART R59
{
"Hyperlynx.Model" 10000
}
PART R60
{
"Hyperlynx.Model" 1000
}
PART R61
{
"Hyperlynx.Model" 330
}
PART R62
{
"Hyperlynx.Model" 330
}
PART R63
{
"Hyperlynx.Model" 10000
}
PART R64
{
"Hyperlynx.Model" 10000
}
PART R65
{
"Hyperlynx.Model" 10000
}
PART R66
{
"Hyperlynx.Model" 10000
}
PART R67
{
"Hyperlynx.Model" 10000
}
PART R68
{
"Hyperlynx.Model" 27
}
PART R69
{
"Hyperlynx.Model" 27
}
PART R70
{
"Hyperlynx.Model" 10000
}
PART R71
{
"Hyperlynx.Model" 30k
}
PART R72
{
"Hyperlynx.Model" 10000
}
PART R73
{
"Hyperlynx.Model" 100
}
PART R74
{
"Hyperlynx.Model" 47
}
PART R75
{
"Hyperlynx.Model" 3300
}
PART R76
{
"Hyperlynx.Model" 27
}
PART R77
{
"Hyperlynx.Model" 27
}
PART R78
{
"Hyperlynx.Model" 100
}
PART R79
{
"Hyperlynx.Model" 3300
}
PART R80
{
"Hyperlynx.Model" 1500
}
PART R81
{
"Hyperlynx.Model" 27
}
PART R82
{
"Hyperlynx.Model" 30k
}
PART R83
{
"Hyperlynx.Model" 30k
}
PART R84
{
"Hyperlynx.Model" 10000
}
PART R85
{
"Hyperlynx.Model" 10000
}
PART R86
{
"Hyperlynx.Model" 10000
}
PART R87
{
"Hyperlynx.Model" 0
}
PART R88
{
"Hyperlynx.Model" 10000
}
PART U25
{
"Hyperlynx.Model File" lvc1t45.ibs
"Hyperlynx.Model" LVC1T45_DBV
}
PART U28
{
"Hyperlynx.Model File" lvc1t45.ibs
"Hyperlynx.Model" LVC1T45_DBV
}
PART U5
{
"Hyperlynx.Model File" sn74lvc126a.ibs
"Hyperlynx.Model" LVC126A_PW
}
PART U6
{
"Hyperlynx.Model File" sn74lvc126a.ibs
"Hyperlynx.Model" LVC126A_PW
}
PART U7
{
"Hyperlynx.Model File" sn74lvc126a.ibs
"Hyperlynx.Model" LVC126A_PW
}
PART U8
{
"Hyperlynx.Model File" sn74lvc126a.ibs
"Hyperlynx.Model" LVC126A_PW
}
PART U9
{
"Hyperlynx.Model File" sn74lvc126a.ibs
"Hyperlynx.Model" LVC126A_PW
}
}

RULES_SECTION METRIC
{
DESIGN RULES
{
}
}



*END*      END OF ASCII FILE
