<?xml version="1.0" encoding="UTF-8" standalone="no"?>
<!-- Created with Inkscape (http://www.inkscape.org/) -->

<svg
   xmlns:dc="http://purl.org/dc/elements/1.1/"
   xmlns:cc="http://creativecommons.org/ns#"
   xmlns:rdf="http://www.w3.org/1999/02/22-rdf-syntax-ns#"
   xmlns:svg="http://www.w3.org/2000/svg"
   xmlns="http://www.w3.org/2000/svg"
   xmlns:sodipodi="http://sodipodi.sourceforge.net/DTD/sodipodi-0.dtd"
   xmlns:inkscape="http://www.inkscape.org/namespaces/inkscape"
   width="164.44484mm"
   height="126.47372mm"
   viewBox="0 0 582.67854 448.13524"
   id="svg8321"
   version="1.1"
   inkscape:version="0.91 r13725"
   sodipodi:docname="mock-turtle-mq.svg">
  <title
     id="title17379">Mock Turtle Message Queue</title>
  <defs
     id="defs8323">
    <marker
       inkscape:isstock="true"
       style="overflow:visible"
       id="marker22306"
       refX="0"
       refY="0"
       orient="auto"
       inkscape:stockid="Arrow1Mend">
      <path
         inkscape:connector-curvature="0"
         transform="matrix(-0.4,0,0,-0.4,-4,0)"
         style="fill:#000000;fill-opacity:1;fill-rule:evenodd;stroke:#000000;stroke-width:1pt;stroke-opacity:1"
         d="M 0,0 5,-5 -12.5,0 5,5 0,0 Z"
         id="path22308" />
    </marker>
    <marker
       inkscape:stockid="Arrow1Mstart"
       orient="auto"
       refY="0"
       refX="0"
       id="marker18787"
       style="overflow:visible"
       inkscape:isstock="true">
      <path
         inkscape:connector-curvature="0"
         id="path18789"
         d="M 0,0 5,-5 -12.5,0 5,5 0,0 Z"
         style="fill:#000000;fill-opacity:1;fill-rule:evenodd;stroke:#000000;stroke-width:1pt;stroke-opacity:1"
         transform="matrix(0.4,0,0,0.4,4,0)" />
    </marker>
    <marker
       inkscape:stockid="Arrow1Mend"
       orient="auto"
       refY="0"
       refX="0"
       id="marker18463"
       style="overflow:visible"
       inkscape:isstock="true"
       inkscape:collect="always">
      <path
         id="path18465"
         d="M 0,0 5,-5 -12.5,0 5,5 0,0 Z"
         style="fill:#000000;fill-opacity:1;fill-rule:evenodd;stroke:#000000;stroke-width:1pt;stroke-opacity:1"
         transform="matrix(-0.4,0,0,-0.4,-4,0)"
         inkscape:connector-curvature="0" />
    </marker>
    <marker
       inkscape:stockid="Arrow1Lend"
       orient="auto"
       refY="0"
       refX="0"
       id="Arrow1Lend"
       style="overflow:visible"
       inkscape:isstock="true">
      <path
         id="path13070"
         d="M 0,0 5,-5 -12.5,0 5,5 0,0 Z"
         style="fill:#000000;fill-opacity:1;fill-rule:evenodd;stroke:#000000;stroke-width:1pt;stroke-opacity:1"
         transform="matrix(-0.8,0,0,-0.8,-10,0)"
         inkscape:connector-curvature="0" />
    </marker>
    <marker
       inkscape:stockid="Arrow1Mend"
       orient="auto"
       refY="0"
       refX="0"
       id="marker17659"
       style="overflow:visible"
       inkscape:isstock="true">
      <path
         id="path17661"
         d="M 0,0 5,-5 -12.5,0 5,5 0,0 Z"
         style="fill:#000000;fill-opacity:1;fill-rule:evenodd;stroke:#000000;stroke-width:1pt;stroke-opacity:1"
         transform="matrix(-0.4,0,0,-0.4,-4,0)"
         inkscape:connector-curvature="0" />
    </marker>
    <marker
       inkscape:stockid="Arrow1Mend"
       orient="auto"
       refY="0"
       refX="0"
       id="marker17559"
       style="overflow:visible"
       inkscape:isstock="true">
      <path
         id="path17561"
         d="M 0,0 5,-5 -12.5,0 5,5 0,0 Z"
         style="fill:#000000;fill-opacity:1;fill-rule:evenodd;stroke:#000000;stroke-width:1pt;stroke-opacity:1"
         transform="matrix(-0.4,0,0,-0.4,-4,0)"
         inkscape:connector-curvature="0" />
    </marker>
    <marker
       inkscape:stockid="Arrow1Mend"
       orient="auto"
       refY="0"
       refX="0"
       id="marker17465"
       style="overflow:visible"
       inkscape:isstock="true">
      <path
         inkscape:connector-curvature="0"
         id="path17467"
         d="M 0,0 5,-5 -12.5,0 5,5 0,0 Z"
         style="fill:#000000;fill-opacity:1;fill-rule:evenodd;stroke:#000000;stroke-width:1pt;stroke-opacity:1"
         transform="matrix(-0.4,0,0,-0.4,-4,0)" />
    </marker>
    <marker
       inkscape:isstock="true"
       style="overflow:visible"
       id="marker16197"
       refX="0"
       refY="0"
       orient="auto"
       inkscape:stockid="Arrow1Mend">
      <path
         inkscape:connector-curvature="0"
         transform="matrix(-0.4,0,0,-0.4,-4,0)"
         style="fill:#000000;fill-opacity:1;fill-rule:evenodd;stroke:#000000;stroke-width:1pt;stroke-opacity:1"
         d="M 0,0 5,-5 -12.5,0 5,5 0,0 Z"
         id="path16199" />
    </marker>
    <marker
       inkscape:isstock="true"
       style="overflow:visible"
       id="marker14878"
       refX="0"
       refY="0"
       orient="auto"
       inkscape:stockid="Arrow1Mend">
      <path
         transform="matrix(-0.4,0,0,-0.4,-4,0)"
         style="fill:#000000;fill-opacity:1;fill-rule:evenodd;stroke:#000000;stroke-width:1pt;stroke-opacity:1"
         d="M 0,0 5,-5 -12.5,0 5,5 0,0 Z"
         id="path14880"
         inkscape:connector-curvature="0" />
    </marker>
    <marker
       inkscape:isstock="true"
       style="overflow:visible"
       id="marker14814"
       refX="0"
       refY="0"
       orient="auto"
       inkscape:stockid="Arrow1Mstart"
       inkscape:collect="always">
      <path
         transform="matrix(0.4,0,0,0.4,4,0)"
         style="fill:#000000;fill-opacity:1;fill-rule:evenodd;stroke:#000000;stroke-width:1pt;stroke-opacity:1"
         d="M 0,0 5,-5 -12.5,0 5,5 0,0 Z"
         id="path14816"
         inkscape:connector-curvature="0" />
    </marker>
    <marker
       inkscape:isstock="true"
       style="overflow:visible"
       id="marker13429"
       refX="0"
       refY="0"
       orient="auto"
       inkscape:stockid="Arrow1Mend"
       inkscape:collect="always">
      <path
         transform="matrix(-0.4,0,0,-0.4,-4,0)"
         style="fill:#000000;fill-opacity:1;fill-rule:evenodd;stroke:#000000;stroke-width:1pt;stroke-opacity:1"
         d="M 0,0 5,-5 -12.5,0 5,5 0,0 Z"
         id="path13431"
         inkscape:connector-curvature="0" />
    </marker>
    <marker
       inkscape:isstock="true"
       style="overflow:visible"
       id="marker13383"
       refX="0"
       refY="0"
       orient="auto"
       inkscape:stockid="Arrow1Mstart">
      <path
         transform="matrix(0.4,0,0,0.4,4,0)"
         style="fill:#000000;fill-opacity:1;fill-rule:evenodd;stroke:#000000;stroke-width:1pt;stroke-opacity:1"
         d="M 0,0 5,-5 -12.5,0 5,5 0,0 Z"
         id="path13385"
         inkscape:connector-curvature="0" />
    </marker>
    <marker
       inkscape:stockid="Arrow1Mend"
       orient="auto"
       refY="0"
       refX="0"
       id="Arrow1Mend"
       style="overflow:visible"
       inkscape:isstock="true"
       inkscape:collect="always">
      <path
         id="path13076"
         d="M 0,0 5,-5 -12.5,0 5,5 0,0 Z"
         style="fill:#000000;fill-opacity:1;fill-rule:evenodd;stroke:#000000;stroke-width:1pt;stroke-opacity:1"
         transform="matrix(-0.4,0,0,-0.4,-4,0)"
         inkscape:connector-curvature="0" />
    </marker>
    <marker
       inkscape:stockid="Arrow1Mstart"
       orient="auto"
       refY="0"
       refX="0"
       id="Arrow1Mstart"
       style="overflow:visible"
       inkscape:isstock="true"
       inkscape:collect="always">
      <path
         id="path13073"
         d="M 0,0 5,-5 -12.5,0 5,5 0,0 Z"
         style="fill:#000000;fill-opacity:1;fill-rule:evenodd;stroke:#000000;stroke-width:1pt;stroke-opacity:1"
         transform="matrix(0.4,0,0,0.4,4,0)"
         inkscape:connector-curvature="0" />
    </marker>
    <marker
       inkscape:isstock="true"
       style="overflow:visible"
       id="marker13383-5"
       refX="0"
       refY="0"
       orient="auto"
       inkscape:stockid="Arrow1Mstart">
      <path
         inkscape:connector-curvature="0"
         transform="matrix(0.4,0,0,0.4,4,0)"
         style="fill:#000000;fill-opacity:1;fill-rule:evenodd;stroke:#000000;stroke-width:1pt;stroke-opacity:1"
         d="M 0,0 5,-5 -12.5,0 5,5 0,0 Z"
         id="path13385-6" />
    </marker>
    <marker
       inkscape:isstock="true"
       style="overflow:visible"
       id="marker13429-4"
       refX="0"
       refY="0"
       orient="auto"
       inkscape:stockid="Arrow1Mend"
       inkscape:collect="always">
      <path
         inkscape:connector-curvature="0"
         transform="matrix(-0.4,0,0,-0.4,-4,0)"
         style="fill:#000000;fill-opacity:1;fill-rule:evenodd;stroke:#000000;stroke-width:1pt;stroke-opacity:1"
         d="M 0,0 5,-5 -12.5,0 5,5 0,0 Z"
         id="path13431-3" />
    </marker>
    <marker
       inkscape:isstock="true"
       style="overflow:visible"
       id="marker14878-2"
       refX="0"
       refY="0"
       orient="auto"
       inkscape:stockid="Arrow1Mend">
      <path
         inkscape:connector-curvature="0"
         transform="matrix(-0.4,0,0,-0.4,-4,0)"
         style="fill:#000000;fill-opacity:1;fill-rule:evenodd;stroke:#000000;stroke-width:1pt;stroke-opacity:1"
         d="M 0,0 5,-5 -12.5,0 5,5 0,0 Z"
         id="path14880-1" />
    </marker>
    <marker
       inkscape:isstock="true"
       style="overflow:visible"
       id="marker16197-6"
       refX="0"
       refY="0"
       orient="auto"
       inkscape:stockid="Arrow1Mend">
      <path
         inkscape:connector-curvature="0"
         transform="matrix(-0.4,0,0,-0.4,-4,0)"
         style="fill:#000000;fill-opacity:1;fill-rule:evenodd;stroke:#000000;stroke-width:1pt;stroke-opacity:1"
         d="M 0,0 5,-5 -12.5,0 5,5 0,0 Z"
         id="path16199-6" />
    </marker>
    <marker
       inkscape:stockid="Arrow1Mend"
       orient="auto"
       refY="0"
       refX="0"
       id="marker18463-5"
       style="overflow:visible"
       inkscape:isstock="true">
      <path
         id="path18465-6"
         d="M 0,0 5,-5 -12.5,0 5,5 0,0 Z"
         style="fill:#000000;fill-opacity:1;fill-rule:evenodd;stroke:#000000;stroke-width:1pt;stroke-opacity:1"
         transform="matrix(-0.4,0,0,-0.4,-4,0)"
         inkscape:connector-curvature="0" />
    </marker>
    <marker
       inkscape:isstock="true"
       style="overflow:visible"
       id="marker13383-5-0"
       refX="0"
       refY="0"
       orient="auto"
       inkscape:stockid="Arrow1Mstart">
      <path
         inkscape:connector-curvature="0"
         transform="matrix(0.4,0,0,0.4,4,0)"
         style="fill:#000000;fill-opacity:1;fill-rule:evenodd;stroke:#000000;stroke-width:1pt;stroke-opacity:1"
         d="M 0,0 5,-5 -12.5,0 5,5 0,0 Z"
         id="path13385-6-5" />
    </marker>
    <marker
       inkscape:isstock="true"
       style="overflow:visible"
       id="marker13383-4"
       refX="0"
       refY="0"
       orient="auto"
       inkscape:stockid="Arrow1Mstart">
      <path
         transform="matrix(0.4,0,0,0.4,4,0)"
         style="fill:#000000;fill-opacity:1;fill-rule:evenodd;stroke:#000000;stroke-width:1pt;stroke-opacity:1"
         d="M 0,0 5,-5 -12.5,0 5,5 0,0 Z"
         id="path13385-7"
         inkscape:connector-curvature="0" />
    </marker>
    <marker
       inkscape:isstock="true"
       style="overflow:visible"
       id="marker13383-7"
       refX="0"
       refY="0"
       orient="auto"
       inkscape:stockid="Arrow1Mstart">
      <path
         transform="matrix(0.4,0,0,0.4,4,0)"
         style="fill:#000000;fill-opacity:1;fill-rule:evenodd;stroke:#000000;stroke-width:1pt;stroke-opacity:1"
         d="M 0,0 5,-5 -12.5,0 5,5 0,0 Z"
         id="path13385-5"
         inkscape:connector-curvature="0" />
    </marker>
    <marker
       inkscape:isstock="true"
       style="overflow:visible"
       id="marker13429-6"
       refX="0"
       refY="0"
       orient="auto"
       inkscape:stockid="Arrow1Mend"
       inkscape:collect="always">
      <path
         transform="matrix(-0.4,0,0,-0.4,-4,0)"
         style="fill:#000000;fill-opacity:1;fill-rule:evenodd;stroke:#000000;stroke-width:1pt;stroke-opacity:1"
         d="M 0,0 5,-5 -12.5,0 5,5 0,0 Z"
         id="path13431-4"
         inkscape:connector-curvature="0" />
    </marker>
    <marker
       inkscape:stockid="Arrow1Mstart"
       orient="auto"
       refY="0"
       refX="0"
       id="Arrow1Mstart-3"
       style="overflow:visible"
       inkscape:isstock="true"
       inkscape:collect="always">
      <path
         id="path13073-7"
         d="M 0,0 5,-5 -12.5,0 5,5 0,0 Z"
         style="fill:#000000;fill-opacity:1;fill-rule:evenodd;stroke:#000000;stroke-width:1pt;stroke-opacity:1"
         transform="matrix(0.4,0,0,0.4,4,0)"
         inkscape:connector-curvature="0" />
    </marker>
    <marker
       inkscape:stockid="Arrow1Mend"
       orient="auto"
       refY="0"
       refX="0"
       id="Arrow1Mend-8"
       style="overflow:visible"
       inkscape:isstock="true"
       inkscape:collect="always">
      <path
         id="path13076-3"
         d="M 0,0 5,-5 -12.5,0 5,5 0,0 Z"
         style="fill:#000000;fill-opacity:1;fill-rule:evenodd;stroke:#000000;stroke-width:1pt;stroke-opacity:1"
         transform="matrix(-0.4,0,0,-0.4,-4,0)"
         inkscape:connector-curvature="0" />
    </marker>
    <marker
       inkscape:isstock="true"
       style="overflow:visible"
       id="marker13383-5-7"
       refX="0"
       refY="0"
       orient="auto"
       inkscape:stockid="Arrow1Mstart">
      <path
         inkscape:connector-curvature="0"
         transform="matrix(0.4,0,0,0.4,4,0)"
         style="fill:#000000;fill-opacity:1;fill-rule:evenodd;stroke:#000000;stroke-width:1pt;stroke-opacity:1"
         d="M 0,0 5,-5 -12.5,0 5,5 0,0 Z"
         id="path13385-6-8" />
    </marker>
    <marker
       inkscape:isstock="true"
       style="overflow:visible"
       id="marker13429-4-3"
       refX="0"
       refY="0"
       orient="auto"
       inkscape:stockid="Arrow1Mend"
       inkscape:collect="always">
      <path
         inkscape:connector-curvature="0"
         transform="matrix(-0.4,0,0,-0.4,-4,0)"
         style="fill:#000000;fill-opacity:1;fill-rule:evenodd;stroke:#000000;stroke-width:1pt;stroke-opacity:1"
         d="M 0,0 5,-5 -12.5,0 5,5 0,0 Z"
         id="path13431-3-0" />
    </marker>
    <marker
       inkscape:stockid="Arrow1Mend"
       orient="auto"
       refY="0"
       refX="0"
       id="marker18463-3"
       style="overflow:visible"
       inkscape:isstock="true">
      <path
         id="path18465-4"
         d="M 0,0 5,-5 -12.5,0 5,5 0,0 Z"
         style="fill:#000000;fill-opacity:1;fill-rule:evenodd;stroke:#000000;stroke-width:1pt;stroke-opacity:1"
         transform="matrix(-0.4,0,0,-0.4,-4,0)"
         inkscape:connector-curvature="0" />
    </marker>
  </defs>
  <sodipodi:namedview
     id="base"
     pagecolor="#ffffff"
     bordercolor="#666666"
     borderopacity="1.0"
     inkscape:pageopacity="0.0"
     inkscape:pageshadow="2"
     inkscape:zoom="1.4"
     inkscape:cx="220.41861"
     inkscape:cy="275.68398"
     inkscape:document-units="px"
     inkscape:current-layer="g21593"
     showgrid="false"
     showguides="true"
     inkscape:guide-bbox="true"
     inkscape:window-width="1920"
     inkscape:window-height="1075"
     inkscape:window-x="0"
     inkscape:window-y="0"
     inkscape:window-maximized="1"
     fit-margin-top="0"
     fit-margin-left="0"
     fit-margin-right="0"
     fit-margin-bottom="0">
    <sodipodi:guide
       position="372.47943,353.2364"
       orientation="0,1"
       id="guide13049" />
    <sodipodi:guide
       position="393.1937,98.236382"
       orientation="0,1"
       id="guide13051" />
    <sodipodi:guide
       position="44.89041,356.00871"
       orientation="1,0"
       id="guide13053" />
    <sodipodi:guide
       position="141.05088,366.80783"
       orientation="1,0"
       id="guide13055" />
    <sodipodi:guide
       position="236.44057,293.00044"
       orientation="1,0"
       id="guide13057" />
  </sodipodi:namedview>
  <metadata
     id="metadata8326">
    <rdf:RDF>
      <cc:Work
         rdf:about="">
        <dc:format>image/svg+xml</dc:format>
        <dc:type
           rdf:resource="http://purl.org/dc/dcmitype/StillImage" />
        <dc:title>Mock Turtle Message Queue</dc:title>
        <cc:license
           rdf:resource="http://creativecommons.org/licenses/by-sa/3.0/" />
        <dc:creator>
          <cc:Agent>
            <dc:title>Federico Vaga &lt;federico.vaga@cern.ch&gt;</dc:title>
          </cc:Agent>
        </dc:creator>
        <dc:rights>
          <cc:Agent>
            <dc:title>CERN</dc:title>
          </cc:Agent>
        </dc:rights>
      </cc:Work>
      <cc:License
         rdf:about="http://creativecommons.org/licenses/by-sa/3.0/">
        <cc:permits
           rdf:resource="http://creativecommons.org/ns#Reproduction" />
        <cc:permits
           rdf:resource="http://creativecommons.org/ns#Distribution" />
        <cc:requires
           rdf:resource="http://creativecommons.org/ns#Notice" />
        <cc:requires
           rdf:resource="http://creativecommons.org/ns#Attribution" />
        <cc:permits
           rdf:resource="http://creativecommons.org/ns#DerivativeWorks" />
        <cc:requires
           rdf:resource="http://creativecommons.org/ns#ShareAlike" />
      </cc:License>
    </rdf:RDF>
  </metadata>
  <g
     inkscape:label="Layer 1"
     inkscape:groupmode="layer"
     id="layer1"
     transform="translate(13.193735,-701.74907)">
    <text
       xml:space="preserve"
       style="font-style:normal;font-weight:normal;font-size:20px;line-height:125%;font-family:'Bitstream Vera Sans';letter-spacing:0px;word-spacing:0px;fill:#000000;fill-opacity:1;stroke:none;stroke-width:1px;stroke-linecap:butt;stroke-linejoin:miter;stroke-opacity:1"
       x="277.85715"
       y="831.64795"
       id="text12975"
       sodipodi:linespacing="125%"><tspan
         sodipodi:role="line"
         id="tspan12977"
         x="277.85715"
         y="831.64795" /></text>
    <g
       id="g21593"
       transform="translate(0,0.11586949)">
      <rect
         y="761.00293"
         x="-11.605868"
         height="332.96707"
         width="271.89569"
         id="rect16171"
         style="opacity:1;fill:#fdca98;fill-opacity:1;stroke:#ee6103;stroke-width:3.17576456;stroke-linecap:butt;stroke-linejoin:bevel;stroke-miterlimit:4;stroke-dasharray:none;stroke-opacity:1" />
      <g
         transform="translate(-0.04170087,0)"
         id="g19721">
        <g
           id="g19711">
          <g
             transform="translate(10.505076,0.25253814)"
             id="g19701">
            <rect
               style="opacity:1;fill:#fdca98;fill-opacity:1;stroke:#ee6103;stroke-width:0.84244156;stroke-linecap:butt;stroke-linejoin:bevel;stroke-miterlimit:4;stroke-dasharray:none;stroke-opacity:1"
               id="rect12801-1-1"
               width="95.157555"
               height="63.014515"
               x="21.849794"
               y="796.78345" />
            <text
               xml:space="preserve"
               style="font-style:normal;font-variant:normal;font-weight:normal;font-stretch:normal;font-size:20px;line-height:125%;font-family:monospace;-inkscape-font-specification:monospace;letter-spacing:0px;word-spacing:0px;fill:#000000;fill-opacity:1;stroke:none;stroke-width:1px;stroke-linecap:butt;stroke-linejoin:miter;stroke-opacity:1"
               x="32.758652"
               y="835.74677"
               id="text12803-9-8"
               sodipodi:linespacing="125%"><tspan
                 sodipodi:role="line"
                 id="tspan12805-4-7"
                 x="32.758652"
                 y="835.74677">header</tspan></text>
          </g>
          <g
             transform="translate(-20,0.12626907)"
             id="g19706">
            <rect
               style="opacity:1;fill:#fdca98;fill-opacity:1;stroke:#ee6103;stroke-width:0.84338677;stroke-linecap:butt;stroke-linejoin:bevel;stroke-miterlimit:4;stroke-dasharray:none;stroke-opacity:1"
               id="rect12801-8-6-3"
               width="95.156616"
               height="63.156612"
               x="148.42171"
               y="796.78394" />
            <text
               xml:space="preserve"
               style="font-style:normal;font-weight:normal;font-size:20px;line-height:125%;font-family:'Bitstream Vera Sans';letter-spacing:0px;word-spacing:0px;fill:#000000;fill-opacity:1;stroke:none;stroke-width:1px;stroke-linecap:butt;stroke-linejoin:miter;stroke-opacity:1"
               x="153.89064"
               y="833.93353"
               id="text12827-1-9"
               sodipodi:linespacing="125%"><tspan
                 sodipodi:role="line"
                 id="tspan12829-3-5"
                 x="153.89064"
                 y="833.93353"
                 style="font-style:normal;font-variant:normal;font-weight:normal;font-stretch:normal;font-family:monospace;-inkscape-font-specification:monospace">payload</tspan></text>
          </g>
        </g>
        <text
           xml:space="preserve"
           style="font-style:normal;font-weight:normal;font-size:20px;line-height:125%;font-family:'Bitstream Vera Sans';letter-spacing:0px;word-spacing:0px;fill:#000000;fill-opacity:1;stroke:none;stroke-width:1px;stroke-linecap:butt;stroke-linejoin:miter;stroke-opacity:1"
           x="235.63364"
           y="835.64246"
           id="text12979"
           sodipodi:linespacing="125%"><tspan
             sodipodi:role="line"
             id="tspan12981"
             x="235.63364"
             y="835.64246">0</tspan></text>
      </g>
      <g
         id="g21132">
        <path
           style="fill:none;fill-rule:evenodd;stroke:#000000;stroke-width:1px;stroke-linecap:butt;stroke-linejoin:miter;stroke-opacity:1;marker-start:url(#marker13383);marker-end:url(#marker13429)"
           d="m 31.567267,787.08421 96.289873,0"
           id="path13375"
           inkscape:connector-curvature="0"
           sodipodi:nodetypes="cc" />
        <text
           xml:space="preserve"
           style="font-style:normal;font-weight:normal;font-size:20px;line-height:125%;font-family:'Bitstream Vera Sans';letter-spacing:0px;word-spacing:0px;fill:#000000;fill-opacity:1;stroke:none;stroke-width:1px;stroke-linecap:butt;stroke-linejoin:miter;stroke-opacity:1"
           x="63.901031"
           y="781.94336"
           id="text13499"
           sodipodi:linespacing="125%"><tspan
             sodipodi:role="line"
             id="tspan13501"
             x="63.901031"
             y="781.94336"
             style="font-style:normal;font-variant:normal;font-weight:normal;font-stretch:normal;font-size:15px;font-family:monospace;-inkscape-font-specification:monospace">size</tspan></text>
      </g>
      <g
         transform="translate(30,0)"
         id="g21046">
        <path
           style="fill:none;fill-rule:evenodd;stroke:#000000;stroke-width:1px;stroke-linecap:butt;stroke-linejoin:miter;stroke-opacity:1;marker-start:url(#Arrow1Mstart);marker-end:url(#Arrow1Mend)"
           d="m -10.99485,797.80376 0,253.84414"
           id="path13061"
           inkscape:connector-curvature="0" />
        <text
           xml:space="preserve"
           style="font-style:normal;font-weight:normal;font-size:20px;line-height:125%;font-family:'Bitstream Vera Sans';letter-spacing:0px;word-spacing:0px;fill:#000000;fill-opacity:1;stroke:none;stroke-width:1px;stroke-linecap:butt;stroke-linejoin:miter;stroke-opacity:1"
           x="-984.33868"
           y="-21.082977"
           id="text13503"
           sodipodi:linespacing="125%"
           transform="matrix(0,-1,1,0,0,0)"><tspan
             sodipodi:role="line"
             id="tspan13505"
             x="-984.33868"
             y="-21.082977"
             style="font-style:normal;font-variant:normal;font-weight:normal;font-stretch:normal;font-size:15px;font-family:monospace;-inkscape-font-specification:monospace">entries number</tspan></text>
      </g>
      <g
         id="g21115">
        <path
           style="fill:none;fill-rule:evenodd;stroke:#000000;stroke-width:1px;stroke-linecap:butt;stroke-linejoin:miter;stroke-opacity:1;marker-start:url(#marker13383-5);marker-end:url(#marker13429-4)"
           d="m 128.73262,787.0842 94.52211,0"
           id="path13375-6"
           inkscape:connector-curvature="0"
           sodipodi:nodetypes="cc" />
        <text
           xml:space="preserve"
           style="font-style:normal;font-weight:normal;font-size:20px;line-height:125%;font-family:'Bitstream Vera Sans';letter-spacing:0px;word-spacing:0px;fill:#000000;fill-opacity:1;stroke:none;stroke-width:1px;stroke-linecap:butt;stroke-linejoin:miter;stroke-opacity:1"
           x="158.38414"
           y="783.03033"
           id="text13499-5"
           sodipodi:linespacing="125%"><tspan
             sodipodi:role="line"
             id="tspan13501-4"
             x="158.38414"
             y="783.03033"
             style="font-style:normal;font-variant:normal;font-weight:normal;font-stretch:normal;font-size:15px;font-family:monospace;-inkscape-font-specification:monospace">size</tspan></text>
      </g>
      <text
         sodipodi:linespacing="125%"
         id="text16173"
         y="1080.7008"
         x="45.152378"
         style="font-style:normal;font-weight:normal;font-size:19.99999809px;line-height:125%;font-family:'Bitstream Vera Sans';letter-spacing:0px;word-spacing:0px;fill:#000000;fill-opacity:1;stroke:none;stroke-width:1px;stroke-linecap:butt;stroke-linejoin:miter;stroke-opacity:1"
         xml:space="preserve"><tspan
           style="font-style:normal;font-variant:normal;font-weight:normal;font-stretch:normal;font-size:19.99999809px;font-family:monospace;-inkscape-font-specification:monospace"
           y="1080.7008"
           x="45.152378"
           id="tspan16175"
           sodipodi:role="line">message queue</tspan></text>
      <path
         inkscape:connection-start="#rect16171"
         inkscape:connector-curvature="0"
         inkscape:connector-type="polyline"
         id="path18585"
         d="m 127.02338,761.00293 0.83376,-51.73067"
         style="fill:none;fill-rule:evenodd;stroke:#000000;stroke-width:4;stroke-linecap:butt;stroke-linejoin:miter;stroke-miterlimit:4;stroke-dasharray:none;stroke-opacity:1;marker-end:url(#marker18463)" />
      <path
         inkscape:connection-start="#rect16171"
         inkscape:connector-curvature="0"
         inkscape:connector-type="polyline"
         id="path18587"
         d="m 127.06887,1093.97 0.78827,48.1594"
         style="fill:none;fill-rule:evenodd;stroke:#000000;stroke-width:4;stroke-linecap:butt;stroke-linejoin:miter;stroke-miterlimit:4;stroke-dasharray:none;stroke-opacity:1;marker-start:url(#marker14814)" />
      <g
         id="g19721-0"
         transform="translate(-0.04170087,63.069469)">
        <g
           id="g19711-9">
          <g
             transform="translate(10.505076,0.25253814)"
             id="g19701-6">
            <rect
               style="opacity:1;fill:#fdca98;fill-opacity:1;stroke:#ee6103;stroke-width:0.84244156;stroke-linecap:butt;stroke-linejoin:bevel;stroke-miterlimit:4;stroke-dasharray:none;stroke-opacity:1"
               id="rect12801-1-1-2"
               width="95.157555"
               height="63.014515"
               x="21.849794"
               y="796.78345" />
            <text
               xml:space="preserve"
               style="font-style:normal;font-variant:normal;font-weight:normal;font-stretch:normal;font-size:20px;line-height:125%;font-family:monospace;-inkscape-font-specification:monospace;letter-spacing:0px;word-spacing:0px;fill:#000000;fill-opacity:1;stroke:none;stroke-width:1px;stroke-linecap:butt;stroke-linejoin:miter;stroke-opacity:1"
               x="32.758652"
               y="835.74677"
               id="text12803-9-8-0"
               sodipodi:linespacing="125%"><tspan
                 sodipodi:role="line"
                 id="tspan12805-4-7-0"
                 x="32.758652"
                 y="835.74677">header</tspan></text>
          </g>
          <g
             transform="translate(-20,0.12626907)"
             id="g19706-1">
            <rect
               style="opacity:1;fill:#fdca98;fill-opacity:1;stroke:#ee6103;stroke-width:0.84338677;stroke-linecap:butt;stroke-linejoin:bevel;stroke-miterlimit:4;stroke-dasharray:none;stroke-opacity:1"
               id="rect12801-8-6-3-7"
               width="95.156616"
               height="63.156612"
               x="148.42171"
               y="796.78394" />
            <text
               xml:space="preserve"
               style="font-style:normal;font-weight:normal;font-size:20px;line-height:125%;font-family:'Bitstream Vera Sans';letter-spacing:0px;word-spacing:0px;fill:#000000;fill-opacity:1;stroke:none;stroke-width:1px;stroke-linecap:butt;stroke-linejoin:miter;stroke-opacity:1"
               x="153.89064"
               y="833.93353"
               id="text12827-1-9-3"
               sodipodi:linespacing="125%"><tspan
                 sodipodi:role="line"
                 id="tspan12829-3-5-3"
                 x="153.89064"
                 y="833.93353"
                 style="font-style:normal;font-variant:normal;font-weight:normal;font-stretch:normal;font-family:monospace;-inkscape-font-specification:monospace">payload</tspan></text>
          </g>
        </g>
        <text
           xml:space="preserve"
           style="font-style:normal;font-weight:normal;font-size:20px;line-height:125%;font-family:'Bitstream Vera Sans';letter-spacing:0px;word-spacing:0px;fill:#000000;fill-opacity:1;stroke:none;stroke-width:1px;stroke-linecap:butt;stroke-linejoin:miter;stroke-opacity:1"
           x="235.63364"
           y="835.64246"
           id="text12979-1"
           sodipodi:linespacing="125%"><tspan
             sodipodi:role="line"
             id="tspan12981-6"
             x="235.63364"
             y="835.64246">1</tspan></text>
      </g>
      <g
         id="g19721-8"
         transform="translate(-0.04170087,126.78376)">
        <g
           id="g19711-92">
          <g
             transform="translate(10.505076,0.25253814)"
             id="g19701-8">
            <rect
               style="opacity:1;fill:#fdca98;fill-opacity:1;stroke:#ee6103;stroke-width:0.84244156;stroke-linecap:butt;stroke-linejoin:bevel;stroke-miterlimit:4;stroke-dasharray:none;stroke-opacity:1"
               id="rect12801-1-1-0"
               width="95.157555"
               height="63.014515"
               x="21.849794"
               y="796.78345" />
            <text
               xml:space="preserve"
               style="font-style:normal;font-variant:normal;font-weight:normal;font-stretch:normal;font-size:20px;line-height:125%;font-family:monospace;-inkscape-font-specification:monospace;letter-spacing:0px;word-spacing:0px;fill:#000000;fill-opacity:1;stroke:none;stroke-width:1px;stroke-linecap:butt;stroke-linejoin:miter;stroke-opacity:1"
               x="32.758652"
               y="835.74677"
               id="text12803-9-8-00"
               sodipodi:linespacing="125%"><tspan
                 sodipodi:role="line"
                 id="tspan12805-4-7-3"
                 x="32.758652"
                 y="835.74677">header</tspan></text>
          </g>
          <g
             transform="translate(-20,0.12626907)"
             id="g19706-3">
            <rect
               style="opacity:1;fill:#fdca98;fill-opacity:1;stroke:#ee6103;stroke-width:0.84338677;stroke-linecap:butt;stroke-linejoin:bevel;stroke-miterlimit:4;stroke-dasharray:none;stroke-opacity:1"
               id="rect12801-8-6-3-9"
               width="95.156616"
               height="63.156612"
               x="148.42171"
               y="796.78394" />
            <text
               xml:space="preserve"
               style="font-style:normal;font-weight:normal;font-size:20px;line-height:125%;font-family:'Bitstream Vera Sans';letter-spacing:0px;word-spacing:0px;fill:#000000;fill-opacity:1;stroke:none;stroke-width:1px;stroke-linecap:butt;stroke-linejoin:miter;stroke-opacity:1"
               x="153.89064"
               y="833.93353"
               id="text12827-1-9-37"
               sodipodi:linespacing="125%"><tspan
                 sodipodi:role="line"
                 id="tspan12829-3-5-9"
                 x="153.89064"
                 y="833.93353"
                 style="font-style:normal;font-variant:normal;font-weight:normal;font-stretch:normal;font-family:monospace;-inkscape-font-specification:monospace">payload</tspan></text>
          </g>
        </g>
        <text
           xml:space="preserve"
           style="font-style:normal;font-weight:normal;font-size:20px;line-height:125%;font-family:'Bitstream Vera Sans';letter-spacing:0px;word-spacing:0px;fill:#000000;fill-opacity:1;stroke:none;stroke-width:1px;stroke-linecap:butt;stroke-linejoin:miter;stroke-opacity:1"
           x="235.63364"
           y="835.64246"
           id="text12979-6"
           sodipodi:linespacing="125%"><tspan
             sodipodi:role="line"
             id="tspan12981-1"
             x="235.63364"
             y="835.64246">2</tspan></text>
      </g>
      <g
         id="g19721-8-9"
         transform="translate(-0.04170087,190.13476)">
        <g
           id="g19711-92-4">
          <g
             transform="translate(10.505076,0.25253814)"
             id="g19701-8-5">
            <rect
               style="opacity:1;fill:#fdca98;fill-opacity:1;stroke:#ee6103;stroke-width:0.84244156;stroke-linecap:butt;stroke-linejoin:bevel;stroke-miterlimit:4;stroke-dasharray:none;stroke-opacity:1"
               id="rect12801-1-1-0-3"
               width="95.157555"
               height="63.014515"
               x="21.849794"
               y="796.78345" />
            <text
               xml:space="preserve"
               style="font-style:normal;font-variant:normal;font-weight:normal;font-stretch:normal;font-size:20px;line-height:125%;font-family:monospace;-inkscape-font-specification:monospace;letter-spacing:0px;word-spacing:0px;fill:#000000;fill-opacity:1;stroke:none;stroke-width:1px;stroke-linecap:butt;stroke-linejoin:miter;stroke-opacity:1"
               x="32.758652"
               y="835.74677"
               id="text12803-9-8-00-6"
               sodipodi:linespacing="125%"><tspan
                 sodipodi:role="line"
                 id="tspan12805-4-7-3-4"
                 x="32.758652"
                 y="835.74677">header</tspan></text>
          </g>
          <g
             transform="translate(-20,0.12626907)"
             id="g19706-3-9">
            <rect
               style="opacity:1;fill:#fdca98;fill-opacity:1;stroke:#ee6103;stroke-width:0.84338677;stroke-linecap:butt;stroke-linejoin:bevel;stroke-miterlimit:4;stroke-dasharray:none;stroke-opacity:1"
               id="rect12801-8-6-3-9-9"
               width="95.156616"
               height="63.156612"
               x="148.42171"
               y="796.78394" />
            <text
               xml:space="preserve"
               style="font-style:normal;font-weight:normal;font-size:20px;line-height:125%;font-family:'Bitstream Vera Sans';letter-spacing:0px;word-spacing:0px;fill:#000000;fill-opacity:1;stroke:none;stroke-width:1px;stroke-linecap:butt;stroke-linejoin:miter;stroke-opacity:1"
               x="153.89064"
               y="833.93353"
               id="text12827-1-9-37-6"
               sodipodi:linespacing="125%"><tspan
                 sodipodi:role="line"
                 id="tspan12829-3-5-9-2"
                 x="153.89064"
                 y="833.93353"
                 style="font-style:normal;font-variant:normal;font-weight:normal;font-stretch:normal;font-family:monospace;-inkscape-font-specification:monospace">payload</tspan></text>
          </g>
        </g>
        <text
           xml:space="preserve"
           style="font-style:normal;font-weight:normal;font-size:20px;line-height:125%;font-family:'Bitstream Vera Sans';letter-spacing:0px;word-spacing:0px;fill:#000000;fill-opacity:1;stroke:none;stroke-width:1px;stroke-linecap:butt;stroke-linejoin:miter;stroke-opacity:1"
           x="235.63364"
           y="835.64246"
           id="text12979-6-0"
           sodipodi:linespacing="125%"><tspan
             sodipodi:role="line"
             id="tspan12981-1-3"
             x="235.63364"
             y="835.64246">3</tspan></text>
      </g>
    </g>
    <g
       transform="translate(307.60711,0.11586949)"
       id="g21593-3">
      <rect
         y="761.00293"
         x="-11.605868"
         height="332.96707"
         width="271.89569"
         id="rect16171-4"
         style="opacity:1;fill:#fdca98;fill-opacity:1;stroke:#ee6103;stroke-width:3.17576456;stroke-linecap:butt;stroke-linejoin:bevel;stroke-miterlimit:4;stroke-dasharray:none;stroke-opacity:1" />
      <g
         transform="translate(-0.04170087,0)"
         id="g19721-1">
        <g
           id="g19711-4">
          <g
             transform="translate(10.505076,0.25253814)"
             id="g19701-88">
            <rect
               style="opacity:1;fill:#fdca98;fill-opacity:1;stroke:#ee6103;stroke-width:0.84244156;stroke-linecap:butt;stroke-linejoin:bevel;stroke-miterlimit:4;stroke-dasharray:none;stroke-opacity:1"
               id="rect12801-1-1-7"
               width="95.157555"
               height="63.014515"
               x="21.849794"
               y="796.78345" />
            <text
               xml:space="preserve"
               style="font-style:normal;font-variant:normal;font-weight:normal;font-stretch:normal;font-size:20px;line-height:125%;font-family:monospace;-inkscape-font-specification:monospace;letter-spacing:0px;word-spacing:0px;fill:#000000;fill-opacity:1;stroke:none;stroke-width:1px;stroke-linecap:butt;stroke-linejoin:miter;stroke-opacity:1"
               x="32.758652"
               y="835.74677"
               id="text12803-9-8-6"
               sodipodi:linespacing="125%"><tspan
                 sodipodi:role="line"
                 id="tspan12805-4-7-2"
                 x="32.758652"
                 y="835.74677">header</tspan></text>
          </g>
          <g
             transform="translate(-20,0.12626907)"
             id="g19706-8">
            <rect
               style="opacity:1;fill:#fdca98;fill-opacity:1;stroke:#ee6103;stroke-width:0.84338677;stroke-linecap:butt;stroke-linejoin:bevel;stroke-miterlimit:4;stroke-dasharray:none;stroke-opacity:1"
               id="rect12801-8-6-3-5"
               width="95.156616"
               height="63.156612"
               x="148.42171"
               y="796.78394" />
            <text
               xml:space="preserve"
               style="font-style:normal;font-weight:normal;font-size:20px;line-height:125%;font-family:'Bitstream Vera Sans';letter-spacing:0px;word-spacing:0px;fill:#000000;fill-opacity:1;stroke:none;stroke-width:1px;stroke-linecap:butt;stroke-linejoin:miter;stroke-opacity:1"
               x="153.89064"
               y="833.93353"
               id="text12827-1-9-0"
               sodipodi:linespacing="125%"><tspan
                 sodipodi:role="line"
                 id="tspan12829-3-5-2"
                 x="153.89064"
                 y="833.93353"
                 style="font-style:normal;font-variant:normal;font-weight:normal;font-stretch:normal;font-family:monospace;-inkscape-font-specification:monospace">payload</tspan></text>
          </g>
        </g>
        <text
           xml:space="preserve"
           style="font-style:normal;font-weight:normal;font-size:20px;line-height:125%;font-family:'Bitstream Vera Sans';letter-spacing:0px;word-spacing:0px;fill:#000000;fill-opacity:1;stroke:none;stroke-width:1px;stroke-linecap:butt;stroke-linejoin:miter;stroke-opacity:1"
           x="235.63364"
           y="835.64246"
           id="text12979-7"
           sodipodi:linespacing="125%"><tspan
             sodipodi:role="line"
             id="tspan12981-5"
             x="235.63364"
             y="835.64246">0</tspan></text>
      </g>
      <g
         id="g21132-0">
        <path
           style="fill:none;fill-rule:evenodd;stroke:#000000;stroke-width:1px;stroke-linecap:butt;stroke-linejoin:miter;stroke-opacity:1;marker-start:url(#marker13383-7);marker-end:url(#marker13429-6)"
           d="m 31.567267,787.08421 96.289873,0"
           id="path13375-4"
           inkscape:connector-curvature="0"
           sodipodi:nodetypes="cc" />
        <text
           xml:space="preserve"
           style="font-style:normal;font-weight:normal;font-size:20px;line-height:125%;font-family:'Bitstream Vera Sans';letter-spacing:0px;word-spacing:0px;fill:#000000;fill-opacity:1;stroke:none;stroke-width:1px;stroke-linecap:butt;stroke-linejoin:miter;stroke-opacity:1"
           x="63.901031"
           y="781.94336"
           id="text13499-1"
           sodipodi:linespacing="125%"><tspan
             sodipodi:role="line"
             id="tspan13501-6"
             x="63.901031"
             y="781.94336"
             style="font-style:normal;font-variant:normal;font-weight:normal;font-stretch:normal;font-size:15px;font-family:monospace;-inkscape-font-specification:monospace">size</tspan></text>
      </g>
      <g
         transform="translate(30,0)"
         id="g21046-9">
        <path
           style="fill:none;fill-rule:evenodd;stroke:#000000;stroke-width:1px;stroke-linecap:butt;stroke-linejoin:miter;stroke-opacity:1;marker-start:url(#Arrow1Mstart-3);marker-end:url(#Arrow1Mend-8)"
           d="m -10.99485,797.80376 0,253.84414"
           id="path13061-9"
           inkscape:connector-curvature="0" />
        <text
           xml:space="preserve"
           style="font-style:normal;font-weight:normal;font-size:20px;line-height:125%;font-family:'Bitstream Vera Sans';letter-spacing:0px;word-spacing:0px;fill:#000000;fill-opacity:1;stroke:none;stroke-width:1px;stroke-linecap:butt;stroke-linejoin:miter;stroke-opacity:1"
           x="-984.33868"
           y="-21.082977"
           id="text13503-4"
           sodipodi:linespacing="125%"
           transform="matrix(0,-1,1,0,0,0)"><tspan
             sodipodi:role="line"
             id="tspan13505-2"
             x="-984.33868"
             y="-21.082977"
             style="font-style:normal;font-variant:normal;font-weight:normal;font-stretch:normal;font-size:15px;font-family:monospace;-inkscape-font-specification:monospace">entries number</tspan></text>
      </g>
      <g
         id="g21115-6">
        <path
           style="fill:none;fill-rule:evenodd;stroke:#000000;stroke-width:1px;stroke-linecap:butt;stroke-linejoin:miter;stroke-opacity:1;marker-start:url(#marker13383-5-7);marker-end:url(#marker13429-4-3)"
           d="m 128.73262,787.0842 94.52211,0"
           id="path13375-6-4"
           inkscape:connector-curvature="0"
           sodipodi:nodetypes="cc" />
        <text
           xml:space="preserve"
           style="font-style:normal;font-weight:normal;font-size:20px;line-height:125%;font-family:'Bitstream Vera Sans';letter-spacing:0px;word-spacing:0px;fill:#000000;fill-opacity:1;stroke:none;stroke-width:1px;stroke-linecap:butt;stroke-linejoin:miter;stroke-opacity:1"
           x="158.38414"
           y="783.03033"
           id="text13499-5-7"
           sodipodi:linespacing="125%"><tspan
             sodipodi:role="line"
             id="tspan13501-4-9"
             x="158.38414"
             y="783.03033"
             style="font-style:normal;font-variant:normal;font-weight:normal;font-stretch:normal;font-size:15px;font-family:monospace;-inkscape-font-specification:monospace">size</tspan></text>
      </g>
      <text
         sodipodi:linespacing="125%"
         id="text16173-7"
         y="1080.7008"
         x="45.152378"
         style="font-style:normal;font-weight:normal;font-size:19.99999809px;line-height:125%;font-family:'Bitstream Vera Sans';letter-spacing:0px;word-spacing:0px;fill:#000000;fill-opacity:1;stroke:none;stroke-width:1px;stroke-linecap:butt;stroke-linejoin:miter;stroke-opacity:1"
         xml:space="preserve"><tspan
           style="font-style:normal;font-variant:normal;font-weight:normal;font-stretch:normal;font-size:19.99999809px;font-family:monospace;-inkscape-font-specification:monospace"
           y="1080.7008"
           x="45.152378"
           id="tspan16175-1"
           sodipodi:role="line">message queue</tspan></text>
      <path
         inkscape:connection-start="#rect16171-4"
         inkscape:connector-curvature="0"
         inkscape:connector-type="polyline"
         id="path18585-2"
         d="m 127.02382,761.00293 0.83332,-51.73067"
         style="fill:none;fill-rule:evenodd;stroke:#000000;stroke-width:4;stroke-linecap:butt;stroke-linejoin:miter;stroke-miterlimit:4;stroke-dasharray:none;stroke-opacity:1;marker-start:url(#marker18787)" />
      <path
         inkscape:connection-start="#rect16171-4"
         inkscape:connector-curvature="0"
         inkscape:connector-type="polyline"
         id="path18587-0"
         d="m 127.06844,1093.97 0.7887,48.1594"
         style="fill:none;fill-rule:evenodd;stroke:#000000;stroke-width:4;stroke-linecap:butt;stroke-linejoin:miter;stroke-miterlimit:4;stroke-dasharray:none;stroke-opacity:1;marker-end:url(#marker22306)" />
      <g
         id="g19721-0-1"
         transform="translate(-0.04170087,63.069469)">
        <g
           id="g19711-9-1">
          <g
             transform="translate(10.505076,0.25253814)"
             id="g19701-6-7">
            <rect
               style="opacity:1;fill:#fdca98;fill-opacity:1;stroke:#ee6103;stroke-width:0.84244156;stroke-linecap:butt;stroke-linejoin:bevel;stroke-miterlimit:4;stroke-dasharray:none;stroke-opacity:1"
               id="rect12801-1-1-2-7"
               width="95.157555"
               height="63.014515"
               x="21.849794"
               y="796.78345" />
            <text
               xml:space="preserve"
               style="font-style:normal;font-variant:normal;font-weight:normal;font-stretch:normal;font-size:20px;line-height:125%;font-family:monospace;-inkscape-font-specification:monospace;letter-spacing:0px;word-spacing:0px;fill:#000000;fill-opacity:1;stroke:none;stroke-width:1px;stroke-linecap:butt;stroke-linejoin:miter;stroke-opacity:1"
               x="32.758652"
               y="835.74677"
               id="text12803-9-8-0-5"
               sodipodi:linespacing="125%"><tspan
                 sodipodi:role="line"
                 id="tspan12805-4-7-0-8"
                 x="32.758652"
                 y="835.74677">header</tspan></text>
          </g>
          <g
             transform="translate(-20,0.12626907)"
             id="g19706-1-5">
            <rect
               style="opacity:1;fill:#fdca98;fill-opacity:1;stroke:#ee6103;stroke-width:0.84338677;stroke-linecap:butt;stroke-linejoin:bevel;stroke-miterlimit:4;stroke-dasharray:none;stroke-opacity:1"
               id="rect12801-8-6-3-7-6"
               width="95.156616"
               height="63.156612"
               x="148.42171"
               y="796.78394" />
            <text
               xml:space="preserve"
               style="font-style:normal;font-weight:normal;font-size:20px;line-height:125%;font-family:'Bitstream Vera Sans';letter-spacing:0px;word-spacing:0px;fill:#000000;fill-opacity:1;stroke:none;stroke-width:1px;stroke-linecap:butt;stroke-linejoin:miter;stroke-opacity:1"
               x="153.89064"
               y="833.93353"
               id="text12827-1-9-3-0"
               sodipodi:linespacing="125%"><tspan
                 sodipodi:role="line"
                 id="tspan12829-3-5-3-4"
                 x="153.89064"
                 y="833.93353"
                 style="font-style:normal;font-variant:normal;font-weight:normal;font-stretch:normal;font-family:monospace;-inkscape-font-specification:monospace">payload</tspan></text>
          </g>
        </g>
        <text
           xml:space="preserve"
           style="font-style:normal;font-weight:normal;font-size:20px;line-height:125%;font-family:'Bitstream Vera Sans';letter-spacing:0px;word-spacing:0px;fill:#000000;fill-opacity:1;stroke:none;stroke-width:1px;stroke-linecap:butt;stroke-linejoin:miter;stroke-opacity:1"
           x="235.63364"
           y="835.64246"
           id="text12979-1-1"
           sodipodi:linespacing="125%"><tspan
             sodipodi:role="line"
             id="tspan12981-6-2"
             x="235.63364"
             y="835.64246">1</tspan></text>
      </g>
      <g
         id="g19721-8-95"
         transform="translate(-0.04170087,126.78376)">
        <g
           id="g19711-92-8">
          <g
             transform="translate(10.505076,0.25253814)"
             id="g19701-8-8">
            <rect
               style="opacity:1;fill:#fdca98;fill-opacity:1;stroke:#ee6103;stroke-width:0.84244156;stroke-linecap:butt;stroke-linejoin:bevel;stroke-miterlimit:4;stroke-dasharray:none;stroke-opacity:1"
               id="rect12801-1-1-0-4"
               width="95.157555"
               height="63.014515"
               x="21.849794"
               y="796.78345" />
            <text
               xml:space="preserve"
               style="font-style:normal;font-variant:normal;font-weight:normal;font-stretch:normal;font-size:20px;line-height:125%;font-family:monospace;-inkscape-font-specification:monospace;letter-spacing:0px;word-spacing:0px;fill:#000000;fill-opacity:1;stroke:none;stroke-width:1px;stroke-linecap:butt;stroke-linejoin:miter;stroke-opacity:1"
               x="32.758652"
               y="835.74677"
               id="text12803-9-8-00-2"
               sodipodi:linespacing="125%"><tspan
                 sodipodi:role="line"
                 id="tspan12805-4-7-3-1"
                 x="32.758652"
                 y="835.74677">header</tspan></text>
          </g>
          <g
             transform="translate(-20,0.12626907)"
             id="g19706-3-2">
            <rect
               style="opacity:1;fill:#fdca98;fill-opacity:1;stroke:#ee6103;stroke-width:0.84338677;stroke-linecap:butt;stroke-linejoin:bevel;stroke-miterlimit:4;stroke-dasharray:none;stroke-opacity:1"
               id="rect12801-8-6-3-9-8"
               width="95.156616"
               height="63.156612"
               x="148.42171"
               y="796.78394" />
            <text
               xml:space="preserve"
               style="font-style:normal;font-weight:normal;font-size:20px;line-height:125%;font-family:'Bitstream Vera Sans';letter-spacing:0px;word-spacing:0px;fill:#000000;fill-opacity:1;stroke:none;stroke-width:1px;stroke-linecap:butt;stroke-linejoin:miter;stroke-opacity:1"
               x="153.89064"
               y="833.93353"
               id="text12827-1-9-37-8"
               sodipodi:linespacing="125%"><tspan
                 sodipodi:role="line"
                 id="tspan12829-3-5-9-3"
                 x="153.89064"
                 y="833.93353"
                 style="font-style:normal;font-variant:normal;font-weight:normal;font-stretch:normal;font-family:monospace;-inkscape-font-specification:monospace">payload</tspan></text>
          </g>
        </g>
        <text
           xml:space="preserve"
           style="font-style:normal;font-weight:normal;font-size:20px;line-height:125%;font-family:'Bitstream Vera Sans';letter-spacing:0px;word-spacing:0px;fill:#000000;fill-opacity:1;stroke:none;stroke-width:1px;stroke-linecap:butt;stroke-linejoin:miter;stroke-opacity:1"
           x="235.63364"
           y="835.64246"
           id="text12979-6-5"
           sodipodi:linespacing="125%"><tspan
             sodipodi:role="line"
             id="tspan12981-1-2"
             x="235.63364"
             y="835.64246">2</tspan></text>
      </g>
      <g
         id="g19721-8-9-0"
         transform="translate(-0.04170087,190.13476)">
        <g
           id="g19711-92-4-6">
          <g
             transform="translate(10.505076,0.25253814)"
             id="g19701-8-5-8">
            <rect
               style="opacity:1;fill:#fdca98;fill-opacity:1;stroke:#ee6103;stroke-width:0.84244156;stroke-linecap:butt;stroke-linejoin:bevel;stroke-miterlimit:4;stroke-dasharray:none;stroke-opacity:1"
               id="rect12801-1-1-0-3-1"
               width="95.157555"
               height="63.014515"
               x="21.849794"
               y="796.78345" />
            <text
               xml:space="preserve"
               style="font-style:normal;font-variant:normal;font-weight:normal;font-stretch:normal;font-size:20px;line-height:125%;font-family:monospace;-inkscape-font-specification:monospace;letter-spacing:0px;word-spacing:0px;fill:#000000;fill-opacity:1;stroke:none;stroke-width:1px;stroke-linecap:butt;stroke-linejoin:miter;stroke-opacity:1"
               x="32.758652"
               y="835.74677"
               id="text12803-9-8-00-6-9"
               sodipodi:linespacing="125%"><tspan
                 sodipodi:role="line"
                 id="tspan12805-4-7-3-4-9"
                 x="32.758652"
                 y="835.74677">header</tspan></text>
          </g>
          <g
             transform="translate(-20,0.12626907)"
             id="g19706-3-9-4">
            <rect
               style="opacity:1;fill:#fdca98;fill-opacity:1;stroke:#ee6103;stroke-width:0.84338677;stroke-linecap:butt;stroke-linejoin:bevel;stroke-miterlimit:4;stroke-dasharray:none;stroke-opacity:1"
               id="rect12801-8-6-3-9-9-0"
               width="95.156616"
               height="63.156612"
               x="148.42171"
               y="796.78394" />
            <text
               xml:space="preserve"
               style="font-style:normal;font-weight:normal;font-size:20px;line-height:125%;font-family:'Bitstream Vera Sans';letter-spacing:0px;word-spacing:0px;fill:#000000;fill-opacity:1;stroke:none;stroke-width:1px;stroke-linecap:butt;stroke-linejoin:miter;stroke-opacity:1"
               x="153.89064"
               y="833.93353"
               id="text12827-1-9-37-6-8"
               sodipodi:linespacing="125%"><tspan
                 sodipodi:role="line"
                 id="tspan12829-3-5-9-2-2"
                 x="153.89064"
                 y="833.93353"
                 style="font-style:normal;font-variant:normal;font-weight:normal;font-stretch:normal;font-family:monospace;-inkscape-font-specification:monospace">payload</tspan></text>
          </g>
        </g>
        <text
           xml:space="preserve"
           style="font-style:normal;font-weight:normal;font-size:20px;line-height:125%;font-family:'Bitstream Vera Sans';letter-spacing:0px;word-spacing:0px;fill:#000000;fill-opacity:1;stroke:none;stroke-width:1px;stroke-linecap:butt;stroke-linejoin:miter;stroke-opacity:1"
           x="235.63364"
           y="835.64246"
           id="text12979-6-0-5"
           sodipodi:linespacing="125%"><tspan
             sodipodi:role="line"
             id="tspan12981-1-3-6"
             x="235.63364"
             y="835.64246">3</tspan></text>
      </g>
    </g>
  </g>
</svg>
