(---------------------------------------------------------------------)
(                                                                     )
(    QUICKPLACE LOG                                                   )
(                                                                     )
(    Drawing          : pc049a_toplevel_32.brd                        )
(    Software Version : 16.6S014                                      )
(    Date/Time        : Tue Jul 29 17:07:57 2014                      )
(                                                                     )
(---------------------------------------------------------------------)


State: Placing on layer TOP

         Placed symbol:  R79 / RSMD0805_-00, / C0805 at (-52.7918 130.6702)
         Placed symbol:  R80 / RSMD0805_-00, / C0805 at (-48.8336 130.6702)
         Placed symbol:  LK1 / 1-HOLE_0-8-BASE / 1-HOLE_0-8P at (-45.8898 130.7108)
         Placed symbol:  LK2 / 1-HOLE_0-8-BASE / 1-HOLE_0-8P at (-43.7054 130.7108)
         Placed symbol:  LK3 / 1-HOLE_0-8-BASE / 1-HOLE_0-8P at (-41.5210 130.7108)
         Placed symbol:  LK4 / 1-HOLE_0-8-BASE / 1-HOLE_0-8P at (-39.3366 130.7108)
         Placed symbol:  LK5 / 1-HOLE_0-8-BASE / 1-HOLE_0-8P at (-37.1522 130.7108)
         Placed symbol:  LK6 / 1-HOLE_0-8-BASE / 1-HOLE_0-8P at (-34.9678 130.7108)
         Placed symbol:  LK7 / 1-HOLE_0-8-BASE / 1-HOLE_0-8P at (-32.7834 130.7108)
         Placed symbol:  LK8 / 1-HOLE_0-8-BASE / 1-HOLE_0-8P at (-30.5990 130.7108)
         Placed symbol:  LK9 / 1-HOLE_0-8-BASE / 1-HOLE_0-8P at (-28.4146 130.7108)


Placed 11 of 11 applicable (11 total) symbols.

-----------------------------------------------------------------------

