<?xml version="1.0" encoding="UTF-8" standalone="no"?>
<!-- Created with Inkscape (http://www.inkscape.org/) -->

<svg
   xmlns:dc="http://purl.org/dc/elements/1.1/"
   xmlns:cc="http://creativecommons.org/ns#"
   xmlns:rdf="http://www.w3.org/1999/02/22-rdf-syntax-ns#"
   xmlns:svg="http://www.w3.org/2000/svg"
   xmlns="http://www.w3.org/2000/svg"
   xmlns:sodipodi="http://sodipodi.sourceforge.net/DTD/sodipodi-0.dtd"
   xmlns:inkscape="http://www.inkscape.org/namespaces/inkscape"
   width="408.48032"
   height="231.31496"
   id="svg2"
   version="1.1"
   inkscape:version="0.48.3.1 r9886"
   sodipodi:docname="pts-sys.svg">
  <defs
     id="defs4">
    <marker
       inkscape:stockid="TriangleOutS"
       orient="auto"
       refY="0.0"
       refX="0.0"
       id="TriangleOutS"
       style="overflow:visible">
      <path
         id="path3933"
         d="M 5.77,0.0 L -2.88,5.0 L -2.88,-5.0 L 5.77,0.0 z "
         style="fill-rule:evenodd;stroke:#000000;stroke-width:1.0pt"
         transform="scale(0.2)" />
    </marker>
    <marker
       inkscape:stockid="TriangleInS"
       orient="auto"
       refY="0.0"
       refX="0.0"
       id="TriangleInS"
       style="overflow:visible">
      <path
         id="path3924"
         d="M 5.77,0.0 L -2.88,5.0 L -2.88,-5.0 L 5.77,0.0 z "
         style="fill-rule:evenodd;stroke:#000000;stroke-width:1.0pt"
         transform="scale(-0.2)" />
    </marker>
    <marker
       inkscape:stockid="TriangleInL"
       orient="auto"
       refY="0.0"
       refX="0.0"
       id="TriangleInL"
       style="overflow:visible">
      <path
         id="path3918"
         d="M 5.77,0.0 L -2.88,5.0 L -2.88,-5.0 L 5.77,0.0 z "
         style="fill-rule:evenodd;stroke:#000000;stroke-width:1.0pt"
         transform="scale(-0.8)" />
    </marker>
    <marker
       inkscape:stockid="TriangleOutM"
       orient="auto"
       refY="0.0"
       refX="0.0"
       id="TriangleOutM"
       style="overflow:visible">
      <path
         id="path3930"
         d="M 5.77,0.0 L -2.88,5.0 L -2.88,-5.0 L 5.77,0.0 z "
         style="fill-rule:evenodd;stroke:#000000;stroke-width:1.0pt"
         transform="scale(0.4)" />
    </marker>
    <marker
       inkscape:stockid="TriangleInM"
       orient="auto"
       refY="0.0"
       refX="0.0"
       id="TriangleInM"
       style="overflow:visible">
      <path
         id="path3921"
         d="M 5.77,0.0 L -2.88,5.0 L -2.88,-5.0 L 5.77,0.0 z "
         style="fill-rule:evenodd;stroke:#000000;stroke-width:1.0pt"
         transform="scale(-0.4)" />
    </marker>
  </defs>
  <sodipodi:namedview
     id="base"
     pagecolor="#ffffff"
     bordercolor="#666666"
     borderopacity="1.0"
     inkscape:pageopacity="0.0"
     inkscape:pageshadow="2"
     inkscape:zoom="1.4"
     inkscape:cx="213.83246"
     inkscape:cy="179.57227"
     inkscape:document-units="px"
     inkscape:current-layer="layer1"
     showgrid="true"
     inkscape:window-width="1855"
     inkscape:window-height="1176"
     inkscape:window-x="65"
     inkscape:window-y="24"
     inkscape:window-maximized="1"
     fit-margin-top="0"
     fit-margin-left="0"
     fit-margin-right="0"
     fit-margin-bottom="0">
    <inkscape:grid
       type="xygrid"
       id="grid2985"
       empspacing="5"
       visible="true"
       enabled="true"
       snapvisiblegridlinesonly="true"
       units="mm"
       spacingx="0.5mm"
       spacingy="0.5mm"
       originx="-27.358889mm"
       originy="-214.85889mm" />
  </sodipodi:namedview>
  <metadata
     id="metadata7">
    <rdf:RDF>
      <cc:Work
         rdf:about="">
        <dc:format>image/svg+xml</dc:format>
        <dc:type
           rdf:resource="http://purl.org/dc/dcmitype/StillImage" />
        <dc:title />
      </cc:Work>
    </rdf:RDF>
  </metadata>
  <g
     inkscape:label="Layer 1"
     inkscape:groupmode="layer"
     id="layer1"
     transform="translate(-96.940943,-59.736197)">
    <path
       style="fill:none;stroke:#000000;stroke-width:1;stroke-linecap:butt;stroke-linejoin:miter;stroke-miterlimit:4;stroke-opacity:1;stroke-dasharray:none"
       d="m 106.29921,109.8425 0,62.00788 97.44094,0 0,-62.00788 z"
       id="path3775"
       inkscape:connector-curvature="0" />
    <path
       inkscape:connector-curvature="0"
       id="path3796"
       d="m 111.61417,113.22475 0,55.24338 86.81102,0 0,-55.24338 z"
       style="fill:#000000;fill-opacity:0.1;stroke:#000000;stroke-width:0.5;stroke-linecap:butt;stroke-linejoin:miter;stroke-miterlimit:4;stroke-opacity:1;stroke-dasharray:none" />
    <path
       style="fill:none;stroke:#000000;stroke-width:2;stroke-linecap:butt;stroke-linejoin:miter;stroke-miterlimit:4;stroke-opacity:1;stroke-dasharray:none"
       d="m 203.74016,184.25195 c 79.72441,0 -16.41326,-78.99049 62.00787,-79.72441"
       id="path3808"
       inkscape:connector-curvature="0"
       sodipodi:nodetypes="cc" />
    <path
       style="fill:#ffffff;fill-opacity:1;stroke:#000000;stroke-width:1px;stroke-linecap:butt;stroke-linejoin:miter;stroke-opacity:1"
       d="m 106.29921,171.85038 -8.858267,26.5748 115.157477,0 -8.85827,-26.5748 z"
       id="path3800"
       inkscape:connector-curvature="0" />
    <path
       inkscape:connector-curvature="0"
       id="path3802"
       d="m 109.84252,175.39368 -3.54331,10.62993 97.44094,0 -3.54331,-10.62993 z"
       style="opacity:0.98999999;fill:#000000;fill-opacity:0;stroke:#000000;stroke-width:0.5;stroke-linecap:butt;stroke-linejoin:miter;stroke-miterlimit:4;stroke-opacity:1;stroke-dasharray:none"
       sodipodi:nodetypes="ccccc" />
    <path
       sodipodi:nodetypes="ccccc"
       style="opacity:0.98999999;fill:#000000;fill-opacity:0;stroke:#000000;stroke-width:0.5;stroke-linecap:butt;stroke-linejoin:miter;stroke-miterlimit:4;stroke-opacity:1;stroke-dasharray:none"
       d="m 141.73228,189.56691 -1.77166,7.08662 19.48819,0 -1.28847,-7.08662 z"
       id="path3804"
       inkscape:connector-curvature="0" />
    <path
       style="fill:none;stroke:#000000;stroke-width:1px;stroke-linecap:butt;stroke-linejoin:miter;stroke-opacity:1"
       d="m 97.440943,198.42518 0,5.31496 115.157477,0 0,-5.31496"
       id="path3806"
       inkscape:connector-curvature="0" />
    <rect
       style="opacity:0.98999999;fill:none;stroke:#000000;stroke-opacity:1"
       id="rect3812"
       width="79.724396"
       height="70.866142"
       x="265.39194"
       y="69.094467" />
    <text
       xml:space="preserve"
       style="font-size:10px;font-style:normal;font-weight:normal;line-height:125%;letter-spacing:0px;word-spacing:0px;fill:#000000;fill-opacity:1;stroke:none;font-family:Sans"
       x="283.46457"
       y="107.15938"
       id="text3814"
       sodipodi:linespacing="125%"><tspan
         sodipodi:role="line"
         id="tspan3816"
         x="283.46457"
         y="107.15938"
         style="font-weight:bold">SysMon</tspan></text>
    <rect
       y="157.67714"
       x="371.69113"
       height="124.01575"
       width="124.01575"
       id="rect3818"
       style="opacity:0.98999999;fill:none;stroke:#000000;stroke-opacity:1" />
    <text
       sodipodi:linespacing="125%"
       id="text3820"
       y="223.32515"
       x="398.26593"
       style="font-size:10px;font-style:normal;font-weight:normal;line-height:125%;letter-spacing:0px;word-spacing:0px;fill:#000000;fill-opacity:1;stroke:none;font-family:Sans"
       xml:space="preserve"><tspan
         style="font-weight:bold"
         y="223.32515"
         x="398.26593"
         id="tspan3822"
         sodipodi:role="line">CONV-TTL-BLO</tspan></text>
    <rect
       style="opacity:0.98999999;fill:none;stroke:#000000;stroke-width:1;stroke-miterlimit:4;stroke-opacity:1;stroke-dasharray:none"
       id="rect3845"
       width="26.574802"
       height="212.59842"
       x="345.11633"
       y="69.094467" />
    <text
       xml:space="preserve"
       style="font-size:10px;font-style:normal;font-weight:normal;line-height:125%;letter-spacing:0px;word-spacing:0px;fill:#000000;fill-opacity:1;stroke:none;font-family:Sans"
       x="77.952736"
       y="-359.64566"
       id="text3847"
       sodipodi:linespacing="125%"
       transform="matrix(0,1,-1,0,0,0)"><tspan
         sodipodi:role="line"
         id="tspan3849"
         x="77.952736"
         y="-359.64566"
         style="font-weight:bold">VME Backplane</tspan></text>
    <rect
       style="opacity:0.98999999;fill:#000000;fill-opacity:0.2;stroke:#000000;stroke-width:1;stroke-miterlimit:4;stroke-opacity:1;stroke-dasharray:none"
       id="rect3851"
       width="8.8582706"
       height="44.291332"
       x="371.69113"
       y="166.53542" />
    <rect
       y="228.54329"
       x="371.69113"
       height="44.291332"
       width="8.8582706"
       id="rect3853"
       style="opacity:0.98999999;fill:#000000;fill-opacity:0.2;stroke:#000000;stroke-width:1;stroke-miterlimit:4;stroke-opacity:1;stroke-dasharray:none" />
    <rect
       style="opacity:0.98999999;fill:none;stroke:#000000;stroke-width:1;stroke-miterlimit:4;stroke-opacity:1;stroke-dasharray:none"
       id="rect3855"
       width="26.574871"
       height="62.007809"
       x="318.54153"
       y="157.67714" />
    <rect
       y="166.53542"
       x="336.25806"
       height="44.291332"
       width="8.8582706"
       id="rect3857"
       style="opacity:0.98999999;fill:#000000;fill-opacity:0.2;stroke:#000000;stroke-width:1;stroke-miterlimit:4;stroke-opacity:1;stroke-dasharray:none" />
    <text
       xml:space="preserve"
       style="font-size:10px;font-style:normal;font-weight:normal;line-height:125%;letter-spacing:0px;word-spacing:0px;fill:#000000;fill-opacity:1;stroke:none;font-family:Sans"
       x="313.22656"
       y="177.16533"
       id="text3859"
       sodipodi:linespacing="125%"><tspan
         sodipodi:role="line"
         id="tspan3861"
         x="313.22656"
         y="177.16533"
         style="font-weight:bold;text-align:end;text-anchor:end">RTM</tspan><tspan
         sodipodi:role="line"
         x="313.22656"
         y="189.66533"
         style="font-weight:bold;text-align:end;text-anchor:end"
         id="tspan3863">Interface</tspan><tspan
         sodipodi:role="line"
         x="313.22656"
         y="202.16533"
         style="font-weight:bold;text-align:end;text-anchor:end"
         id="tspan3865">Tester</tspan></text>
    <rect
       style="opacity:0.98999999;fill:none;stroke:#000000;stroke-width:1;stroke-miterlimit:4;stroke-opacity:1;stroke-dasharray:3, 3;stroke-dashoffset:0"
       id="rect3007"
       width="248.03149"
       height="230.31496"
       x="177.66536"
       y="-8.3582697"
       transform="translate(79.224409,68.594467)" />
    <text
       sodipodi:linespacing="125%"
       id="text3777"
       y="77.952736"
       x="496.06299"
       style="font-size:10px;font-style:normal;font-weight:normal;line-height:125%;letter-spacing:0px;word-spacing:0px;fill:#000000;fill-opacity:1;stroke:none;font-family:Sans"
       xml:space="preserve"><tspan
         style="font-size:12px;font-weight:bold;text-align:end;text-anchor:end"
         y="77.952736"
         x="496.06299"
         id="tspan3779"
         sodipodi:role="line">ELMA</tspan><tspan
         style="font-size:12px;font-weight:bold;text-align:end;text-anchor:end"
         y="92.952736"
         x="496.06299"
         sodipodi:role="line"
         id="tspan3781">crate</tspan></text>
    <path
       style="fill:none;stroke:#000000;stroke-width:2;stroke-linecap:butt;stroke-linejoin:miter;stroke-miterlimit:4;stroke-opacity:1;stroke-dasharray:none;marker-start:url(#TriangleInS);marker-end:url(#TriangleOutS)"
       d="m 252.0748,44.791339 3.54331,0 0,147.047241 15.94488,0"
       id="path3011"
       inkscape:connector-curvature="0"
       transform="translate(96.940943,59.736197)"
       sodipodi:nodetypes="cccc" />
    <text
       xml:space="preserve"
       style="font-size:10px;font-style:normal;font-weight:normal;line-height:125%;letter-spacing:0px;word-spacing:0px;fill:#000000;fill-opacity:1;stroke:none;font-family:Sans"
       x="354.33072"
       y="248.03148"
       id="text5169"
       sodipodi:linespacing="125%"><tspan
         sodipodi:role="line"
         id="tspan5171"
         x="354.33072"
         y="248.03148">I<tspan
   style="font-size:65.00091553%;baseline-shift:super"
   id="tspan5173">2</tspan>C</tspan></text>
    <text
       transform="matrix(0,1,-1,0,0,0)"
       sodipodi:linespacing="125%"
       id="text5175"
       y="-373.89371"
       x="176.24016"
       style="font-size:10px;font-style:normal;font-weight:normal;line-height:125%;letter-spacing:0px;word-spacing:0px;fill:#000000;fill-opacity:1;stroke:none;font-family:Sans"
       xml:space="preserve"><tspan
         style="font-size:6px;font-weight:bold"
         y="-373.89371"
         x="176.24016"
         id="tspan5177"
         sodipodi:role="line">VME P2</tspan></text>
    <text
       xml:space="preserve"
       style="font-size:10px;font-style:normal;font-weight:normal;line-height:125%;letter-spacing:0px;word-spacing:0px;fill:#000000;fill-opacity:1;stroke:none;font-family:Sans"
       x="238.19383"
       y="-373.93326"
       id="text5179"
       sodipodi:linespacing="125%"
       transform="matrix(0,1,-1,0,0,0)"><tspan
         sodipodi:role="line"
         id="tspan5181"
         x="238.19383"
         y="-373.93326"
         style="font-size:6px;font-weight:bold">VME P1</tspan></text>
  </g>
</svg>
