<?xml version="1.0" encoding="UTF-8" standalone="no"?>
<!-- Created with Inkscape (http://www.inkscape.org/) -->

<svg
   xmlns:dc="http://purl.org/dc/elements/1.1/"
   xmlns:cc="http://creativecommons.org/ns#"
   xmlns:rdf="http://www.w3.org/1999/02/22-rdf-syntax-ns#"
   xmlns:svg="http://www.w3.org/2000/svg"
   xmlns="http://www.w3.org/2000/svg"
   xmlns:sodipodi="http://sodipodi.sourceforge.net/DTD/sodipodi-0.dtd"
   xmlns:inkscape="http://www.inkscape.org/namespaces/inkscape"
   width="213.41309"
   height="92.352501"
   id="svg5294"
   version="1.1"
   inkscape:version="0.48.3.1 r9886"
   sodipodi:docname="loopback.svg">
  <defs
     id="defs5296" />
  <sodipodi:namedview
     id="base"
     pagecolor="#ffffff"
     bordercolor="#666666"
     borderopacity="1.0"
     inkscape:pageopacity="0.0"
     inkscape:pageshadow="2"
     inkscape:zoom="5.6"
     inkscape:cx="133.93579"
     inkscape:cy="28.72056"
     inkscape:document-units="px"
     inkscape:current-layer="layer1"
     showgrid="true"
     fit-margin-top="0"
     fit-margin-left="0"
     fit-margin-right="0"
     fit-margin-bottom="0"
     inkscape:window-width="1855"
     inkscape:window-height="1176"
     inkscape:window-x="65"
     inkscape:window-y="24"
     inkscape:window-maximized="1">
    <inkscape:grid
       type="xygrid"
       id="grid5313"
       empspacing="5"
       visible="true"
       enabled="true"
       snapvisiblegridlinesonly="true"
       originx="-60.981445px"
       originy="-778.6475px" />
  </sodipodi:namedview>
  <metadata
     id="metadata5299">
    <rdf:RDF>
      <cc:Work
         rdf:about="">
        <dc:format>image/svg+xml</dc:format>
        <dc:type
           rdf:resource="http://purl.org/dc/dcmitype/StillImage" />
        <dc:title />
      </cc:Work>
    </rdf:RDF>
  </metadata>
  <g
     inkscape:label="Layer 1"
     inkscape:groupmode="layer"
     id="layer1"
     transform="translate(-60.981445,-181.36218)">
    <path
       style="fill:none;stroke:#cccccc;stroke-width:1px;stroke-linecap:butt;stroke-linejoin:miter;stroke-opacity:1"
       d="m 210,217.36218 35,0 0,10"
       id="path6114"
       inkscape:connector-curvature="0" />
    <path
       inkscape:connector-curvature="0"
       d="m 210,182.36218 0,90.3525"
       style="fill:none;stroke:#000000;stroke-width:2;stroke-linecap:butt;stroke-linejoin:miter;stroke-miterlimit:4;stroke-opacity:1;stroke-dasharray:8, 8;stroke-dashoffset:0"
       id="path2300" />
    <text
       style="font-size:15px"
       y="191.21986"
       x="168.16563"
       id="text2302">
      <tspan
         style="font-size:10px;font-variant:normal;font-weight:bold;writing-mode:lr-tb;fill:#000000;fill-opacity:1;fill-rule:nonzero;stroke:none;font-family:DejaVu Sans Bold;-inkscape-font-specification:DejaVuSans-Bold"
         x="168.16563 172.94563 179.72563 185.67563 190.46564 197.23563 215.99564 223.04562 229.85564 236.22565 240.38564 247.99564 254.00563"
         y="191.21986"
         sodipodi:role="line"
         id="tspan2304">testerTTL-BLO</tspan>
    </text>
    <rect
       style="fill:none;stroke:#0000ff;stroke-width:1px;stroke-linecap:butt;stroke-linejoin:miter;stroke-opacity:1"
       id="rect5317"
       width="24.999935"
       height="10.000041"
       x="155.00006"
       y="212.36218" />
    <text
       xml:space="preserve"
       style="font-size:40px;font-style:normal;font-weight:normal;line-height:125%;letter-spacing:0px;word-spacing:0px;fill:#000000;fill-opacity:1;stroke:none;font-family:Sans"
       x="155"
       y="232.36218"
       id="text6096"
       sodipodi:linespacing="125%"><tspan
         sodipodi:role="line"
         id="tspan6098"
         x="155"
         y="232.36218"
         style="font-size:10px;fill:#0000ff;fill-opacity:1">150R</tspan></text>
    <path
       style="fill:none;stroke:#00007b;stroke-width:1px;stroke-linecap:butt;stroke-linejoin:miter;stroke-opacity:1"
       d="m 95,197.36218 30,0 0,40 -29,0"
       id="path6100"
       inkscape:connector-curvature="0"
       sodipodi:nodetypes="cccc" />
    <path
       style="fill:none;stroke:#00007b;stroke-width:1px;stroke-linecap:butt;stroke-linejoin:miter;stroke-opacity:1"
       d="m 95,217.36218 60,0"
       id="path6102"
       inkscape:connector-curvature="0" />
    <path
       style="fill:none;stroke:#00007b;stroke-width:1px;stroke-linecap:butt;stroke-linejoin:miter;stroke-opacity:1"
       d="m 180,217.36218 30,0"
       id="path6104"
       inkscape:connector-curvature="0" />
    <rect
       y="239.99995"
       x="-252.36212"
       height="10.000041"
       width="24.999935"
       id="rect6106"
       style="fill:none;stroke:#cccccc;stroke-width:1px;stroke-linecap:butt;stroke-linejoin:miter;stroke-opacity:1"
       transform="matrix(0,-1,1,0,0,0)" />
    <text
       sodipodi:linespacing="125%"
       id="text6108"
       y="242.36218"
       x="255"
       style="font-size:40px;font-style:normal;font-weight:normal;line-height:125%;letter-spacing:0px;word-spacing:0px;fill:#000000;fill-opacity:1;stroke:none;font-family:Sans"
       xml:space="preserve"><tspan
         style="font-size:10px;fill:#cccccc;fill-opacity:1"
         y="242.36218"
         x="255"
         id="tspan6110"
         sodipodi:role="line">50R</tspan></text>
    <path
       style="fill:none;stroke:#cccccc;stroke-width:1px;stroke-linecap:butt;stroke-linejoin:miter;stroke-opacity:1"
       d="m 245,252.36218 0,10"
       id="path6116"
       inkscape:connector-curvature="0" />
    <path
       style="fill:none;stroke:#cccccc;stroke-width:1px;stroke-linecap:butt;stroke-linejoin:miter;stroke-opacity:1"
       d="m 240,262.36218 10,0"
       id="path6118"
       inkscape:connector-curvature="0" />
    <text
       sodipodi:linespacing="125%"
       id="text6120"
       y="192.36218"
       x="60"
       style="font-size:40px;font-style:normal;font-weight:normal;line-height:125%;letter-spacing:0px;word-spacing:0px;fill:#000000;fill-opacity:1;stroke:none;font-family:Sans"
       xml:space="preserve"><tspan
         style="font-size:10px;fill:#ad0000;fill-opacity:1"
         y="192.36218"
         x="60"
         id="tspan6122"
         sodipodi:role="line">BLO_R_1_P</tspan></text>
    <path
       sodipodi:type="arc"
       style="fill:#00007b;fill-opacity:1;stroke:none"
       id="path6124"
       sodipodi:cx="126"
       sodipodi:cy="217.36218"
       sodipodi:rx="3"
       sodipodi:ry="3"
       d="m 129,217.36218 c 0,1.65686 -1.34315,3 -3,3 -1.65685,0 -3,-1.34314 -3,-3 0,-1.65685 1.34315,-3 3,-3 1.65685,0 3,1.34315 3,3 z"
       transform="translate(-1,0)" />
    <text
       xml:space="preserve"
       style="font-size:40px;font-style:normal;font-weight:normal;line-height:125%;letter-spacing:0px;word-spacing:0px;fill:#000000;fill-opacity:1;stroke:none;font-family:Sans"
       x="60"
       y="212.36218"
       id="text6126"
       sodipodi:linespacing="125%"><tspan
         sodipodi:role="line"
         id="tspan6128"
         x="60"
         y="212.36218"
         style="font-size:10px;fill:#ad0000;fill-opacity:1">BLO_C_6_P</tspan></text>
    <text
       sodipodi:linespacing="125%"
       id="text6130"
       y="232.36218"
       x="60"
       style="font-size:40px;font-style:normal;font-weight:normal;line-height:125%;letter-spacing:0px;word-spacing:0px;fill:#000000;fill-opacity:1;stroke:none;font-family:Sans"
       xml:space="preserve"><tspan
         style="font-size:10px;fill:#ad0000;fill-opacity:1"
         y="232.36218"
         x="60"
         id="tspan6132"
         sodipodi:role="line">BLO_L_5_P</tspan></text>
  </g>
</svg>
