<?xml version="1.0" encoding="UTF-8" standalone="no"?>
<!-- Created with Inkscape (http://www.inkscape.org/) -->

<svg
   xmlns:dc="http://purl.org/dc/elements/1.1/"
   xmlns:cc="http://creativecommons.org/ns#"
   xmlns:rdf="http://www.w3.org/1999/02/22-rdf-syntax-ns#"
   xmlns:svg="http://www.w3.org/2000/svg"
   xmlns="http://www.w3.org/2000/svg"
   xmlns:sodipodi="http://sodipodi.sourceforge.net/DTD/sodipodi-0.dtd"
   xmlns:inkscape="http://www.inkscape.org/namespaces/inkscape"
   width="326.94205"
   height="161.99739"
   id="svg3341"
   version="1.1"
   inkscape:version="0.48.3.1 r9886"
   sodipodi:docname="blo-outp-stage.svg">
  <defs
     id="defs3343">
    <marker
       inkscape:stockid="TriangleInS"
       orient="auto"
       refY="0"
       refX="0"
       id="TriangleInS"
       style="overflow:visible">
      <path
         inkscape:connector-curvature="0"
         id="path4916"
         d="m 5.77,0 -8.65,5 0,-10 8.65,5 z"
         style="fill-rule:evenodd;stroke:#000000;stroke-width:1pt"
         transform="scale(-0.2,-0.2)" />
    </marker>
    <marker
       inkscape:stockid="TriangleOutS"
       orient="auto"
       refY="0"
       refX="0"
       id="TriangleOutS"
       style="overflow:visible">
      <path
         inkscape:connector-curvature="0"
         id="path4925"
         d="m 5.77,0 -8.65,5 0,-10 8.65,5 z"
         style="fill-rule:evenodd;stroke:#000000;stroke-width:1pt"
         transform="scale(0.2,0.2)" />
    </marker>
    <marker
       inkscape:stockid="TriangleInS"
       orient="auto"
       refY="0"
       refX="0"
       id="marker3228"
       style="overflow:visible">
      <path
         inkscape:connector-curvature="0"
         id="path3230"
         d="m 5.77,0 -8.65,5 0,-10 8.65,5 z"
         style="fill-rule:evenodd;stroke:#000000;stroke-width:1pt"
         transform="scale(-0.2,-0.2)" />
    </marker>
    <marker
       inkscape:stockid="TriangleOutS"
       orient="auto"
       refY="0"
       refX="0"
       id="marker3232"
       style="overflow:visible">
      <path
         inkscape:connector-curvature="0"
         id="path3234"
         d="m 5.77,0 -8.65,5 0,-10 8.65,5 z"
         style="fill-rule:evenodd;stroke:#000000;stroke-width:1pt"
         transform="scale(0.2,0.2)" />
    </marker>
    <marker
       inkscape:stockid="TriangleOutM"
       orient="auto"
       refY="0"
       refX="0"
       id="TriangleOutM"
       style="overflow:visible">
      <path
         id="path3944"
         d="m 5.77,0 -8.65,5 0,-10 8.65,5 z"
         style="fill-rule:evenodd;stroke:#000000;stroke-width:1pt"
         transform="scale(0.4,0.4)"
         inkscape:connector-curvature="0" />
    </marker>
    <marker
       inkscape:stockid="TriangleOutM"
       orient="auto"
       refY="0"
       refX="0"
       id="marker3238"
       style="overflow:visible">
      <path
         id="path3240"
         d="m 5.77,0 -8.65,5 0,-10 8.65,5 z"
         style="fill-rule:evenodd;stroke:#000000;stroke-width:1pt"
         transform="scale(0.4,0.4)"
         inkscape:connector-curvature="0" />
    </marker>
  </defs>
  <sodipodi:namedview
     id="base"
     pagecolor="#ffffff"
     bordercolor="#666666"
     borderopacity="1.0"
     inkscape:pageopacity="0.0"
     inkscape:pageshadow="2"
     inkscape:zoom="2.8"
     inkscape:cx="122.49566"
     inkscape:cy="52.848425"
     inkscape:document-units="px"
     inkscape:current-layer="layer1"
     showgrid="false"
     fit-margin-top="0"
     fit-margin-left="0"
     fit-margin-right="0"
     fit-margin-bottom="0"
     inkscape:window-width="1855"
     inkscape:window-height="1176"
     inkscape:window-x="65"
     inkscape:window-y="24"
     inkscape:window-maximized="1" />
  <metadata
     id="metadata3346">
    <rdf:RDF>
      <cc:Work
         rdf:about="">
        <dc:format>image/svg+xml</dc:format>
        <dc:type
           rdf:resource="http://purl.org/dc/dcmitype/StillImage" />
      </cc:Work>
    </rdf:RDF>
  </metadata>
  <g
     inkscape:label="Layer 1"
     inkscape:groupmode="layer"
     id="layer1"
     transform="translate(-138.26969,-409.50665)">
    <g
       id="g4030"
       transform="translate(221.54246,367.03496)">
      <g
         transform="matrix(0,1,-1,0,184.25195,-14.173248)"
         id="g2995">
        <path
           style="fill:none;stroke:#000000;stroke-width:1px;stroke-linecap:butt;stroke-linejoin:miter;stroke-opacity:1"
           d="m 115.15748,95.669269 c 0,-3.543307 1.77165,-7.086614 5.31496,-7.086614 3.54331,0 5.31496,3.543307 5.31496,7.086614"
           id="path2987"
           inkscape:connector-curvature="0"
           sodipodi:nodetypes="ccc" />
        <path
           sodipodi:nodetypes="ccc"
           inkscape:connector-curvature="0"
           id="path2989"
           d="m 125.7874,95.669269 c 0,-3.543307 1.77165,-7.086614 5.31496,-7.086614 3.54331,0 5.31496,3.543307 5.31496,7.086614"
           style="fill:none;stroke:#000000;stroke-width:1px;stroke-linecap:butt;stroke-linejoin:miter;stroke-opacity:1" />
        <path
           sodipodi:nodetypes="ccc"
           inkscape:connector-curvature="0"
           id="path2991"
           d="m 136.41732,95.669269 c 0,-3.543307 1.77165,-7.086614 5.31496,-7.086614 3.54331,0 5.31496,3.543307 5.31496,7.086614"
           style="fill:none;stroke:#000000;stroke-width:1px;stroke-linecap:butt;stroke-linejoin:miter;stroke-opacity:1" />
        <path
           style="fill:none;stroke:#000000;stroke-width:1px;stroke-linecap:butt;stroke-linejoin:miter;stroke-opacity:1"
           d="m 147.04724,95.669269 c 0,-3.543307 1.77165,-7.086614 5.31496,-7.086614 3.54331,0 5.31496,3.543307 5.31496,7.086614"
           id="path2993"
           inkscape:connector-curvature="0"
           sodipodi:nodetypes="ccc" />
      </g>
      <path
         transform="matrix(0.66666654,0,0,0.66666654,30.413399,38.681109)"
         d="m 104.52756,94.78344 c 0,1.467685 -1.1898,2.65748 -2.65748,2.65748 -1.46769,0 -2.657481,-1.189795 -2.657481,-2.65748 0,-1.467686 1.189791,-2.657481 2.657481,-2.657481 1.46768,0 2.65748,1.189795 2.65748,2.657481 z"
         sodipodi:ry="2.6574802"
         sodipodi:rx="2.6574802"
         sodipodi:cy="94.78344"
         sodipodi:cx="101.87008"
         id="path3001"
         style="fill:#000000;fill-opacity:1;fill-rule:evenodd;stroke:#000000;stroke-width:1px;stroke-linecap:butt;stroke-linejoin:miter;stroke-opacity:1"
         sodipodi:type="arc" />
    </g>
    <g
       id="g4038"
       transform="translate(221.54246,367.03496)">
      <g
         id="g3781"
         transform="matrix(0,1,1,0,19.48821,-14.173248)">
        <path
           sodipodi:nodetypes="ccc"
           inkscape:connector-curvature="0"
           id="path3783"
           d="m 115.15748,95.669269 c 0,-3.543307 1.77165,-7.086614 5.31496,-7.086614 3.54331,0 5.31496,3.543307 5.31496,7.086614"
           style="fill:none;stroke:#000000;stroke-width:1px;stroke-linecap:butt;stroke-linejoin:miter;stroke-opacity:1" />
        <path
           style="fill:none;stroke:#000000;stroke-width:1px;stroke-linecap:butt;stroke-linejoin:miter;stroke-opacity:1"
           d="m 125.7874,95.669269 c 0,-3.543307 1.77165,-7.086614 5.31496,-7.086614 3.54331,0 5.31496,3.543307 5.31496,7.086614"
           id="path3785"
           inkscape:connector-curvature="0"
           sodipodi:nodetypes="ccc" />
        <path
           style="fill:none;stroke:#000000;stroke-width:1px;stroke-linecap:butt;stroke-linejoin:miter;stroke-opacity:1"
           d="m 136.41732,95.669269 c 0,-3.543307 1.77165,-7.086614 5.31496,-7.086614 3.54331,0 5.31496,3.543307 5.31496,7.086614"
           id="path3787"
           inkscape:connector-curvature="0"
           sodipodi:nodetypes="ccc" />
        <path
           sodipodi:nodetypes="ccc"
           inkscape:connector-curvature="0"
           id="path3789"
           d="m 147.04724,95.669269 c 0,-3.543307 1.77165,-7.086614 5.31496,-7.086614 3.54331,0 5.31496,3.543307 5.31496,7.086614"
           style="fill:none;stroke:#000000;stroke-width:1px;stroke-linecap:butt;stroke-linejoin:miter;stroke-opacity:1" />
      </g>
      <path
         sodipodi:type="arc"
         style="fill:#000000;fill-opacity:1;fill-rule:evenodd;stroke:#000000;stroke-width:1px;stroke-linecap:butt;stroke-linejoin:miter;stroke-opacity:1"
         id="path3791"
         sodipodi:cx="101.87008"
         sodipodi:cy="94.78344"
         sodipodi:rx="2.6574802"
         sodipodi:ry="2.6574802"
         d="m 104.52756,94.78344 c 0,1.467685 -1.1898,2.65748 -2.65748,2.65748 -1.46769,0 -2.657481,-1.189795 -2.657481,-2.65748 0,-1.467686 1.189791,-2.657481 2.657481,-2.657481 1.46768,0 2.65748,1.189795 2.65748,2.657481 z"
         transform="matrix(-0.66666654,0,0,0.66666654,173.32676,38.681109)" />
    </g>
    <path
       style="fill:none;stroke:#000000;stroke-width:1px;stroke-linecap:butt;stroke-linejoin:miter;stroke-opacity:1;marker-end:url(#TriangleOutM)"
       d="m 310.12514,468.01918 0,-49.60629"
       id="path3793"
       inkscape:connector-curvature="0" />
    <text
       xml:space="preserve"
       style="font-size:40px;font-style:normal;font-weight:normal;line-height:125%;letter-spacing:0px;word-spacing:0px;fill:#000000;fill-opacity:1;stroke:none;font-family:Sans"
       x="317.21176"
       y="418.4129"
       id="text4239"
       sodipodi:linespacing="125%"><tspan
         sodipodi:role="line"
         id="tspan4241"
         x="317.21176"
         y="418.4129"
         style="font-size:12px;font-weight:normal">27V</tspan></text>
    <path
       style="fill:none;stroke:#000000;stroke-width:1px;stroke-linecap:butt;stroke-linejoin:miter;stroke-opacity:1"
       d="m 310.12514,510.53887 0,31.88977 -8.85827,0 0,8.85827 8.85827,0 0,16.68734"
       id="path4243"
       inkscape:connector-curvature="0"
       sodipodi:nodetypes="cccccc" />
    <path
       style="fill:none;stroke:#000000;stroke-width:1px;stroke-linecap:butt;stroke-linejoin:miter;stroke-opacity:1"
       d="m 297.72357,538.88533 0,15.94488"
       id="path4247"
       inkscape:connector-curvature="0" />
    <path
       style="fill:none;stroke:#000000;stroke-width:1px;stroke-linecap:butt;stroke-linejoin:miter;stroke-opacity:1;marker-end:url(#TriangleOutM)"
       d="m 281.77868,546.85777 12.40158,0"
       id="path4249"
       inkscape:connector-curvature="0" />
    <rect
       style="fill:none;stroke:#000000;stroke-width:1px;stroke-linecap:butt;stroke-linejoin:miter;stroke-opacity:1"
       id="rect3008"
       width="17.716536"
       height="5.3149605"
       x="264.06213"
       y="544.20032" />
    <text
       xml:space="preserve"
       style="font-size:40px;font-style:normal;font-weight:normal;line-height:125%;letter-spacing:0px;word-spacing:0px;fill:#000000;fill-opacity:1;stroke:none;font-family:Sans"
       x="260.51883"
       y="540.65698"
       id="text3784"
       sodipodi:linespacing="125%"><tspan
         sodipodi:role="line"
         id="tspan3786"
         x="260.51883"
         y="540.65698"
         style="font-size:10px">200R</tspan></text>
    <path
       style="fill:none;stroke:#000000;stroke-width:1px;stroke-linecap:butt;stroke-linejoin:miter;stroke-opacity:1"
       d="m 177.45427,546.85777 86.96502,0"
       id="path3794"
       inkscape:connector-curvature="0"
       sodipodi:nodetypes="cc" />
    <path
       style="fill:none;stroke:#000000;stroke-width:1px;stroke-linecap:butt;stroke-linejoin:miter;stroke-opacity:1"
       d="m 280.00703,493.70816 0,-37.20472 30.11811,0"
       id="path3998"
       inkscape:connector-curvature="0"
       sodipodi:nodetypes="ccc" />
    <path
       sodipodi:type="arc"
       style="fill:#000000;fill-opacity:1;stroke-width:2;stroke-miterlimit:4;stroke-dasharray:8, 4;stroke-dashoffset:2.8"
       id="path4016"
       sodipodi:cx="88.58268"
       sodipodi:cy="89.468483"
       sodipodi:rx="0.88582677"
       sodipodi:ry="0.88582677"
       d="m 89.468507,89.468483 c 0,0.489229 -0.396599,0.885827 -0.885827,0.885827 -0.489229,0 -0.885827,-0.396598 -0.885827,-0.885827 0,-0.489229 0.396598,-0.885827 0.885827,-0.885827 0.489228,0 0.885827,0.396598 0.885827,0.885827 z"
       transform="matrix(1.9999971,0,0,1.9999971,132.96004,277.56674)" />
    <path
       transform="matrix(1.9999971,0,0,1.9999971,132.96004,341.34626)"
       d="m 89.468507,89.468483 c 0,0.489229 -0.396599,0.885827 -0.885827,0.885827 -0.489229,0 -0.885827,-0.396598 -0.885827,-0.885827 0,-0.489229 0.396598,-0.885827 0.885827,-0.885827 0.489228,0 0.885827,0.396598 0.885827,0.885827 z"
       sodipodi:ry="0.88582677"
       sodipodi:rx="0.88582677"
       sodipodi:cy="89.468483"
       sodipodi:cx="88.58268"
       id="path4046"
       style="fill:#000000;fill-opacity:1;stroke-width:2;stroke-miterlimit:4;stroke-dasharray:8, 4;stroke-dashoffset:2.8"
       sodipodi:type="arc" />
    <rect
       y="277.34955"
       x="-480.42078"
       height="5.3149605"
       width="17.716536"
       id="rect3994"
       style="fill:#ffffff;fill-opacity:1;stroke:#000000;stroke-width:1px;stroke-linecap:butt;stroke-linejoin:miter;stroke-opacity:1"
       transform="matrix(0,-1,1,0,0,0)" />
    <path
       transform="matrix(1.9999971,0,0,1.9999971,102.84192,277.56674)"
       d="m 89.468507,89.468483 c 0,0.489229 -0.396599,0.885827 -0.885827,0.885827 -0.489229,0 -0.885827,-0.396598 -0.885827,-0.885827 0,-0.489229 0.396598,-0.885827 0.885827,-0.885827 0.489228,0 0.885827,0.396598 0.885827,0.885827 z"
       sodipodi:ry="0.88582677"
       sodipodi:rx="0.88582677"
       sodipodi:cy="89.468483"
       sodipodi:cx="88.58268"
       id="path4048"
       style="fill:#000000;fill-opacity:1;stroke-width:2;stroke-miterlimit:4;stroke-dasharray:8, 4;stroke-dashoffset:2.8"
       sodipodi:type="arc" />
    <path
       sodipodi:type="arc"
       style="fill:#000000;fill-opacity:1;stroke-width:2;stroke-miterlimit:4;stroke-dasharray:8, 4;stroke-dashoffset:2.8"
       id="path4050"
       sodipodi:cx="88.58268"
       sodipodi:cy="89.468483"
       sodipodi:rx="0.88582677"
       sodipodi:ry="0.88582677"
       d="m 89.468507,89.468483 c 0,0.489229 -0.396599,0.885827 -0.885827,0.885827 -0.489229,0 -0.885827,-0.396598 -0.885827,-0.885827 0,-0.489229 0.396598,-0.885827 0.885827,-0.885827 0.489228,0 0.885827,0.396598 0.885827,0.885827 z"
       transform="matrix(1.9999971,0,0,1.9999971,102.84192,308.57067)" />
    <path
       style="fill:none;stroke:#000000;stroke-width:1px;stroke-linecap:butt;stroke-linejoin:miter;stroke-opacity:1"
       d="m 280.00703,501.6806 0,18.60237 30.11811,0"
       id="path4052"
       inkscape:connector-curvature="0" />
    <g
       id="g4077"
       transform="translate(221.54246,367.03496)">
      <path
         style="fill:none;stroke:#000000;stroke-width:1px;stroke-linecap:butt;stroke-linejoin:miter;stroke-opacity:1"
         d="m 31.889764,108.07084 5.314961,-7.08661 -10.629922,0 z"
         id="path4054"
         inkscape:connector-curvature="0" />
      <path
         inkscape:connector-curvature="0"
         id="path4056"
         d="m 25.688976,107.18502 0.885827,1.77165 10.629921,0 0.885827,1.77165"
         style="fill:none;stroke:#000000;stroke-width:1px;stroke-linecap:butt;stroke-linejoin:miter;stroke-opacity:1" />
    </g>
    <path
       style="fill:none;stroke:#000000;stroke-width:1px;stroke-linecap:butt;stroke-linejoin:miter;stroke-opacity:1"
       d="m 280.00703,456.50344 -26.5748,0 0,11.51574"
       id="path4058"
       inkscape:connector-curvature="0" />
    <path
       style="fill:none;stroke:#000000;stroke-width:1px;stroke-linecap:butt;stroke-linejoin:miter;stroke-opacity:1"
       d="m 253.43223,475.99162 0,11.51575 26.5748,0"
       id="path4060"
       inkscape:connector-curvature="0"
       sodipodi:nodetypes="ccc" />
    <g
       id="g4064"
       transform="translate(221.54246,367.03496)">
      <path
         inkscape:connector-curvature="0"
         id="path3982"
         d="m 58.464567,127.55903 -5.314961,7.08661 10.629922,0 z"
         style="fill:none;stroke:#000000;stroke-width:1px;stroke-linecap:butt;stroke-linejoin:miter;stroke-opacity:1" />
      <path
         sodipodi:nodetypes="cc"
         inkscape:connector-curvature="0"
         id="path3984"
         d="m 54.035433,126.6732 8.858268,0"
         style="fill:none;stroke:#000000;stroke-width:1px;stroke-linecap:butt;stroke-linejoin:miter;stroke-opacity:1" />
      <path
         style="fill:none;stroke:#000000;stroke-width:1px;stroke-linecap:butt;stroke-linejoin:miter;stroke-opacity:1"
         d="m 58.464567,127.55903 -5.314961,7.08661 10.629922,0 z"
         id="path4062"
         inkscape:connector-curvature="0" />
    </g>
    <g
       id="g4069"
       transform="matrix(0,1,-1,0,520.50897,409.55462)">
      <path
         style="fill:none;stroke:#000000;stroke-width:1px;stroke-linecap:butt;stroke-linejoin:miter;stroke-opacity:1"
         d="m 58.464567,127.55903 -5.314961,7.08661 10.629922,0 z"
         id="path4071"
         inkscape:connector-curvature="0" />
      <path
         style="fill:none;stroke:#000000;stroke-width:1px;stroke-linecap:butt;stroke-linejoin:miter;stroke-opacity:1"
         d="m 54.035433,126.6732 8.858268,0"
         id="path4073"
         inkscape:connector-curvature="0"
         sodipodi:nodetypes="cc" />
      <path
         inkscape:connector-curvature="0"
         id="path4075"
         d="m 58.464567,127.55903 -5.314961,7.08661 10.629922,0 z"
         style="fill:none;stroke:#000000;stroke-width:1px;stroke-linecap:butt;stroke-linejoin:miter;stroke-opacity:1" />
    </g>
    <path
       style="fill:none;stroke:#000000;stroke-width:1px;stroke-linecap:butt;stroke-linejoin:miter;stroke-opacity:1"
       d="m 336.69994,468.01918 48.72047,0"
       id="path4081"
       inkscape:connector-curvature="0" />
    <path
       style="fill:none;stroke:#000000;stroke-width:1px;stroke-linecap:butt;stroke-linejoin:miter;stroke-opacity:1"
       d="m 393.39285,468.01918 54.03544,0"
       id="path4083"
       inkscape:connector-curvature="0"
       sodipodi:nodetypes="cc" />
    <path
       transform="matrix(1.9999971,0,0,1.9999971,186.10965,289.08248)"
       d="m 89.468507,89.468483 c 0,0.489229 -0.396599,0.885827 -0.885827,0.885827 -0.489229,0 -0.885827,-0.396598 -0.885827,-0.885827 0,-0.489229 0.396598,-0.885827 0.885827,-0.885827 0.489228,0 0.885827,0.396598 0.885827,0.885827 z"
       sodipodi:ry="0.88582677"
       sodipodi:rx="0.88582677"
       sodipodi:cy="89.468483"
       sodipodi:cx="88.58268"
       id="path4087"
       style="fill:#000000;fill-opacity:1;stroke-width:2;stroke-miterlimit:4;stroke-dasharray:8, 4;stroke-dashoffset:2.8"
       sodipodi:type="arc" />
    <path
       style="fill:none;stroke:#000000;stroke-width:1px;stroke-linecap:butt;stroke-linejoin:miter;stroke-opacity:1"
       d="m 336.69994,510.53887 110.72835,0"
       id="path4091"
       inkscape:connector-curvature="0"
       sodipodi:nodetypes="cc" />
    <path
       sodipodi:type="arc"
       style="fill:#000000;fill-opacity:1;stroke-width:2;stroke-miterlimit:4;stroke-dasharray:8, 4;stroke-dashoffset:2.8"
       id="path4093"
       sodipodi:cx="88.58268"
       sodipodi:cy="89.468483"
       sodipodi:rx="0.88582677"
       sodipodi:ry="0.88582677"
       d="m 89.468507,89.468483 c 0,0.489229 -0.396599,0.885827 -0.885827,0.885827 -0.489229,0 -0.885827,-0.396598 -0.885827,-0.885827 0,-0.489229 0.396598,-0.885827 0.885827,-0.885827 0.489228,0 0.885827,0.396598 0.885827,0.885827 z"
       transform="matrix(1.9999971,0,0,1.9999971,186.10965,331.60217)" />
    <path
       style="fill:none;stroke:#000000;stroke-width:1px;stroke-linecap:butt;stroke-linejoin:miter;stroke-opacity:1"
       d="m 363.27474,468.01918 0,42.51969"
       id="path4095"
       inkscape:connector-curvature="0" />
    <rect
       transform="matrix(0,-1,1,0,0,0)"
       style="fill:#ffffff;fill-opacity:1;stroke:#000000;stroke-width:1px;stroke-linecap:butt;stroke-linejoin:miter;stroke-opacity:1"
       id="rect4085"
       width="17.716536"
       height="5.3149605"
       x="-498.1373"
       y="360.61725" />
    <path
       sodipodi:type="arc"
       style="fill:#000000;fill-opacity:1;stroke-width:2;stroke-miterlimit:4;stroke-dasharray:8, 4;stroke-dashoffset:2.8"
       id="path4097"
       sodipodi:cx="88.58268"
       sodipodi:cy="89.468483"
       sodipodi:rx="0.88582677"
       sodipodi:ry="0.88582677"
       d="m 89.468507,89.468483 c 0,0.489229 -0.396599,0.885827 -0.885827,0.885827 -0.489229,0 -0.885827,-0.396598 -0.885827,-0.885827 0,-0.489229 0.396598,-0.885827 0.885827,-0.885827 0.489228,0 0.885827,0.396598 0.885827,0.885827 z"
       transform="matrix(1.9999971,0,0,1.9999971,186.10965,289.08248)" />
    <path
       transform="matrix(1.9999971,0,0,1.9999971,186.10965,331.60217)"
       d="m 89.468507,89.468483 c 0,0.489229 -0.396599,0.885827 -0.885827,0.885827 -0.489229,0 -0.885827,-0.396598 -0.885827,-0.885827 0,-0.489229 0.396598,-0.885827 0.885827,-0.885827 0.489228,0 0.885827,0.396598 0.885827,0.885827 z"
       sodipodi:ry="0.88582677"
       sodipodi:rx="0.88582677"
       sodipodi:cy="89.468483"
       sodipodi:cx="88.58268"
       id="path4099"
       style="fill:#000000;fill-opacity:1;stroke-width:2;stroke-miterlimit:4;stroke-dasharray:8, 4;stroke-dashoffset:2.8"
       sodipodi:type="arc" />
    <path
       inkscape:connector-curvature="0"
       id="path4101"
       d="m 363.27474,468.01918 0,42.51969"
       style="fill:none;stroke:#000000;stroke-width:1px;stroke-linecap:butt;stroke-linejoin:miter;stroke-opacity:1" />
    <rect
       y="360.61725"
       x="-498.1373"
       height="5.3149605"
       width="17.716536"
       id="rect4103"
       style="fill:#ffffff;fill-opacity:1;stroke:#000000;stroke-width:1px;stroke-linecap:butt;stroke-linejoin:miter;stroke-opacity:1"
       transform="matrix(0,-1,1,0,0,0)" />
    <path
       sodipodi:type="arc"
       style="fill:#000000;fill-opacity:1;stroke-width:2;stroke-miterlimit:4;stroke-dasharray:8, 4;stroke-dashoffset:2.8"
       id="path4105"
       sodipodi:cx="88.58268"
       sodipodi:cy="89.468483"
       sodipodi:rx="0.88582677"
       sodipodi:ry="0.88582677"
       d="m 89.468507,89.468483 c 0,0.489229 -0.396599,0.885827 -0.885827,0.885827 -0.489229,0 -0.885827,-0.396598 -0.885827,-0.885827 0,-0.489229 0.396598,-0.885827 0.885827,-0.885827 0.489228,0 0.885827,0.396598 0.885827,0.885827 z"
       transform="matrix(1.9999971,0,0,1.9999971,243.68839,289.08248)" />
    <path
       transform="matrix(1.9999971,0,0,1.9999971,243.68839,331.60217)"
       d="m 89.468507,89.468483 c 0,0.489229 -0.396599,0.885827 -0.885827,0.885827 -0.489229,0 -0.885827,-0.396598 -0.885827,-0.885827 0,-0.489229 0.396598,-0.885827 0.885827,-0.885827 0.489228,0 0.885827,0.396598 0.885827,0.885827 z"
       sodipodi:ry="0.88582677"
       sodipodi:rx="0.88582677"
       sodipodi:cy="89.468483"
       sodipodi:cx="88.58268"
       id="path4107"
       style="fill:#000000;fill-opacity:1;stroke-width:2;stroke-miterlimit:4;stroke-dasharray:8, 4;stroke-dashoffset:2.8"
       sodipodi:type="arc" />
    <path
       inkscape:connector-curvature="0"
       id="path4109"
       d="m 420.85348,468.01918 0,42.51969"
       style="fill:none;stroke:#000000;stroke-width:1px;stroke-linecap:butt;stroke-linejoin:miter;stroke-opacity:1" />
    <rect
       y="418.19598"
       x="-498.1373"
       height="5.3149605"
       width="17.716536"
       id="rect4111"
       style="fill:#ffffff;fill-opacity:1;stroke:#000000;stroke-width:1px;stroke-linecap:butt;stroke-linejoin:miter;stroke-opacity:1"
       transform="matrix(0,-1,1,0,0,0)" />
    <path
       transform="matrix(1.9999971,0,0,1.9999971,243.68839,289.08248)"
       d="m 89.468507,89.468483 c 0,0.489229 -0.396599,0.885827 -0.885827,0.885827 -0.489229,0 -0.885827,-0.396598 -0.885827,-0.885827 0,-0.489229 0.396598,-0.885827 0.885827,-0.885827 0.489228,0 0.885827,0.396598 0.885827,0.885827 z"
       sodipodi:ry="0.88582677"
       sodipodi:rx="0.88582677"
       sodipodi:cy="89.468483"
       sodipodi:cx="88.58268"
       id="path4113"
       style="fill:#000000;fill-opacity:1;stroke-width:2;stroke-miterlimit:4;stroke-dasharray:8, 4;stroke-dashoffset:2.8"
       sodipodi:type="arc" />
    <path
       sodipodi:type="arc"
       style="fill:#000000;fill-opacity:1;stroke-width:2;stroke-miterlimit:4;stroke-dasharray:8, 4;stroke-dashoffset:2.8"
       id="path4115"
       sodipodi:cx="88.58268"
       sodipodi:cy="89.468483"
       sodipodi:rx="0.88582677"
       sodipodi:ry="0.88582677"
       d="m 89.468507,89.468483 c 0,0.489229 -0.396599,0.885827 -0.885827,0.885827 -0.489229,0 -0.885827,-0.396598 -0.885827,-0.885827 0,-0.489229 0.396598,-0.885827 0.885827,-0.885827 0.489228,0 0.885827,0.396598 0.885827,0.885827 z"
       transform="matrix(1.9999971,0,0,1.9999971,243.68839,331.60217)" />
    <path
       style="fill:none;stroke:#000000;stroke-width:1px;stroke-linecap:butt;stroke-linejoin:miter;stroke-opacity:1"
       d="m 420.85348,468.01918 0,42.51969"
       id="path4117"
       inkscape:connector-curvature="0" />
    <rect
       transform="matrix(0,-1,1,0,0,0)"
       style="fill:#ffffff;fill-opacity:1;stroke:#000000;stroke-width:1px;stroke-linecap:butt;stroke-linejoin:miter;stroke-opacity:1"
       id="rect4119"
       width="17.716536"
       height="5.3149605"
       x="-498.1373"
       y="418.19598" />
    <text
       sodipodi:linespacing="125%"
       id="text3359"
       y="453.84598"
       x="270.26294"
       style="font-size:40px;font-style:normal;font-weight:normal;line-height:125%;letter-spacing:0px;word-spacing:0px;fill:#000000;fill-opacity:1;stroke:none;font-family:Sans"
       xml:space="preserve"><tspan
         style="font-size:10px"
         y="453.84598"
         x="270.26294"
         id="tspan3361"
         sodipodi:role="line">100R</tspan></text>
    <text
       xml:space="preserve"
       style="font-size:40px;font-style:normal;font-weight:normal;line-height:125%;letter-spacing:0px;word-spacing:0px;fill:#000000;fill-opacity:1;stroke:none;font-family:Sans"
       x="367.70389"
       y="491.93652"
       id="text3363"
       sodipodi:linespacing="125%"><tspan
         sodipodi:role="line"
         id="tspan3365"
         x="367.70389"
         y="491.93652"
         style="font-size:10px">1k</tspan></text>
    <text
       sodipodi:linespacing="125%"
       id="text6172"
       y="491.93652"
       x="425.28262"
       style="font-size:40px;font-style:normal;font-weight:normal;line-height:125%;letter-spacing:0px;word-spacing:0px;fill:#000000;fill-opacity:1;stroke:none;font-family:Sans"
       xml:space="preserve"><tspan
         style="font-size:10px"
         y="491.93652"
         x="425.28262"
         id="tspan6174"
         sodipodi:role="line">1k</tspan></text>
    <path
       sodipodi:nodetypes="cc"
       inkscape:connector-curvature="0"
       id="path5640"
       d="m 430.71175,440.04675 15.5,0"
       style="fill:none;stroke:#000000;stroke-width:0.5;stroke-linecap:butt;stroke-linejoin:miter;stroke-miterlimit:4;stroke-opacity:1;stroke-dasharray:none;marker-start:url(#TriangleInS);marker-end:url(#TriangleOutS)" />
    <rect
       style="fill:#ffffff;fill-opacity:1;stroke-width:0.5;stroke-miterlimit:4;stroke-dasharray:none"
       id="rect5642"
       width="14"
       height="6.5"
       x="431.46176"
       y="436.54675" />
    <path
       style="fill:none;stroke:#000000;stroke-width:1px;stroke-linecap:butt;stroke-linejoin:miter;stroke-opacity:1"
       d="m 422.21175,460.04675 7.5,0 5,-15 7.5,0 5,15 17.5,0"
       id="path3973"
       inkscape:connector-curvature="0" />
    <path
       style="fill:none;stroke:#000000;stroke-width:0.5;stroke-linecap:butt;stroke-linejoin:miter;stroke-miterlimit:4;stroke-opacity:1;stroke-dasharray:none"
       d="m 414.71175,445.04675 5,0"
       id="path3975"
       inkscape:connector-curvature="0" />
    <path
       style="fill:none;stroke:#000000;stroke-width:0.5;stroke-linecap:butt;stroke-linejoin:miter;stroke-miterlimit:4;stroke-opacity:1;stroke-dasharray:none"
       d="m 414.71175,460.04676 5,0"
       id="path3977"
       inkscape:connector-curvature="0" />
    <path
       style="fill:none;stroke:#000000;stroke-width:0.5;stroke-linecap:butt;stroke-linejoin:miter;stroke-miterlimit:4;stroke-opacity:1;stroke-dasharray:none;marker-start:url(#TriangleInS);marker-end:url(#TriangleOutS)"
       d="m 417.21174,446.04675 0,13"
       id="path4771"
       inkscape:connector-curvature="0"
       sodipodi:nodetypes="cc" />
    <g
       id="g5621"
       transform="translate(204.21176,276.18459)">
      <rect
         y="172.86217"
         x="206.5"
         height="6.5000033"
         width="13"
         id="rect5619"
         style="fill:#ffffff;fill-opacity:1;stroke-width:0.5;stroke-miterlimit:4;stroke-dasharray:none" />
      <text
         transform="translate(-7.3202845,91.489795)"
         sodipodi:linespacing="125%"
         id="text5615"
         y="86.809875"
         x="214.33035"
         style="font-size:40px;font-style:normal;font-weight:normal;line-height:125%;letter-spacing:0px;word-spacing:0px;fill:#000000;fill-opacity:1;stroke:none;font-family:Sans"
         xml:space="preserve"><tspan
           style="font-size:6px"
           y="86.809875"
           x="214.33035"
           id="tspan5617"
           sodipodi:role="line">24V</tspan></text>
    </g>
    <path
       inkscape:connector-curvature="0"
       id="path5626"
       d="m 429.71175,442.54675 0,-5.5"
       style="fill:none;stroke:#000000;stroke-width:0.5;stroke-linecap:butt;stroke-linejoin:miter;stroke-miterlimit:4;stroke-opacity:1;stroke-dasharray:none"
       sodipodi:nodetypes="cc" />
    <path
       inkscape:connector-curvature="0"
       id="path5628"
       d="m 447.21175,442.54675 0,-5.5"
       style="fill:none;stroke:#000000;stroke-width:0.5;stroke-linecap:butt;stroke-linejoin:miter;stroke-miterlimit:4;stroke-opacity:1;stroke-dasharray:none"
       sodipodi:nodetypes="cc" />
    <g
       transform="translate(225.46176,263.68459)"
       id="g5632">
      <rect
         style="fill:#ffffff;fill-opacity:1;stroke-width:0.5;stroke-miterlimit:4;stroke-dasharray:none"
         id="rect5634"
         width="13"
         height="6.5000033"
         x="206.5"
         y="172.86217" />
      <text
         xml:space="preserve"
         style="font-size:40px;font-style:normal;font-weight:normal;line-height:125%;letter-spacing:0px;word-spacing:0px;fill:#000000;fill-opacity:1;stroke:none;font-family:Sans"
         x="206.5"
         y="178.36217"
         id="text5636"
         sodipodi:linespacing="125%"><tspan
           sodipodi:role="line"
           id="tspan5638"
           x="206.5"
           y="178.36217"
           style="font-size:6px">1.2u</tspan></text>
    </g>
    <path
       style="fill:none;stroke:#000000;stroke-width:1px;stroke-linecap:butt;stroke-linejoin:miter;stroke-opacity:1"
       d="m 310.12514,431.7003 20,0 0,5"
       id="path4160"
       inkscape:connector-curvature="0" />
    <path
       style="fill:none;stroke:#000000;stroke-width:1px;stroke-linecap:butt;stroke-linejoin:miter;stroke-opacity:1"
       d="m 325.79593,436.7003 8.82921,0"
       id="path4162"
       inkscape:connector-curvature="0" />
    <path
       inkscape:connector-curvature="0"
       id="path4164"
       d="m 325.79593,439.2003 8.82921,0"
       style="fill:none;stroke:#000000;stroke-width:1px;stroke-linecap:butt;stroke-linejoin:miter;stroke-opacity:1" />
    <path
       style="fill:none;stroke:#000000;stroke-width:1px;stroke-linecap:butt;stroke-linejoin:miter;stroke-opacity:1"
       d="m 330.12514,439.2003 0,6.5"
       id="path4166"
       inkscape:connector-curvature="0" />
    <text
       sodipodi:linespacing="125%"
       id="text4170"
       y="441.20029"
       x="335.62515"
       style="font-size:40px;font-style:normal;font-weight:normal;line-height:125%;letter-spacing:0px;word-spacing:0px;fill:#000000;fill-opacity:1;stroke:none;font-family:Sans"
       xml:space="preserve"><tspan
         style="font-size:10px"
         y="441.20029"
         x="335.62515"
         id="tspan4172"
         sodipodi:role="line">300nF</tspan></text>
    <path
       transform="matrix(1.9999971,0,0,1.9999971,133.15551,252.76359)"
       d="m 89.468507,89.468483 c 0,0.489229 -0.396599,0.885827 -0.885827,0.885827 -0.489229,0 -0.885827,-0.396598 -0.885827,-0.885827 0,-0.489229 0.396598,-0.885827 0.885827,-0.885827 0.489228,0 0.885827,0.396598 0.885827,0.885827 z"
       sodipodi:ry="0.88582677"
       sodipodi:rx="0.88582677"
       sodipodi:cy="89.468483"
       sodipodi:cx="88.58268"
       id="path4174"
       style="fill:#000000;fill-opacity:1;stroke-width:2;stroke-miterlimit:4;stroke-dasharray:8, 4;stroke-dashoffset:2.8"
       sodipodi:type="arc" />
    <g
       id="g4444"
       transform="translate(23.864854,0)">
      <g
         id="g4438">
        <g
           id="g4404"
           transform="translate(0,-0.55436795)">
          <text
             xml:space="preserve"
             style="font-size:40px;font-style:normal;font-weight:normal;line-height:125%;letter-spacing:0px;word-spacing:0px;fill:#000000;fill-opacity:1;stroke:none;font-family:Sans"
             x="118.9907"
             y="551.05225"
             id="text3788"
             sodipodi:linespacing="125%"><tspan
               id="tspan3792"
               sodipodi:role="line"
               x="118.9907"
               y="551.05225"
               style="font-size:10px;font-weight:bold">FPGA</tspan></text>
          <rect
             y="536.42682"
             x="114.90484"
             height="21.970638"
             width="39.143398"
             id="rect3576"
             style="fill:none;stroke:#000000;stroke-width:1px;stroke-linecap:butt;stroke-linejoin:miter;stroke-opacity:1" />
        </g>
      </g>
    </g>
    <g
       id="g4432"
       transform="translate(21.970818,0)">
      <rect
         y="532.03638"
         x="173.92857"
         height="29.64282"
         width="53.571476"
         id="rect4387"
         style="fill:#ffffff;fill-opacity:1;stroke:#000000;stroke-opacity:1" />
      <text
         sodipodi:linespacing="125%"
         id="text4392"
         y="544.33582"
         x="200.92915"
         style="font-size:40px;font-style:normal;font-weight:normal;line-height:125%;letter-spacing:0px;word-spacing:0px;fill:#000000;fill-opacity:1;stroke:none;font-family:Sans"
         xml:space="preserve"><tspan
           style="font-size:10px;font-weight:bold;text-align:center;text-anchor:middle"
           y="544.33582"
           x="200.92915"
           sodipodi:role="line"
           id="tspan4394">Tri-state</tspan><tspan
           id="tspan4396"
           style="font-size:10px;font-weight:bold;text-align:center;text-anchor:middle"
           y="556.83582"
           x="200.92915"
           sodipodi:role="line">buffer</tspan></text>
    </g>
    <text
       xml:space="preserve"
       style="font-size:40px;font-style:normal;font-weight:normal;line-height:125%;letter-spacing:0px;word-spacing:0px;fill:#000000;fill-opacity:1;stroke:none;font-family:Sans"
       x="315.66196"
       y="519.71643"
       id="text3099"
       sodipodi:linespacing="125%"><tspan
         sodipodi:role="line"
         id="tspan3101"
         x="315.66196"
         y="519.71643"
         style="font-size:10px">1:1</tspan></text>
    <g
       transform="translate(0.22088793,0.50061076)"
       id="g3260">
      <path
         style="fill:none;stroke:#000000;stroke-width:1px;stroke-linecap:butt;stroke-linejoin:miter;stroke-opacity:1"
         d="m 305.26969,570.50343 2,-3 6,0 -2,3"
         id="path5211"
         inkscape:connector-curvature="0"
         sodipodi:nodetypes="cccc" />
      <path
         style="fill:none;stroke:#000000;stroke-width:1px;stroke-linecap:butt;stroke-linejoin:miter;stroke-opacity:1"
         d="m 310.26969,567.50343 -2,3"
         id="path5213"
         inkscape:connector-curvature="0" />
    </g>
    <g
       id="g3450"
       transform="translate(20.01209,-121.71384)">
      <path
         sodipodi:nodetypes="cccc"
         inkscape:connector-curvature="0"
         id="path3452"
         d="m 305.26969,570.50343 2,-3 6,0 -2,3"
         style="fill:none;stroke:#000000;stroke-width:1px;stroke-linecap:butt;stroke-linejoin:miter;stroke-opacity:1" />
      <path
         inkscape:connector-curvature="0"
         id="path3454"
         d="m 310.26969,567.50343 -2,3"
         style="fill:none;stroke:#000000;stroke-width:1px;stroke-linecap:butt;stroke-linejoin:miter;stroke-opacity:1" />
    </g>
  </g>
</svg>
