(module SOIC-8 (layer F.Cu) (tedit 57963EF9)
  (fp_text reference REF** (at -3.7 0 90) (layer F.SilkS)
    (effects (font (size 1.2 1.2) (thickness 0.15)))
  )
  (fp_text value SOIC-8 (at 3.7 0 90) (layer F.Fab)
    (effects (font (size 1.2 1.2) (thickness 0.15)))
  )
  (fp_line (start -2.5 2) (end -2.5 3) (layer F.SilkS) (width 0.15))
  (fp_line (start -2.5 3) (end -3.5 2) (layer F.SilkS) (width 0.15))
  (fp_line (start -3.5 2) (end -2.5 2) (layer F.SilkS) (width 0.15))
  (fp_line (start -2.5 2) (end -2.5 1) (layer F.SilkS) (width 0.15))
  (fp_line (start -1.5 2) (end -2.5 1) (layer F.SilkS) (width 0.15))
  (fp_line (start -2.5 1) (end -2.5 -2) (layer F.SilkS) (width 0.15))
  (fp_line (start -2.5 -2) (end -1.5 -2) (layer F.SilkS) (width 0.15))
  (fp_line (start -2.5 2) (end 2.5 2) (layer F.SilkS) (width 0.15))
  (fp_line (start 2.5 2) (end 2.5 -2) (layer F.SilkS) (width 0.15))
  (fp_line (start 2.5 -2) (end -1.5 -2) (layer F.SilkS) (width 0.15))
  (pad 8 smd rect (at -1.905 -2.7) (size 0.55 1.5) (layers F.Cu F.Paste F.Mask))
  (pad 1 smd rect (at -1.905 2.7) (size 0.55 1.5) (layers F.Cu F.Paste F.Mask))
  (pad 7 smd rect (at -0.635 -2.7) (size 0.55 1.5) (layers F.Cu F.Paste F.Mask))
  (pad 2 smd rect (at -0.635 2.7) (size 0.55 1.5) (layers F.Cu F.Paste F.Mask))
  (pad 6 smd rect (at 0.635 -2.7) (size 0.55 1.5) (layers F.Cu F.Paste F.Mask))
  (pad 3 smd rect (at 0.635 2.7) (size 0.55 1.5) (layers F.Cu F.Paste F.Mask))
  (pad 5 smd rect (at 1.905 -2.7) (size 0.55 1.5) (layers F.Cu F.Paste F.Mask))
  (pad 4 smd rect (at 1.905 2.7) (size 0.55 1.5) (layers F.Cu F.Paste F.Mask))
)
