EESchema Schematic File Version 2
LIBS:power
LIBS:device
LIBS:transistors
LIBS:conn
LIBS:linear
LIBS:regul
LIBS:74xx
LIBS:cmos4000
LIBS:adc-dac
LIBS:memory
LIBS:xilinx
LIBS:microcontrollers
LIBS:dsp
LIBS:microchip
LIBS:analog_switches
LIBS:motorola
LIBS:texas
LIBS:intel
LIBS:audio
LIBS:interface
LIBS:digital-audio
LIBS:philips
LIBS:display
LIBS:cypress
LIBS:siliconi
LIBS:opto
LIBS:atmel
LIBS:contrib
LIBS:valves
LIBS:diff_driver_custom
LIBS:diff_driver-cache
EELAYER 25 0
EELAYER END
$Descr A4 11693 8268
encoding utf-8
Sheet 1 1
Title "OASIS cable driver"
Date "2016-07-28"
Rev "1.0"
Comp "CERN, BE-CO-HT"
Comment1 "(based on T. Wlostowski's original design for Altium)"
Comment2 "D. Lampridis"
Comment3 ""
Comment4 ""
$EndDescr
$Comp
L CP1 C1
U 1 1 57961631
P 4800 1800
F 0 "C1" H 4825 1900 50  0000 L CNN
F 1 "220u" H 4825 1700 50  0000 L CNN
F 2 "Capacitors_ThroughHole:C_Radial_D10_L13_P5" H 4800 1800 50  0001 C CNN
F 3 "" H 4800 1800 50  0000 C CNN
F 4 "Nichicon" H 4800 1800 60  0001 C CNN "Manufacturer"
F 5 "UBT1H221MPD8" H 4800 1800 60  0001 C CNN "Part Number"
F 6 "No" H 4800 1800 60  0001 C CNN "SMD"
	1    4800 1800
	1    0    0    -1  
$EndComp
$Comp
L C C4
U 1 1 579616A0
P 6650 1550
F 0 "C4" H 6675 1650 50  0000 L CNN
F 1 "100n" H 6675 1450 50  0000 L CNN
F 2 "Capacitors_SMD:C_0805" H 6688 1400 50  0001 C CNN
F 3 "" H 6650 1550 50  0000 C CNN
F 4 "Any" H 6650 1550 60  0001 C CNN "Manufacturer"
F 5 "CC0805_100NF_50V_10%_X7R" H 6650 1550 60  0001 C CNN "Part Number"
F 6 "Yes" H 6650 1550 60  0001 C CNN "SMD"
	1    6650 1550
	1    0    0    -1  
$EndComp
$Comp
L -12VA #PWR01
U 1 1 57961747
P 7200 2300
F 0 "#PWR01" H 7200 2150 50  0001 C CNN
F 1 "-12VA" H 7200 2440 50  0000 C CNN
F 2 "" H 7200 2300 50  0000 C CNN
F 3 "" H 7200 2300 50  0000 C CNN
	1    7200 2300
	-1   0    0    1   
$EndComp
$Comp
L +12VA #PWR02
U 1 1 579617B4
P 7200 1300
F 0 "#PWR02" H 7200 1150 50  0001 C CNN
F 1 "+12VA" H 7200 1440 50  0000 C CNN
F 2 "" H 7200 1300 50  0000 C CNN
F 3 "" H 7200 1300 50  0000 C CNN
	1    7200 1300
	1    0    0    -1  
$EndComp
$Comp
L GND #PWR03
U 1 1 579617E5
P 7200 1850
F 0 "#PWR03" H 7200 1600 50  0001 C CNN
F 1 "GND" H 7200 1700 50  0000 C CNN
F 2 "" H 7200 1850 50  0000 C CNN
F 3 "" H 7200 1850 50  0000 C CNN
	1    7200 1850
	1    0    0    -1  
$EndComp
$Comp
L TRACO_TEN_6WIN_DUAL U1
U 1 1 57961C86
P 5600 1800
F 0 "U1" H 5300 2150 60  0000 C CNN
F 1 "TRACO_TEN_6WIN_DUAL" H 5600 1450 60  0000 C CNN
F 2 "diff_driver_custom:TRACO_TEN_6WIN_DUAL" H 5600 1800 60  0001 C CNN
F 3 "" H 5600 1800 60  0000 C CNN
F 4 "Traco Power" H 5600 1800 60  0001 C CNN "Manufacturer"
F 5 "TEN 6-2422WIN" H 5600 1800 60  0001 C CNN "Part Number"
F 6 "No" H 5600 1800 60  0001 C CNN "SMD"
	1    5600 1800
	1    0    0    -1  
$EndComp
$Comp
L INA134 U2
U 1 1 57961E24
P 6900 4350
F 0 "U2" H 7050 4250 50  0000 L CNN
F 1 "INA134" H 7050 4450 50  0000 L CNN
F 2 "diff_driver_custom:SOIC-8" H 6950 4400 50  0001 C CNN
F 3 "" H 7050 4500 50  0000 C CNN
F 4 "Texas Instruments" H 6900 4350 60  0001 C CNN "Manufacturer"
F 5 "INA134UA" H 6900 4350 60  0001 C CNN "Part Number"
F 6 "Yes" H 6900 4350 60  0001 C CNN "SMD"
	1    6900 4350
	1    0    0    1   
$EndComp
$Comp
L BUF634U U3
U 1 1 5796218C
P 8550 4350
F 0 "U3" H 8700 4250 50  0000 L CNN
F 1 "BUF634U" H 8700 4450 50  0000 L CNN
F 2 "diff_driver_custom:SOIC-8" H 8600 4400 50  0001 C CNN
F 3 "" H 8700 4500 50  0000 C CNN
F 4 "MAXIM" H 8550 4350 60  0001 C CNN "Manufacturer"
F 5 "BUF634U" H 8550 4350 60  0001 C CNN "Part Number"
F 6 "Yes" H 8550 4350 60  0001 C CNN "SMD"
	1    8550 4350
	1    0    0    1   
$EndComp
$Comp
L CP1 C2
U 1 1 57962AB6
P 6350 1550
F 0 "C2" H 6375 1650 50  0000 L CNN
F 1 "22u" H 6375 1450 50  0000 L CNN
F 2 "Capacitors_Tantalum_SMD:TantalC_SizeB_EIA-3528_Reflow" H 6350 1550 50  0001 C CNN
F 3 "" H 6350 1550 50  0000 C CNN
F 4 "Any" H 6350 1550 60  0001 C CNN "Manufacturer"
F 5 "CTE3528-21_22UF_20V_10%_LESR0700" H 6350 1550 60  0001 C CNN "Part Number"
F 6 "Yes" H 6350 1550 60  0001 C CNN "SMD"
	1    6350 1550
	1    0    0    -1  
$EndComp
$Comp
L +12VA #PWR04
U 1 1 57963EFD
P 8500 4000
F 0 "#PWR04" H 8500 3850 50  0001 C CNN
F 1 "+12VA" H 8500 4140 50  0000 C CNN
F 2 "" H 8500 4000 50  0000 C CNN
F 3 "" H 8500 4000 50  0000 C CNN
	1    8500 4000
	1    0    0    -1  
$EndComp
$Comp
L +12VA #PWR05
U 1 1 57963FFB
P 6850 4000
F 0 "#PWR05" H 6850 3850 50  0001 C CNN
F 1 "+12VA" H 6850 4140 50  0000 C CNN
F 2 "" H 6850 4000 50  0000 C CNN
F 3 "" H 6850 4000 50  0000 C CNN
	1    6850 4000
	1    0    0    -1  
$EndComp
$Comp
L GND #PWR06
U 1 1 579641AF
P 7100 4700
F 0 "#PWR06" H 7100 4450 50  0001 C CNN
F 1 "GND" H 7100 4550 50  0000 C CNN
F 2 "" H 7100 4700 50  0000 C CNN
F 3 "" H 7100 4700 50  0000 C CNN
	1    7100 4700
	1    0    0    -1  
$EndComp
$Comp
L -12VA #PWR07
U 1 1 579642DB
P 6850 4700
F 0 "#PWR07" H 6850 4550 50  0001 C CNN
F 1 "-12VA" H 6850 4840 50  0000 C CNN
F 2 "" H 6850 4700 50  0000 C CNN
F 3 "" H 6850 4700 50  0000 C CNN
	1    6850 4700
	-1   0    0    1   
$EndComp
$Comp
L C C8
U 1 1 5796453D
P 6300 4350
F 0 "C8" H 6325 4450 50  0000 L CNN
F 1 "100p" H 6325 4250 50  0000 L CNN
F 2 "Capacitors_SMD:C_0805" H 6338 4200 50  0001 C CNN
F 3 "" H 6300 4350 50  0000 C CNN
F 4 "Any" H 6300 4350 60  0001 C CNN "Manufacturer"
F 5 "CC0805_100PF_50V_5%_NP0" H 6300 4350 60  0001 C CNN "Part Number"
F 6 "Yes" H 6300 4350 60  0001 C CNN "SMD"
	1    6300 4350
	1    0    0    -1  
$EndComp
$Comp
L -12VA #PWR08
U 1 1 57965C55
P 8500 4700
F 0 "#PWR08" H 8500 4550 50  0001 C CNN
F 1 "-12VA" H 8500 4840 50  0000 C CNN
F 2 "" H 8500 4700 50  0000 C CNN
F 3 "" H 8500 4700 50  0000 C CNN
	1    8500 4700
	-1   0    0    1   
$EndComp
$Comp
L GND #PWR09
U 1 1 5796634C
P 10150 4500
F 0 "#PWR09" H 10150 4250 50  0001 C CNN
F 1 "GND" H 10150 4350 50  0000 C CNN
F 2 "" H 10150 4500 50  0000 C CNN
F 3 "" H 10150 4500 50  0000 C CNN
	1    10150 4500
	1    0    0    -1  
$EndComp
$Comp
L R R1
U 1 1 579676F1
P 5000 3750
F 0 "R1" V 5080 3750 50  0000 C CNN
F 1 "49k9" V 5000 3750 50  0000 C CNN
F 2 "Resistors_SMD:R_0805" V 4930 3750 50  0001 C CNN
F 3 "" H 5000 3750 50  0000 C CNN
F 4 "Any" H 5000 3750 60  0001 C CNN "Manufacturer"
F 5 "R0805_49K9_0.1%_0.1W_10PPM" H 5000 3750 60  0001 C CNN "Part Number"
F 6 "Yes" H 5000 3750 60  0001 C CNN "SMD"
F 7 "0.1%" V 4900 3750 50  0000 C CNN "Precision"
	1    5000 3750
	0    -1   -1   0   
$EndComp
$Comp
L R R3
U 1 1 57967DA3
P 6100 3750
F 0 "R3" V 6180 3750 50  0000 C CNN
F 1 "24k9" V 6100 3750 50  0000 C CNN
F 2 "Resistors_SMD:R_0805" V 6030 3750 50  0001 C CNN
F 3 "" H 6100 3750 50  0000 C CNN
F 4 "Any" H 6100 3750 60  0001 C CNN "Manufacturer"
F 5 "R0805_25K_1%_0.125W_100PPM" H 6100 3750 60  0001 C CNN "Part Number"
F 6 "Yes" H 6100 3750 60  0001 C CNN "SMD"
F 7 "1%" V 6000 3750 50  0000 C CNN "Precision"
	1    6100 3750
	0    -1   -1   0   
$EndComp
$Comp
L Switch_DPST SW2
U 1 1 57968D09
P 4000 3950
F 0 "SW2" H 4000 4300 50  0000 C CNN
F 1 "Switch_DPST" H 4300 3900 50  0001 C CNN
F 2 "diff_driver_custom:SPST_2" H 4000 3950 50  0001 C CNN
F 3 "" H 4000 3950 50  0000 C CNN
F 4 "OMRON" H 4000 3950 60  0001 C CNN "Manufacturer"
F 5 "A6S-2101-H" H 4000 3950 60  0001 C CNN "Part Number"
F 6 "Yes" H 4000 3950 60  0001 C CNN "SMD"
	1    4000 3950
	1    0    0    -1  
$EndComp
$Comp
L CONN_01X03 J3
U 1 1 57969C42
P 1900 4350
F 0 "J3" H 1900 4550 50  0000 C CNN
F 1 "LEMO_0S" V 2000 4350 50  0000 C CNN
F 2 "diff_driver_custom:LEMO_0S" H 1900 4350 50  0001 C CNN
F 3 "" H 1900 4350 50  0000 C CNN
F 4 "LEMO" H 1900 4350 60  0001 C CNN "Manufacturer"
F 5 "EPL.0S.302.HLN" H 1900 4350 60  0001 C CNN "Part Number"
F 6 "No" H 1900 4350 60  0001 C CNN "SMD"
	1    1900 4350
	-1   0    0    -1  
$EndComp
$Comp
L SPST SW1
U 1 1 5796C02C
P 2700 4450
F 0 "SW1" H 2700 4550 50  0000 C CNN
F 1 "SPST" H 2700 4350 50  0001 C CNN
F 2 "diff_driver_custom:SPST_1" H 2700 4450 50  0001 C CNN
F 3 "" H 2700 4450 50  0000 C CNN
F 4 "OMRON" H 2700 4450 60  0001 C CNN "Manufacturer"
F 5 "A6S-1102-H" H 2700 4450 60  0001 C CNN "Part Number"
F 6 "Yes" H 2700 4450 60  0001 C CNN "SMD"
	1    2700 4450
	-1   0    0    1   
$EndComp
$Comp
L GND #PWR010
U 1 1 5796C6BF
P 3250 4700
F 0 "#PWR010" H 3250 4450 50  0001 C CNN
F 1 "GND" H 3250 4550 50  0000 C CNN
F 2 "" H 3250 4700 50  0000 C CNN
F 3 "" H 3250 4700 50  0000 C CNN
	1    3250 4700
	1    0    0    -1  
$EndComp
NoConn ~ 4450 1800
NoConn ~ 4450 2250
$Comp
L PWR_FLAG #FLG011
U 1 1 5796DF8D
P 4550 1550
F 0 "#FLG011" H 4550 1645 50  0001 C CNN
F 1 "PWR_FLAG" H 4550 1730 50  0000 C CNN
F 2 "" H 4550 1550 50  0000 C CNN
F 3 "" H 4550 1550 50  0000 C CNN
	1    4550 1550
	1    0    0    -1  
$EndComp
Wire Wire Line
	4450 1700 4500 1700
Wire Wire Line
	4450 1900 4500 1900
Wire Wire Line
	4500 1700 4500 1600
Wire Wire Line
	4500 1600 5000 1600
Wire Wire Line
	4800 1550 4800 1650
Wire Wire Line
	5050 1550 4800 1550
Connection ~ 4800 1600
Wire Wire Line
	5050 1650 5000 1650
Wire Wire Line
	5000 1650 5000 1600
Wire Wire Line
	4500 1900 4500 2000
Wire Wire Line
	4500 2000 5000 2000
Wire Wire Line
	4800 1950 4800 2050
Wire Wire Line
	4800 2050 5050 2050
Connection ~ 4800 2000
Wire Wire Line
	5000 2000 5000 1950
Wire Wire Line
	5000 1950 5050 1950
Wire Wire Line
	4550 2150 4450 2150
Wire Wire Line
	4550 1550 4550 2150
Connection ~ 4550 1600
Wire Wire Line
	4450 2350 4650 2350
Wire Wire Line
	4650 2350 4650 2000
Connection ~ 4650 2000
Wire Wire Line
	6200 1850 6150 1850
Wire Wire Line
	6200 1750 6200 1850
Wire Wire Line
	6200 1800 7200 1800
Wire Wire Line
	6150 1750 6200 1750
Connection ~ 6200 1800
Wire Wire Line
	6350 1700 6350 1900
Connection ~ 6350 1800
Wire Wire Line
	6650 1700 6650 1900
Connection ~ 6650 1800
Wire Wire Line
	6950 1700 6950 1900
Connection ~ 6950 1800
Wire Wire Line
	6150 2050 6200 2050
Wire Wire Line
	6200 2050 6200 2250
Wire Wire Line
	6200 2250 7200 2250
Wire Wire Line
	6350 2200 6350 2250
Connection ~ 6350 2250
Wire Wire Line
	6650 2200 6650 2250
Connection ~ 6650 2250
Wire Wire Line
	6950 2200 6950 2250
Connection ~ 6950 2250
Wire Wire Line
	6150 1550 6200 1550
Wire Wire Line
	6200 1550 6200 1350
Wire Wire Line
	6200 1350 7200 1350
Wire Wire Line
	6350 1400 6350 1350
Connection ~ 6350 1350
Wire Wire Line
	6650 1400 6650 1350
Connection ~ 6650 1350
Wire Wire Line
	6950 1400 6950 1350
Connection ~ 6950 1350
Wire Wire Line
	7200 1350 7200 1300
Wire Wire Line
	7200 2250 7200 2300
Wire Wire Line
	7200 1800 7200 1850
Wire Wire Line
	7200 4350 8250 4350
Wire Wire Line
	8500 4000 8500 4050
Wire Wire Line
	6850 4000 6850 4050
Wire Wire Line
	8900 4350 8900 3750
Wire Wire Line
	8900 3750 8150 3750
Wire Wire Line
	8150 3750 8150 4000
Wire Wire Line
	8150 4000 7000 4000
Wire Wire Line
	7000 4000 7000 4050
Wire Wire Line
	7000 4650 7000 4700
Wire Wire Line
	7000 4700 7100 4700
Wire Wire Line
	6850 4650 6850 4700
Wire Wire Line
	6300 3750 6300 4200
Wire Wire Line
	6200 4150 6550 4150
Wire Wire Line
	6550 4150 6550 4250
Wire Wire Line
	6550 4250 6600 4250
Wire Wire Line
	6300 4500 6300 4950
Wire Wire Line
	6200 4550 6550 4550
Wire Wire Line
	6550 4550 6550 4450
Wire Wire Line
	6550 4450 6600 4450
Wire Wire Line
	8500 4650 8500 4700
Connection ~ 8900 4350
Wire Wire Line
	10150 4250 10200 4250
Wire Wire Line
	9100 4450 10200 4450
Wire Wire Line
	10150 4450 10150 4500
Connection ~ 10150 4450
Wire Wire Line
	9150 4250 9100 4250
Wire Wire Line
	9100 4250 9100 4450
Wire Wire Line
	8850 4350 10200 4350
Connection ~ 6300 4150
Connection ~ 6300 4550
Wire Wire Line
	5500 4150 5600 4150
Wire Wire Line
	5500 4550 5600 4550
Wire Wire Line
	5550 3750 5550 4150
Connection ~ 5550 4150
Wire Wire Line
	4800 4150 4900 4150
Wire Wire Line
	4800 3750 4800 4150
Wire Wire Line
	4900 4550 4800 4550
Wire Wire Line
	4800 4550 4800 4950
Wire Wire Line
	5550 4550 5550 4950
Connection ~ 5550 4550
Wire Wire Line
	6300 4950 6250 4950
Wire Wire Line
	4800 4950 4850 4950
Wire Wire Line
	5150 4950 5950 4950
Connection ~ 5550 4950
Wire Wire Line
	6300 3750 6250 3750
Wire Wire Line
	4850 3750 4800 3750
Wire Wire Line
	5150 3750 5950 3750
Connection ~ 5550 3750
Wire Wire Line
	4300 3750 4450 3750
Wire Wire Line
	4450 3750 4450 4550
Wire Wire Line
	4450 4550 4300 4550
Wire Wire Line
	4300 4150 4350 4150
Wire Wire Line
	4350 4150 4350 4950
Wire Wire Line
	4350 4950 4300 4950
Wire Wire Line
	4350 4750 4800 4750
Connection ~ 4800 4750
Connection ~ 4350 4750
Wire Wire Line
	4450 3950 4800 3950
Connection ~ 4800 3950
Connection ~ 4450 3950
Wire Wire Line
	3650 4550 3700 4550
Wire Wire Line
	3650 4150 3650 4550
Wire Wire Line
	3650 4150 3700 4150
Wire Wire Line
	3550 4950 3700 4950
Wire Wire Line
	3550 3750 3550 4950
Wire Wire Line
	3550 3750 3700 3750
Wire Wire Line
	2100 4350 3650 4350
Connection ~ 3650 4350
Wire Wire Line
	2100 4250 3550 4250
Connection ~ 3550 4250
Wire Wire Line
	2100 4450 2200 4450
Wire Wire Line
	3200 4450 3250 4450
Wire Wire Line
	3250 4450 3250 4700
$Comp
L PWR_FLAG #FLG012
U 1 1 5796E6DD
P 4550 2400
F 0 "#FLG012" H 4550 2495 50  0001 C CNN
F 1 "PWR_FLAG" H 4550 2580 50  0000 C CNN
F 2 "" H 4550 2400 50  0000 C CNN
F 3 "" H 4550 2400 50  0000 C CNN
	1    4550 2400
	-1   0    0    1   
$EndComp
Wire Wire Line
	4550 2350 4550 2400
Connection ~ 4550 2350
$Comp
L DC_BARREL J1
U 1 1 579771C4
P 4150 1800
F 0 "J1" H 4150 2050 50  0000 C CNN
F 1 "DC_BARREL" H 4150 1600 50  0001 C CNN
F 2 "diff_driver_custom:barrel_161314" H 4150 1800 50  0001 C CNN
F 3 "" H 4150 1800 50  0000 C CNN
F 4 "Multicomp" H 4150 1800 60  0001 C CNN "Manufacturer"
F 5 "MJ-179SMT" H 4150 1800 60  0001 C CNN "Part Number"
F 6 "Yes" H 4150 1800 60  0001 C CNN "SMD"
	1    4150 1800
	1    0    0    -1  
$EndComp
$Comp
L CONN_01X03 J4
U 1 1 5799C69D
P 10400 4350
F 0 "J4" H 10400 4150 50  0000 C CNN
F 1 "LEMO_0S" V 10500 4350 50  0000 C CNN
F 2 "diff_driver_custom:LEMO_0S" H 10400 4350 50  0001 C CNN
F 3 "" H 10400 4350 50  0000 C CNN
F 4 "LEMO" H 10400 4350 60  0001 C CNN "Manufacturer"
F 5 "EPL.0S.302.HLN" H 10400 4350 60  0001 C CNN "Part Number"
F 6 "No" H 10400 4350 60  0001 C CNN "SMD"
	1    10400 4350
	1    0    0    1   
$EndComp
$Comp
L SPST SW6
U 1 1 5799CC21
P 9650 4250
F 0 "SW6" H 9650 4350 50  0000 C CNN
F 1 "SPST" H 9650 4150 50  0001 C CNN
F 2 "diff_driver_custom:SPST_1" H 9650 4250 50  0001 C CNN
F 3 "" H 9650 4250 50  0000 C CNN
F 4 "OMRON" H 9650 4250 60  0001 C CNN "Manufacturer"
F 5 "A6S-1102-H" H 9650 4250 60  0001 C CNN "Part Number"
F 6 "Yes" H 9650 4250 60  0001 C CNN "SMD"
	1    9650 4250
	1    0    0    -1  
$EndComp
$Comp
L Switch_DPST SW3
U 1 1 5799D1AB
P 4000 4750
F 0 "SW3" H 4000 5100 50  0000 C CNN
F 1 "Switch_DPST" H 4300 4700 50  0001 C CNN
F 2 "diff_driver_custom:SPST_2" H 4000 4750 50  0001 C CNN
F 3 "" H 4000 4750 50  0000 C CNN
F 4 "OMRON" H 4000 4750 60  0001 C CNN "Manufacturer"
F 5 "A6S-2101-H" H 4000 4750 60  0001 C CNN "Part Number"
F 6 "Yes" H 4000 4750 60  0001 C CNN "SMD"
	1    4000 4750
	1    0    0    -1  
$EndComp
$Comp
L Switch_DPST SW4
U 1 1 5799D224
P 5200 4350
F 0 "SW4" H 5200 4700 50  0000 C CNN
F 1 "Switch_DPST" H 5500 4300 50  0001 C CNN
F 2 "diff_driver_custom:SPST_2" H 5200 4350 50  0001 C CNN
F 3 "" H 5200 4350 50  0000 C CNN
F 4 "OMRON" H 5200 4350 60  0001 C CNN "Manufacturer"
F 5 "A6S-2101-H" H 5200 4350 60  0001 C CNN "Part Number"
F 6 "Yes" H 5200 4350 60  0001 C CNN "SMD"
	1    5200 4350
	1    0    0    -1  
$EndComp
$Comp
L Switch_DPST SW5
U 1 1 5799D2B8
P 5900 4350
F 0 "SW5" H 5900 4700 50  0000 C CNN
F 1 "Switch_DPST" H 6200 4300 50  0001 C CNN
F 2 "diff_driver_custom:SPST_2" H 5900 4350 50  0001 C CNN
F 3 "" H 5900 4350 50  0000 C CNN
F 4 "OMRON" H 5900 4350 60  0001 C CNN "Manufacturer"
F 5 "A6S-2101-H" H 5900 4350 60  0001 C CNN "Part Number"
F 6 "Yes" H 5900 4350 60  0001 C CNN "SMD"
	1    5900 4350
	1    0    0    -1  
$EndComp
$Comp
L R R2
U 1 1 5799DA31
P 5000 4950
F 0 "R2" V 5080 4950 50  0000 C CNN
F 1 "49k9" V 5000 4950 50  0000 C CNN
F 2 "Resistors_SMD:R_0805" V 4930 4950 50  0001 C CNN
F 3 "" H 5000 4950 50  0000 C CNN
F 4 "Any" H 5000 4950 60  0001 C CNN "Manufacturer"
F 5 "R0805_49K9_0.1%_0.1W_10PPM" H 5000 4950 60  0001 C CNN "Part Number"
F 6 "Yes" H 5000 4950 60  0001 C CNN "SMD"
F 7 "0.1%" V 4900 4950 50  0000 C CNN "Precision"
	1    5000 4950
	0    -1   -1   0   
$EndComp
$Comp
L C C5
U 1 1 5799EAA4
P 6650 2050
F 0 "C5" H 6675 2150 50  0000 L CNN
F 1 "100n" H 6675 1950 50  0000 L CNN
F 2 "Capacitors_SMD:C_0805" H 6688 1900 50  0001 C CNN
F 3 "" H 6650 2050 50  0000 C CNN
F 4 "Any" H 6650 2050 60  0001 C CNN "Manufacturer"
F 5 "CC0805_100NF_50V_10%_X7R" H 6650 2050 60  0001 C CNN "Part Number"
F 6 "Yes" H 6650 2050 60  0001 C CNN "SMD"
	1    6650 2050
	1    0    0    -1  
$EndComp
$Comp
L C C6
U 1 1 5799EB0F
P 6950 1550
F 0 "C6" H 6975 1650 50  0000 L CNN
F 1 "100n" H 6975 1450 50  0000 L CNN
F 2 "Capacitors_SMD:C_0805" H 6988 1400 50  0001 C CNN
F 3 "" H 6950 1550 50  0000 C CNN
F 4 "Any" H 6950 1550 60  0001 C CNN "Manufacturer"
F 5 "CC0805_100NF_50V_10%_X7R" H 6950 1550 60  0001 C CNN "Part Number"
F 6 "Yes" H 6950 1550 60  0001 C CNN "SMD"
	1    6950 1550
	1    0    0    -1  
$EndComp
$Comp
L C C7
U 1 1 5799EB89
P 6950 2050
F 0 "C7" H 6975 2150 50  0000 L CNN
F 1 "100n" H 6975 1950 50  0000 L CNN
F 2 "Capacitors_SMD:C_0805" H 6988 1900 50  0001 C CNN
F 3 "" H 6950 2050 50  0000 C CNN
F 4 "Any" H 6950 2050 60  0001 C CNN "Manufacturer"
F 5 "CC0805_100NF_50V_10%_X7R" H 6950 2050 60  0001 C CNN "Part Number"
F 6 "Yes" H 6950 2050 60  0001 C CNN "SMD"
	1    6950 2050
	1    0    0    -1  
$EndComp
$Comp
L CP1 C3
U 1 1 5799F107
P 6350 2050
F 0 "C3" H 6375 2150 50  0000 L CNN
F 1 "22u" H 6375 1950 50  0000 L CNN
F 2 "Capacitors_Tantalum_SMD:TantalC_SizeB_EIA-3528_Reflow" H 6350 2050 50  0001 C CNN
F 3 "" H 6350 2050 50  0000 C CNN
F 4 "Any" H 6350 2050 60  0001 C CNN "Manufacturer"
F 5 "CTE3528-21_22UF_20V_10%_LESR0700" H 6350 2050 60  0001 C CNN "Part Number"
F 6 "Yes" H 6350 2050 60  0001 C CNN "SMD"
	1    6350 2050
	1    0    0    -1  
$EndComp
Text Notes 2050 2100 0    60   ~ 0
Two power inputs/outputs to allow\nchaining multiple boards from the\nsame PSU\n\nINPUT = 9V - 36V
Wire Notes Line
	3700 2150 2000 2150
Text Notes 4950 3500 0    60   ~ 0
Signal attenuation\n\nSW4=off, SW5=off, -12dB\nSW4=off, SW5=on, -10dB\nSW4=on, SW5=off, -6dB\nSW4=on, SW5=on, 0dB
Text Notes 8550 4600 0    60   ~ 0
G=1
Text Notes 3400 5450 0    60   ~ 0
Polarity inversion\n\nSW2=off, SW3=on, normal\nSW2=on, SW3=off, inverted
Text Notes 2300 4150 0    60   ~ 0
Input ground lift\n\nSW1=off, lifted\nSW1=on, grounded
Wire Notes Line
	4900 2950 6200 2950
Wire Notes Line
	6200 2950 6200 3550
Wire Notes Line
	6200 3550 4900 3550
Wire Notes Line
	4900 3550 4900 2950
Wire Notes Line
	3350 5050 4700 5050
Wire Notes Line
	4700 5050 4700 5500
Wire Notes Line
	4700 5500 3350 5500
Wire Notes Line
	3350 5500 3350 5050
Wire Notes Line
	2250 3750 3200 3750
Wire Notes Line
	3200 3750 3200 4200
Wire Notes Line
	3200 4200 2250 4200
Wire Notes Line
	2250 4200 2250 3750
Text Notes 9200 4000 0    60   ~ 0
Output ground lift\n\nSW1=off, lifted\nSW1=on, grounded
Wire Notes Line
	9150 3600 10100 3600
Wire Notes Line
	10100 3600 10100 4050
Wire Notes Line
	10100 4050 9150 4050
Wire Notes Line
	9150 4050 9150 3600
Wire Notes Line
	2000 2150 2000 1650
Wire Notes Line
	2000 1650 3700 1650
Wire Notes Line
	3700 1650 3700 2150
$Comp
L R R4
U 1 1 57D68863
P 6100 4950
F 0 "R4" V 6180 4950 50  0000 C CNN
F 1 "24k9" V 6100 4950 50  0000 C CNN
F 2 "Resistors_SMD:R_0805" V 6030 4950 50  0001 C CNN
F 3 "" H 6100 4950 50  0000 C CNN
F 4 "Any" H 6100 4950 60  0001 C CNN "Manufacturer"
F 5 "R0805_25K_1%_0.125W_100PPM" H 6100 4950 60  0001 C CNN "Part Number"
F 6 "Yes" H 6100 4950 60  0001 C CNN "SMD"
F 7 "1%" V 6000 4950 50  0000 C CNN "Precision"
	1    6100 4950
	0    -1   -1   0   
$EndComp
$Comp
L DC_BARREL J2
U 1 1 57D68B7C
P 4150 2250
F 0 "J2" H 4150 2500 50  0000 C CNN
F 1 "DC_BARREL" H 4150 2050 50  0001 C CNN
F 2 "diff_driver_custom:barrel_161314" H 4150 2250 50  0001 C CNN
F 3 "" H 4150 2250 50  0000 C CNN
F 4 "Multicomp" H 4150 2250 60  0001 C CNN "Manufacturer"
F 5 "MJ-179SMT" H 4150 2250 60  0001 C CNN "Part Number"
F 6 "Yes" H 4150 2250 60  0001 C CNN "SMD"
	1    4150 2250
	1    0    0    -1  
$EndComp
$EndSCHEMATC
