<?xml version="1.0" encoding="UTF-8" standalone="no"?>
<!-- Created with Inkscape (http://www.inkscape.org/) -->

<svg
   xmlns:dc="http://purl.org/dc/elements/1.1/"
   xmlns:cc="http://creativecommons.org/ns#"
   xmlns:rdf="http://www.w3.org/1999/02/22-rdf-syntax-ns#"
   xmlns:svg="http://www.w3.org/2000/svg"
   xmlns="http://www.w3.org/2000/svg"
   xmlns:sodipodi="http://sodipodi.sourceforge.net/DTD/sodipodi-0.dtd"
   xmlns:inkscape="http://www.inkscape.org/namespaces/inkscape"
   width="763.9563"
   height="474.45511"
   id="svg2"
   version="1.1"
   inkscape:version="0.48.3.1 r9886"
   sodipodi:docname="timetag-buf-mech.svg">
  <defs
     id="defs4">
    <marker
       inkscape:stockid="TriangleOutM"
       orient="auto"
       refY="0"
       refX="0"
       id="TriangleOutM"
       style="overflow:visible">
      <path
         id="path3914"
         d="m 5.77,0 -8.65,5 0,-10 8.65,5 z"
         style="fill-rule:evenodd;stroke:#000000;stroke-width:1pt"
         transform="scale(0.4,0.4)"
         inkscape:connector-curvature="0" />
    </marker>
  </defs>
  <sodipodi:namedview
     id="base"
     pagecolor="#ffffff"
     bordercolor="#666666"
     borderopacity="1.0"
     inkscape:pageopacity="0.0"
     inkscape:pageshadow="2"
     inkscape:zoom="1.3398153"
     inkscape:cx="289.74312"
     inkscape:cy="282.06868"
     inkscape:document-units="px"
     inkscape:current-layer="layer1"
     showgrid="true"
     inkscape:window-width="1855"
     inkscape:window-height="1176"
     inkscape:window-x="65"
     inkscape:window-y="24"
     inkscape:window-maximized="1"
     showguides="true"
     inkscape:guide-bbox="true"
     fit-margin-top="0"
     fit-margin-left="0"
     fit-margin-right="0"
     fit-margin-bottom="0">
    <inkscape:grid
       type="xygrid"
       id="grid2985"
       empspacing="5"
       visible="true"
       enabled="true"
       snapvisiblegridlinesonly="true"
       units="mm"
       spacingx="0.5mm"
       spacingy="0.5mm"
       originx="35.005274mm"
       originy="-158.94332mm" />
  </sodipodi:namedview>
  <metadata
     id="metadata7">
    <rdf:RDF>
      <cc:Work
         rdf:about="">
        <dc:format>image/svg+xml</dc:format>
        <dc:type
           rdf:resource="http://purl.org/dc/dcmitype/StillImage" />
        <dc:title />
      </cc:Work>
    </rdf:RDF>
  </metadata>
  <g
     inkscape:label="Layer 1"
     inkscape:groupmode="layer"
     id="layer1"
     transform="translate(124.03443,-14.722073)">
    <rect
       style="fill:#ffffff;fill-opacity:1;stroke:#000000;stroke-width:1px;stroke-linecap:butt;stroke-linejoin:miter;stroke-opacity:1"
       id="rect2987"
       width="35.433071"
       height="26.574802"
       x="53.149605"
       y="51.37793" />
    <rect
       y="51.37793"
       x="88.58268"
       height="26.574802"
       width="35.433071"
       id="rect3757"
       style="fill:#ffffff;fill-opacity:1;stroke:#000000;stroke-width:1px;stroke-linecap:butt;stroke-linejoin:miter;stroke-opacity:1" />
    <rect
       y="51.37793"
       x="124.01575"
       height="26.574802"
       width="35.433071"
       id="rect3759"
       style="fill:#ffffff;fill-opacity:1;stroke:#000000;stroke-width:1px;stroke-linecap:butt;stroke-linejoin:miter;stroke-opacity:1" />
    <rect
       style="fill:#ffffff;fill-opacity:1;stroke:#000000;stroke-width:1px;stroke-linecap:butt;stroke-linejoin:miter;stroke-opacity:1"
       id="rect3761"
       width="35.433071"
       height="26.574802"
       x="159.44882"
       y="51.440475" />
    <path
       sodipodi:nodetypes="cc"
       inkscape:connector-curvature="0"
       id="path4209"
       d="m 70.866143,95.669269 0,-12.401575"
       style="fill:none;stroke:#000000;stroke-width:1px;stroke-linecap:butt;stroke-linejoin:miter;stroke-opacity:1;marker-end:url(#TriangleOutM)" />
    <text
       xml:space="preserve"
       style="font-size:40px;font-style:normal;font-weight:normal;line-height:125%;letter-spacing:0px;word-spacing:0px;fill:#000000;fill-opacity:1;stroke:none;font-family:Sans"
       x="70.866142"
       y="24.803127"
       id="text4211"
       sodipodi:linespacing="125%"><tspan
         sodipodi:role="line"
         id="tspan4213"
         x="70.866142"
         y="24.803127"
         style="font-size:18px;text-align:center;text-anchor:middle">rp</tspan></text>
    <text
       sodipodi:linespacing="125%"
       id="text4215"
       y="113.3858"
       x="70.866142"
       style="font-size:40px;font-style:normal;font-weight:normal;line-height:125%;letter-spacing:0px;word-spacing:0px;fill:#000000;fill-opacity:1;stroke:none;font-family:Sans"
       xml:space="preserve"><tspan
         style="font-size:18px;text-align:center;text-anchor:middle"
         y="113.3858"
         x="70.866142"
         id="tspan4217"
         sodipodi:role="line">wp</tspan></text>
    <path
       style="fill:none;stroke:#000000;stroke-width:1px;stroke-linecap:butt;stroke-linejoin:miter;stroke-opacity:1;marker-end:url(#TriangleOutM)"
       d="m 70.866143,33.661395 0,12.401575"
       id="path4219"
       inkscape:connector-curvature="0"
       sodipodi:nodetypes="cc" />
    <text
       xml:space="preserve"
       style="font-size:40px;font-style:normal;font-weight:normal;line-height:125%;letter-spacing:0px;word-spacing:0px;fill:#000000;fill-opacity:1;stroke:none;font-family:Sans"
       x="203.74016"
       y="57.587254"
       id="text4240"
       sodipodi:linespacing="125%"><tspan
         sodipodi:role="line"
         id="tspan4242"
         x="203.74016"
         y="57.587254"
         style="font-size:8px">EMPTY = 1</tspan><tspan
         sodipodi:role="line"
         x="203.74016"
         y="67.58725"
         id="tspan4244"
         style="font-size:8px">FULL = 0</tspan><tspan
         sodipodi:role="line"
         x="203.74016"
         y="77.58725"
         style="font-size:8px"
         id="tspan4246">USEDW = 0</tspan></text>
    <rect
       y="175.39368"
       x="53.149605"
       height="26.574802"
       width="35.433071"
       id="rect4248"
       style="fill:#cccccc;fill-opacity:1;stroke:#000000;stroke-width:1px;stroke-linecap:butt;stroke-linejoin:miter;stroke-opacity:1" />
    <rect
       style="fill:#ffffff;fill-opacity:1;stroke:#000000;stroke-width:1px;stroke-linecap:butt;stroke-linejoin:miter;stroke-opacity:1"
       id="rect4250"
       width="35.433071"
       height="26.574802"
       x="88.58268"
       y="175.39368" />
    <rect
       style="fill:#ffffff;fill-opacity:1;stroke:#000000;stroke-width:1px;stroke-linecap:butt;stroke-linejoin:miter;stroke-opacity:1"
       id="rect4252"
       width="35.433071"
       height="26.574802"
       x="124.01575"
       y="175.39368" />
    <rect
       y="175.45622"
       x="159.44882"
       height="26.574802"
       width="35.433071"
       id="rect4254"
       style="fill:#ffffff;fill-opacity:1;stroke:#000000;stroke-width:1px;stroke-linecap:butt;stroke-linejoin:miter;stroke-opacity:1" />
    <path
       style="fill:none;stroke:#000000;stroke-width:1px;stroke-linecap:butt;stroke-linejoin:miter;stroke-opacity:1;marker-end:url(#TriangleOutM)"
       d="m 106.29921,219.68502 0,-12.40158"
       id="path4256"
       inkscape:connector-curvature="0"
       sodipodi:nodetypes="cc" />
    <text
       sodipodi:linespacing="125%"
       id="text4258"
       y="148.81888"
       x="70.866142"
       style="font-size:40px;font-style:normal;font-weight:normal;line-height:125%;letter-spacing:0px;word-spacing:0px;fill:#000000;fill-opacity:1;stroke:none;font-family:Sans"
       xml:space="preserve"><tspan
         style="font-size:18px;text-align:center;text-anchor:middle"
         y="148.81888"
         x="70.866142"
         id="tspan4260"
         sodipodi:role="line">rp</tspan></text>
    <text
       xml:space="preserve"
       style="font-size:40px;font-style:normal;font-weight:normal;line-height:125%;letter-spacing:0px;word-spacing:0px;fill:#000000;fill-opacity:1;stroke:none;font-family:Sans"
       x="106.29921"
       y="237.40155"
       id="text4262"
       sodipodi:linespacing="125%"><tspan
         sodipodi:role="line"
         id="tspan4264"
         x="106.29921"
         y="237.40155"
         style="font-size:18px;text-align:center;text-anchor:middle">wp</tspan></text>
    <path
       sodipodi:nodetypes="cc"
       inkscape:connector-curvature="0"
       id="path4266"
       d="m 70.866143,157.67714 0,12.40158"
       style="fill:none;stroke:#000000;stroke-width:1px;stroke-linecap:butt;stroke-linejoin:miter;stroke-opacity:1;marker-end:url(#TriangleOutM)" />
    <text
       sodipodi:linespacing="125%"
       id="text4268"
       y="181.603"
       x="203.74016"
       style="font-size:40px;font-style:normal;font-weight:normal;line-height:125%;letter-spacing:0px;word-spacing:0px;fill:#000000;fill-opacity:1;stroke:none;font-family:Sans"
       xml:space="preserve"><tspan
         style="font-size:8px"
         y="181.603"
         x="203.74016"
         id="tspan4270"
         sodipodi:role="line">EMPTY = 0</tspan><tspan
         style="font-size:8px"
         id="tspan4272"
         y="191.603"
         x="203.74016"
         sodipodi:role="line">FULL = 0</tspan><tspan
         id="tspan4274"
         style="font-size:8px"
         y="201.603"
         x="203.74016"
         sodipodi:role="line">USEDW = 1</tspan></text>
    <text
       sodipodi:linespacing="125%"
       id="text4276"
       y="69.094467"
       x="17.716536"
       style="font-size:40px;font-style:normal;font-weight:normal;line-height:125%;letter-spacing:0px;word-spacing:0px;fill:#000000;fill-opacity:1;stroke:none;font-family:Sans"
       xml:space="preserve"><tspan
         style="font-size:18px;text-align:center;text-anchor:middle"
         y="69.094467"
         x="17.716536"
         id="tspan4278"
         sodipodi:role="line" /></text>
    <rect
       style="fill:#cccccc;fill-opacity:1;stroke:#000000;stroke-width:1px;stroke-linecap:butt;stroke-linejoin:miter;stroke-opacity:1"
       id="rect4280"
       width="35.433071"
       height="26.574802"
       x="53.149605"
       y="175.39368" />
    <rect
       y="175.39368"
       x="88.58268"
       height="26.574802"
       width="35.433071"
       id="rect4282"
       style="fill:#ffffff;fill-opacity:1;stroke:#000000;stroke-width:1px;stroke-linecap:butt;stroke-linejoin:miter;stroke-opacity:1" />
    <rect
       y="175.39368"
       x="124.01575"
       height="26.574802"
       width="35.433071"
       id="rect4284"
       style="fill:#ffffff;fill-opacity:1;stroke:#000000;stroke-width:1px;stroke-linecap:butt;stroke-linejoin:miter;stroke-opacity:1" />
    <rect
       style="fill:#ffffff;fill-opacity:1;stroke:#000000;stroke-width:1px;stroke-linecap:butt;stroke-linejoin:miter;stroke-opacity:1"
       id="rect4286"
       width="35.433071"
       height="26.574802"
       x="159.44882"
       y="175.45622" />
    <path
       sodipodi:nodetypes="cc"
       inkscape:connector-curvature="0"
       id="path4288"
       d="m 106.29921,219.68502 0,-12.40158"
       style="fill:none;stroke:#000000;stroke-width:1px;stroke-linecap:butt;stroke-linejoin:miter;stroke-opacity:1;marker-end:url(#TriangleOutM)" />
    <text
       xml:space="preserve"
       style="font-size:40px;font-style:normal;font-weight:normal;line-height:125%;letter-spacing:0px;word-spacing:0px;fill:#000000;fill-opacity:1;stroke:none;font-family:Sans"
       x="70.866142"
       y="148.81888"
       id="text4290"
       sodipodi:linespacing="125%"><tspan
         sodipodi:role="line"
         id="tspan4292"
         x="70.866142"
         y="148.81888"
         style="font-size:18px;text-align:center;text-anchor:middle">rp</tspan></text>
    <text
       sodipodi:linespacing="125%"
       id="text4294"
       y="237.40155"
       x="106.29921"
       style="font-size:40px;font-style:normal;font-weight:normal;line-height:125%;letter-spacing:0px;word-spacing:0px;fill:#000000;fill-opacity:1;stroke:none;font-family:Sans"
       xml:space="preserve"><tspan
         style="font-size:18px;text-align:center;text-anchor:middle"
         y="237.40155"
         x="106.29921"
         id="tspan4296"
         sodipodi:role="line">wp</tspan></text>
    <path
       style="fill:none;stroke:#000000;stroke-width:1px;stroke-linecap:butt;stroke-linejoin:miter;stroke-opacity:1;marker-end:url(#TriangleOutM)"
       d="m 70.866143,157.67714 0,12.40158"
       id="path4298"
       inkscape:connector-curvature="0"
       sodipodi:nodetypes="cc" />
    <text
       xml:space="preserve"
       style="font-size:40px;font-style:normal;font-weight:normal;line-height:125%;letter-spacing:0px;word-spacing:0px;fill:#000000;fill-opacity:1;stroke:none;font-family:Sans"
       x="203.74016"
       y="181.603"
       id="text4300"
       sodipodi:linespacing="125%"><tspan
         sodipodi:role="line"
         id="tspan4302"
         x="203.74016"
         y="181.603"
         style="font-size:8px">EMPTY = 0</tspan><tspan
         sodipodi:role="line"
         x="203.74016"
         y="191.603"
         id="tspan4304"
         style="font-size:8px">FULL = 0</tspan><tspan
         sodipodi:role="line"
         x="203.74016"
         y="201.603"
         style="font-size:8px"
         id="tspan4306">USEDW = 1</tspan></text>
    <rect
       y="299.40942"
       x="53.149605"
       height="26.574802"
       width="35.433071"
       id="rect4308"
       style="fill:#cccccc;fill-opacity:1;stroke:#000000;stroke-width:1px;stroke-linecap:butt;stroke-linejoin:miter;stroke-opacity:1" />
    <rect
       style="fill:#cccccc;fill-opacity:1;stroke:#000000;stroke-width:1px;stroke-linecap:butt;stroke-linejoin:miter;stroke-opacity:1"
       id="rect4310"
       width="35.433071"
       height="26.574802"
       x="88.58268"
       y="299.40942" />
    <rect
       style="fill:#cccccc;fill-opacity:1;stroke:#000000;stroke-width:1px;stroke-linecap:butt;stroke-linejoin:miter;stroke-opacity:1"
       id="rect4312"
       width="35.433071"
       height="26.574802"
       x="124.01575"
       y="299.40942" />
    <rect
       y="299.47195"
       x="159.44882"
       height="26.574802"
       width="35.433071"
       id="rect4314"
       style="fill:#cccccc;fill-opacity:1;stroke:#000000;stroke-width:1px;stroke-linecap:butt;stroke-linejoin:miter;stroke-opacity:1" />
    <path
       style="fill:none;stroke:#000000;stroke-width:1px;stroke-linecap:butt;stroke-linejoin:miter;stroke-opacity:1;marker-end:url(#TriangleOutM)"
       d="m 70.866142,343.70076 0,-12.40157"
       id="path4316"
       inkscape:connector-curvature="0"
       sodipodi:nodetypes="cc" />
    <text
       sodipodi:linespacing="125%"
       id="text4318"
       y="272.83463"
       x="70.866142"
       style="font-size:40px;font-style:normal;font-weight:normal;line-height:125%;letter-spacing:0px;word-spacing:0px;fill:#000000;fill-opacity:1;stroke:none;font-family:Sans"
       xml:space="preserve"><tspan
         style="font-size:18px;text-align:center;text-anchor:middle"
         y="272.83463"
         x="70.866142"
         id="tspan4320"
         sodipodi:role="line">rp</tspan></text>
    <text
       xml:space="preserve"
       style="font-size:40px;font-style:normal;font-weight:normal;line-height:125%;letter-spacing:0px;word-spacing:0px;fill:#000000;fill-opacity:1;stroke:none;font-family:Sans"
       x="70.866142"
       y="361.4173"
       id="text4322"
       sodipodi:linespacing="125%"><tspan
         sodipodi:role="line"
         id="tspan4324"
         x="70.866142"
         y="361.4173"
         style="font-size:18px;text-align:center;text-anchor:middle">wp</tspan></text>
    <path
       sodipodi:nodetypes="cc"
       inkscape:connector-curvature="0"
       id="path4326"
       d="m 70.866142,281.69289 0,12.40157"
       style="fill:none;stroke:#000000;stroke-width:1px;stroke-linecap:butt;stroke-linejoin:miter;stroke-opacity:1;marker-end:url(#TriangleOutM)" />
    <text
       sodipodi:linespacing="125%"
       id="text4328"
       y="305.61874"
       x="203.74016"
       style="font-size:40px;font-style:normal;font-weight:normal;line-height:125%;letter-spacing:0px;word-spacing:0px;fill:#000000;fill-opacity:1;stroke:none;font-family:Sans"
       xml:space="preserve"><tspan
         style="font-size:8px"
         y="305.61874"
         x="203.74016"
         id="tspan4330"
         sodipodi:role="line">EMPTY = 0</tspan><tspan
         style="font-size:8px"
         id="tspan4332"
         y="315.61874"
         x="203.74016"
         sodipodi:role="line">FULL = 1</tspan><tspan
         id="tspan4334"
         style="font-size:8px"
         y="325.61874"
         x="203.74016"
         sodipodi:role="line">USEDW = 0</tspan></text>
    <rect
       style="fill:#333333;fill-opacity:1;stroke:#000000;stroke-width:1px;stroke-linecap:butt;stroke-linejoin:miter;stroke-opacity:1"
       id="rect4336"
       width="35.433071"
       height="26.574802"
       x="53.149605"
       y="423.42517" />
    <rect
       y="423.42517"
       x="88.58268"
       height="26.574802"
       width="35.433071"
       id="rect4338"
       style="fill:#cccccc;fill-opacity:1;stroke:#000000;stroke-width:1px;stroke-linecap:butt;stroke-linejoin:miter;stroke-opacity:1" />
    <rect
       y="423.42517"
       x="124.01575"
       height="26.574802"
       width="35.433071"
       id="rect4340"
       style="fill:#cccccc;fill-opacity:1;stroke:#000000;stroke-width:1px;stroke-linecap:butt;stroke-linejoin:miter;stroke-opacity:1" />
    <rect
       style="fill:#cccccc;fill-opacity:1;stroke:#000000;stroke-width:1px;stroke-linecap:butt;stroke-linejoin:miter;stroke-opacity:1"
       id="rect4342"
       width="35.433071"
       height="26.574802"
       x="159.44882"
       y="423.4877" />
    <path
       sodipodi:nodetypes="cc"
       inkscape:connector-curvature="0"
       id="path4344"
       d="m 106.29921,467.71651 0,-12.40157"
       style="fill:none;stroke:#000000;stroke-width:1px;stroke-linecap:butt;stroke-linejoin:miter;stroke-opacity:1;marker-end:url(#TriangleOutM)" />
    <text
       xml:space="preserve"
       style="font-size:40px;font-style:normal;font-weight:normal;line-height:125%;letter-spacing:0px;word-spacing:0px;fill:#000000;fill-opacity:1;stroke:none;font-family:Sans"
       x="106.29921"
       y="396.85037"
       id="text4346"
       sodipodi:linespacing="125%"><tspan
         sodipodi:role="line"
         id="tspan4348"
         x="106.29921"
         y="396.85037"
         style="font-size:18px;text-align:center;text-anchor:middle">rp</tspan></text>
    <text
       sodipodi:linespacing="125%"
       id="text4350"
       y="485.43304"
       x="106.29921"
       style="font-size:40px;font-style:normal;font-weight:normal;line-height:125%;letter-spacing:0px;word-spacing:0px;fill:#000000;fill-opacity:1;stroke:none;font-family:Sans"
       xml:space="preserve"><tspan
         style="font-size:18px;text-align:center;text-anchor:middle"
         y="485.43304"
         x="106.29921"
         id="tspan4352"
         sodipodi:role="line">wp</tspan></text>
    <path
       style="fill:none;stroke:#000000;stroke-width:1px;stroke-linecap:butt;stroke-linejoin:miter;stroke-opacity:1;marker-end:url(#TriangleOutM)"
       d="m 106.29921,405.70864 0,12.40157"
       id="path4354"
       inkscape:connector-curvature="0"
       sodipodi:nodetypes="cc" />
    <text
       xml:space="preserve"
       style="font-size:40px;font-style:normal;font-weight:normal;line-height:125%;letter-spacing:0px;word-spacing:0px;fill:#000000;fill-opacity:1;stroke:none;font-family:Sans"
       x="203.74016"
       y="429.63449"
       id="text4356"
       sodipodi:linespacing="125%"><tspan
         sodipodi:role="line"
         id="tspan4358"
         x="203.74016"
         y="429.63449"
         style="font-size:8px">EMPTY = 0</tspan><tspan
         sodipodi:role="line"
         x="203.74016"
         y="439.63449"
         id="tspan4360"
         style="font-size:8px">FULL = 1</tspan><tspan
         sodipodi:role="line"
         x="203.74016"
         y="449.63449"
         style="font-size:8px"
         id="tspan4362">USEDW = 0</tspan></text>
    <rect
       y="175.39368"
       x="442.91339"
       height="26.574802"
       width="35.433071"
       id="rect4364"
       style="fill:#cccccc;fill-opacity:1;stroke:#000000;stroke-width:1px;stroke-linecap:butt;stroke-linejoin:miter;stroke-opacity:1" />
    <rect
       style="fill:#ffffff;fill-opacity:1;stroke:#000000;stroke-width:1px;stroke-linecap:butt;stroke-linejoin:miter;stroke-opacity:1"
       id="rect4366"
       width="35.433071"
       height="26.574802"
       x="478.34647"
       y="175.39368" />
    <rect
       style="fill:#cccccc;fill-opacity:1;stroke:#000000;stroke-width:1px;stroke-linecap:butt;stroke-linejoin:miter;stroke-opacity:1"
       id="rect4368"
       width="35.433071"
       height="26.574802"
       x="513.77948"
       y="175.39368" />
    <rect
       y="175.45624"
       x="549.21259"
       height="26.574802"
       width="35.433071"
       id="rect4370"
       style="fill:#cccccc;fill-opacity:1;stroke:#000000;stroke-width:1px;stroke-linecap:butt;stroke-linejoin:miter;stroke-opacity:1" />
    <path
       style="fill:none;stroke:#000000;stroke-width:1px;stroke-linecap:butt;stroke-linejoin:miter;stroke-opacity:1;marker-end:url(#TriangleOutM)"
       d="m 496.06299,219.68502 0,-12.40157"
       id="path4372"
       inkscape:connector-curvature="0"
       sodipodi:nodetypes="cc" />
    <text
       sodipodi:linespacing="125%"
       id="text4374"
       y="148.81891"
       x="531.49603"
       style="font-size:40px;font-style:normal;font-weight:normal;line-height:125%;letter-spacing:0px;word-spacing:0px;fill:#000000;fill-opacity:1;stroke:none;font-family:Sans"
       xml:space="preserve"><tspan
         style="font-size:18px;text-align:center;text-anchor:middle"
         y="148.81891"
         x="531.49603"
         id="tspan4376"
         sodipodi:role="line">rp</tspan></text>
    <text
       xml:space="preserve"
       style="font-size:40px;font-style:normal;font-weight:normal;line-height:125%;letter-spacing:0px;word-spacing:0px;fill:#000000;fill-opacity:1;stroke:none;font-family:Sans"
       x="496.06296"
       y="237.40155"
       id="text4378"
       sodipodi:linespacing="125%"><tspan
         sodipodi:role="line"
         id="tspan4380"
         x="496.06296"
         y="237.40155"
         style="font-size:18px;text-align:center;text-anchor:middle">wp</tspan></text>
    <path
       sodipodi:nodetypes="cc"
       inkscape:connector-curvature="0"
       id="path4382"
       d="m 531.49606,157.67715 0,12.40157"
       style="fill:none;stroke:#000000;stroke-width:1px;stroke-linecap:butt;stroke-linejoin:miter;stroke-opacity:1;marker-end:url(#TriangleOutM)" />
    <text
       sodipodi:linespacing="125%"
       id="text4384"
       y="181.60303"
       x="593.50391"
       style="font-size:40px;font-style:normal;font-weight:normal;line-height:125%;letter-spacing:0px;word-spacing:0px;fill:#000000;fill-opacity:1;stroke:none;font-family:Sans"
       xml:space="preserve"><tspan
         style="font-size:8px"
         y="181.60303"
         x="593.50391"
         id="tspan4386"
         sodipodi:role="line">EMPTY = 0</tspan><tspan
         style="font-size:8px"
         id="tspan4388"
         y="191.60303"
         x="593.50391"
         sodipodi:role="line">FULL = 0</tspan><tspan
         id="tspan4390"
         style="font-size:8px"
         y="201.60303"
         x="593.50391"
         sodipodi:role="line">USEDW = 3</tspan></text>
    <rect
       style="fill:#cccccc;fill-opacity:1;stroke:#000000;stroke-width:1px;stroke-linecap:butt;stroke-linejoin:miter;stroke-opacity:1"
       id="rect4392"
       width="35.433071"
       height="26.574802"
       x="442.91339"
       y="299.40942" />
    <rect
       y="299.40942"
       x="478.34647"
       height="26.574802"
       width="35.433071"
       id="rect4394"
       style="fill:#ffffff;fill-opacity:1;stroke:#000000;stroke-width:1px;stroke-linecap:butt;stroke-linejoin:miter;stroke-opacity:1" />
    <rect
       y="299.40942"
       x="513.77948"
       height="26.574802"
       width="35.433071"
       id="rect4396"
       style="fill:#ffffff;fill-opacity:1;stroke:#000000;stroke-width:1px;stroke-linecap:butt;stroke-linejoin:miter;stroke-opacity:1" />
    <rect
       style="fill:#ffffff;fill-opacity:1;stroke:#000000;stroke-width:1px;stroke-linecap:butt;stroke-linejoin:miter;stroke-opacity:1"
       id="rect4398"
       width="35.433071"
       height="26.574802"
       x="549.21259"
       y="299.47198" />
    <path
       sodipodi:nodetypes="cc"
       inkscape:connector-curvature="0"
       id="path4400"
       d="m 496.06299,343.70077 0,-12.40157"
       style="fill:none;stroke:#000000;stroke-width:1px;stroke-linecap:butt;stroke-linejoin:miter;stroke-opacity:1;marker-end:url(#TriangleOutM)" />
    <text
       xml:space="preserve"
       style="font-size:40px;font-style:normal;font-weight:normal;line-height:125%;letter-spacing:0px;word-spacing:0px;fill:#000000;fill-opacity:1;stroke:none;font-family:Sans"
       x="460.62991"
       y="272.83466"
       id="text4402"
       sodipodi:linespacing="125%"><tspan
         sodipodi:role="line"
         id="tspan4404"
         x="460.62991"
         y="272.83466"
         style="font-size:18px;text-align:center;text-anchor:middle">rp</tspan></text>
    <text
       sodipodi:linespacing="125%"
       id="text4406"
       y="361.4173"
       x="496.06296"
       style="font-size:40px;font-style:normal;font-weight:normal;line-height:125%;letter-spacing:0px;word-spacing:0px;fill:#000000;fill-opacity:1;stroke:none;font-family:Sans"
       xml:space="preserve"><tspan
         style="font-size:18px;text-align:center;text-anchor:middle"
         y="361.4173"
         x="496.06296"
         id="tspan4408"
         sodipodi:role="line">wp</tspan></text>
    <path
       style="fill:none;stroke:#000000;stroke-width:1px;stroke-linecap:butt;stroke-linejoin:miter;stroke-opacity:1;marker-end:url(#TriangleOutM)"
       d="m 460.62992,281.6929 0,12.40157"
       id="path4410"
       inkscape:connector-curvature="0"
       sodipodi:nodetypes="cc" />
    <text
       xml:space="preserve"
       style="font-size:40px;font-style:normal;font-weight:normal;line-height:125%;letter-spacing:0px;word-spacing:0px;fill:#000000;fill-opacity:1;stroke:none;font-family:Sans"
       x="593.50391"
       y="305.61877"
       id="text4412"
       sodipodi:linespacing="125%"><tspan
         sodipodi:role="line"
         id="tspan4414"
         x="593.50391"
         y="305.61877"
         style="font-size:8px">EMPTY = 0</tspan><tspan
         sodipodi:role="line"
         x="593.50391"
         y="315.61877"
         id="tspan4416"
         style="font-size:8px">FULL = 0</tspan><tspan
         sodipodi:role="line"
         x="593.50391"
         y="325.61877"
         style="font-size:8px"
         id="tspan4418">USEDW = 1</tspan></text>
    <rect
       y="423.42517"
       x="442.91339"
       height="26.574802"
       width="35.433071"
       id="rect4420"
       style="fill:#ffffff;fill-opacity:1;stroke:#000000;stroke-width:1px;stroke-linecap:butt;stroke-linejoin:miter;stroke-opacity:1" />
    <rect
       style="fill:#ffffff;fill-opacity:1;stroke:#000000;stroke-width:1px;stroke-linecap:butt;stroke-linejoin:miter;stroke-opacity:1"
       id="rect4422"
       width="35.433071"
       height="26.574802"
       x="478.34647"
       y="423.42517" />
    <rect
       style="fill:#ffffff;fill-opacity:1;stroke:#000000;stroke-width:1px;stroke-linecap:butt;stroke-linejoin:miter;stroke-opacity:1"
       id="rect4424"
       width="35.433071"
       height="26.574802"
       x="513.77948"
       y="423.42517" />
    <rect
       y="423.42517"
       x="549.21259"
       height="26.574802"
       width="35.433071"
       id="rect4426"
       style="fill:#ffffff;fill-opacity:1;stroke:#000000;stroke-width:1px;stroke-linecap:butt;stroke-linejoin:miter;stroke-opacity:1" />
    <path
       style="fill:none;stroke:#000000;stroke-width:1px;stroke-linecap:butt;stroke-linejoin:miter;stroke-opacity:1;marker-end:url(#TriangleOutM)"
       d="m 496.06299,467.71653 0,-12.4016"
       id="path4428"
       inkscape:connector-curvature="0"
       sodipodi:nodetypes="cc" />
    <text
       sodipodi:linespacing="125%"
       id="text4430"
       y="396.85034"
       x="496.06302"
       style="font-size:40px;font-style:normal;font-weight:normal;line-height:125%;letter-spacing:0px;word-spacing:0px;fill:#000000;fill-opacity:1;stroke:none;font-family:Sans"
       xml:space="preserve"><tspan
         style="font-size:18px;text-align:center;text-anchor:middle"
         y="396.85034"
         x="496.06302"
         id="tspan4432"
         sodipodi:role="line">rp</tspan></text>
    <text
       xml:space="preserve"
       style="font-size:40px;font-style:normal;font-weight:normal;line-height:125%;letter-spacing:0px;word-spacing:0px;fill:#000000;fill-opacity:1;stroke:none;font-family:Sans"
       x="496.06296"
       y="485.43301"
       id="text4434"
       sodipodi:linespacing="125%"><tspan
         sodipodi:role="line"
         id="tspan4436"
         x="496.06296"
         y="485.43301"
         style="font-size:18px;text-align:center;text-anchor:middle">wp</tspan></text>
    <path
       sodipodi:nodetypes="cc"
       inkscape:connector-curvature="0"
       id="path4438"
       d="m 496.06299,405.70863 0,12.4016"
       style="fill:none;stroke:#000000;stroke-width:1px;stroke-linecap:butt;stroke-linejoin:miter;stroke-opacity:1;marker-end:url(#TriangleOutM)" />
    <text
       sodipodi:linespacing="125%"
       id="text4440"
       y="429.63452"
       x="593.50391"
       style="font-size:40px;font-style:normal;font-weight:normal;line-height:125%;letter-spacing:0px;word-spacing:0px;fill:#000000;fill-opacity:1;stroke:none;font-family:Sans"
       xml:space="preserve"><tspan
         style="font-size:8px"
         y="429.63452"
         x="593.50391"
         id="tspan4442"
         sodipodi:role="line">EMPTY = 1</tspan><tspan
         style="font-size:8px"
         id="tspan4444"
         y="439.63452"
         x="593.50391"
         sodipodi:role="line">FULL = 0</tspan><tspan
         id="tspan4446"
         style="font-size:8px"
         y="449.63452"
         x="593.50391"
         sodipodi:role="line">USEDW = 0</tspan></text>
    <text
       sodipodi:linespacing="125%"
       id="text4476"
       y="62.143356"
       x="44.29134"
       style="font-size:40px;font-style:normal;font-weight:normal;line-height:125%;letter-spacing:0px;word-spacing:0px;fill:#000000;fill-opacity:1;stroke:none;font-family:Sans"
       xml:space="preserve"><tspan
         style="font-size:11px;text-align:end;text-anchor:end"
         y="62.143356"
         x="44.29134"
         sodipodi:role="line"
         id="tspan4482">Before pulse arrival,</tspan><tspan
         style="font-size:11px;text-align:end;text-anchor:end"
         y="75.893356"
         x="44.29134"
         sodipodi:role="line"
         id="tspan4489">or after buffer clear</tspan></text>
    <text
       xml:space="preserve"
       style="font-size:40px;font-style:normal;font-weight:normal;line-height:125%;letter-spacing:0px;word-spacing:0px;fill:#000000;fill-opacity:1;stroke:none;font-family:Sans"
       x="44.29134"
       y="185.18987"
       id="text4491"
       sodipodi:linespacing="125%"><tspan
         id="tspan4495"
         sodipodi:role="line"
         x="44.29134"
         y="185.18987"
         style="font-size:11px;text-align:end;text-anchor:end">One pulse arrives,</tspan><tspan
         sodipodi:role="line"
         x="44.29134"
         y="198.93987"
         style="font-size:11px;text-align:end;text-anchor:end"
         id="tspan4499">advancing write</tspan><tspan
         sodipodi:role="line"
         x="44.29134"
         y="212.68987"
         style="font-size:11px;text-align:end;text-anchor:end"
         id="tspan4648">pointer</tspan></text>
    <text
       sodipodi:linespacing="125%"
       id="text4501"
       y="309.20563"
       x="30.024872"
       style="font-size:40px;font-style:normal;font-weight:normal;line-height:125%;letter-spacing:0px;word-spacing:0px;fill:#000000;fill-opacity:1;stroke:none;font-family:Sans"
       xml:space="preserve"><tspan
         id="tspan4505"
         style="font-size:11px;text-align:end;text-anchor:end"
         y="309.20563"
         x="30.024872"
         sodipodi:role="line">Three more pulses</tspan><tspan
         style="font-size:11px;text-align:end;text-anchor:end"
         y="322.95563"
         x="30.024872"
         sodipodi:role="line"
         id="tspan4509">arrive, filling up</tspan><tspan
         style="font-size:11px;text-align:end;text-anchor:end"
         y="336.70563"
         x="30.024872"
         sodipodi:role="line"
         id="tspan4654">the ring buffer</tspan></text>
    <text
       xml:space="preserve"
       style="font-size:40px;font-style:normal;font-weight:normal;line-height:125%;letter-spacing:0px;word-spacing:0px;fill:#000000;fill-opacity:1;stroke:none;font-family:Sans"
       x="-79.724411"
       y="432.28345"
       id="text4511"
       sodipodi:linespacing="125%"><tspan
         id="tspan4515"
         sodipodi:role="line"
         x="-79.724411"
         y="432.28345"
         style="font-size:10px;text-align:start;text-anchor:start" /></text>
    <text
       xml:space="preserve"
       style="font-size:40px;font-style:normal;font-weight:normal;line-height:125%;letter-spacing:0px;word-spacing:0px;fill:#000000;fill-opacity:1;stroke:none;font-family:Sans"
       x="37.085419"
       y="420.72137"
       id="text4519"
       sodipodi:linespacing="125%"><tspan
         id="tspan4523"
         sodipodi:role="line"
         x="37.085419"
         y="420.72137"
         style="font-size:11px;text-align:end;text-anchor:end">One more pulse arrives,</tspan><tspan
         sodipodi:role="line"
         x="37.085419"
         y="434.47137"
         style="font-size:11px;text-align:end;text-anchor:end"
         id="tspan4539">one timetag overwritten,</tspan><tspan
         sodipodi:role="line"
         x="37.085419"
         y="448.22137"
         style="font-size:11px;text-align:end;text-anchor:end"
         id="tspan4541">read pointer advances</tspan><tspan
         sodipodi:role="line"
         x="37.085419"
         y="461.97137"
         style="font-size:11px;text-align:end;text-anchor:end"
         id="tspan4668">with write pointer</tspan></text>
    <text
       sodipodi:linespacing="125%"
       id="text4529"
       y="178.93987"
       x="434.05515"
       style="font-size:40px;font-style:normal;font-weight:normal;line-height:125%;letter-spacing:0px;word-spacing:0px;fill:#000000;fill-opacity:1;stroke:none;font-family:Sans"
       xml:space="preserve"><tspan
         style="font-size:11px;text-align:end;text-anchor:end"
         y="178.93987"
         x="434.05515"
         sodipodi:role="line"
         id="tspan4533">Read from TBMR,</tspan><tspan
         style="font-size:11px;text-align:end;text-anchor:end"
         y="192.68987"
         x="434.05515"
         sodipodi:role="line"
         id="tspan4690">advancing read</tspan><tspan
         style="font-size:11px;text-align:end;text-anchor:end"
         y="206.43987"
         x="434.05515"
         sodipodi:role="line"
         id="tspan4694">pointer</tspan></text>
    <rect
       y="51.37793"
       x="442.91339"
       height="26.574802"
       width="35.433071"
       id="rect4543"
       style="fill:#cccccc;fill-opacity:1;stroke:#000000;stroke-width:1px;stroke-linecap:butt;stroke-linejoin:miter;stroke-opacity:1" />
    <rect
       style="fill:#cccccc;fill-opacity:1;stroke:#000000;stroke-width:1px;stroke-linecap:butt;stroke-linejoin:miter;stroke-opacity:1"
       id="rect4545"
       width="35.433071"
       height="26.574802"
       x="478.34647"
       y="51.37793" />
    <rect
       style="fill:#cccccc;fill-opacity:1;stroke:#000000;stroke-width:1px;stroke-linecap:butt;stroke-linejoin:miter;stroke-opacity:1"
       id="rect4547"
       width="35.433071"
       height="26.574802"
       x="513.77948"
       y="51.37793" />
    <rect
       y="51.440491"
       x="549.21259"
       height="26.574802"
       width="35.433071"
       id="rect4549"
       style="fill:#cccccc;fill-opacity:1;stroke:#000000;stroke-width:1px;stroke-linecap:butt;stroke-linejoin:miter;stroke-opacity:1" />
    <path
       style="fill:none;stroke:#000000;stroke-width:1px;stroke-linecap:butt;stroke-linejoin:miter;stroke-opacity:1;marker-end:url(#TriangleOutM)"
       d="m 496.06299,95.669271 0,-12.40157"
       id="path4551"
       inkscape:connector-curvature="0"
       sodipodi:nodetypes="cc" />
    <text
       sodipodi:linespacing="125%"
       id="text4553"
       y="24.803164"
       x="496.06296"
       style="font-size:40px;font-style:normal;font-weight:normal;line-height:125%;letter-spacing:0px;word-spacing:0px;fill:#000000;fill-opacity:1;stroke:none;font-family:Sans"
       xml:space="preserve"><tspan
         style="font-size:18px;text-align:center;text-anchor:middle"
         y="24.803164"
         x="496.06296"
         id="tspan4555"
         sodipodi:role="line">rp</tspan></text>
    <text
       xml:space="preserve"
       style="font-size:40px;font-style:normal;font-weight:normal;line-height:125%;letter-spacing:0px;word-spacing:0px;fill:#000000;fill-opacity:1;stroke:none;font-family:Sans"
       x="496.06296"
       y="113.3858"
       id="text4557"
       sodipodi:linespacing="125%"><tspan
         sodipodi:role="line"
         id="tspan4559"
         x="496.06296"
         y="113.3858"
         style="font-size:18px;text-align:center;text-anchor:middle">wp</tspan></text>
    <path
       sodipodi:nodetypes="cc"
       inkscape:connector-curvature="0"
       id="path4561"
       d="m 496.06299,33.6614 0,12.40157"
       style="fill:none;stroke:#000000;stroke-width:1px;stroke-linecap:butt;stroke-linejoin:miter;stroke-opacity:1;marker-end:url(#TriangleOutM)" />
    <text
       sodipodi:linespacing="125%"
       id="text4563"
       y="57.58728"
       x="593.50391"
       style="font-size:40px;font-style:normal;font-weight:normal;line-height:125%;letter-spacing:0px;word-spacing:0px;fill:#000000;fill-opacity:1;stroke:none;font-family:Sans"
       xml:space="preserve"><tspan
         style="font-size:8px"
         y="57.58728"
         x="593.50391"
         id="tspan4565"
         sodipodi:role="line">EMPTY = 0</tspan><tspan
         style="font-size:8px"
         id="tspan4567"
         y="67.58728"
         x="593.50391"
         sodipodi:role="line">FULL = 1</tspan><tspan
         id="tspan4569"
         style="font-size:8px"
         y="77.58728"
         x="593.50391"
         sodipodi:role="line">USEDW = 0</tspan></text>
    <text
       sodipodi:linespacing="125%"
       id="text4571"
       y="55.893356"
       x="435.87839"
       style="font-size:40px;font-style:normal;font-weight:normal;line-height:125%;letter-spacing:0px;word-spacing:0px;fill:#000000;fill-opacity:1;stroke:none;font-family:Sans"
       xml:space="preserve"><tspan
         id="tspan4579"
         style="font-size:11px;text-align:end;text-anchor:end"
         y="55.893356"
         x="435.87839"
         sodipodi:role="line">Read from TBCYR, TBTLR,</tspan><tspan
         style="font-size:11px;text-align:end;text-anchor:end"
         y="69.643356"
         x="435.87839"
         sodipodi:role="line"
         id="tspan4590">or TBHR, read pointer</tspan><tspan
         style="font-size:11px;text-align:end;text-anchor:end"
         y="83.393356"
         x="435.87839"
         sodipodi:role="line"
         id="tspan4592">does not advance</tspan></text>
    <text
       xml:space="preserve"
       style="font-size:40px;font-style:normal;font-weight:normal;line-height:125%;letter-spacing:0px;word-spacing:0px;fill:#000000;fill-opacity:1;stroke:none;font-family:Sans"
       x="434.05515"
       y="316.42487"
       id="text4594"
       sodipodi:linespacing="125%"><tspan
         sodipodi:role="line"
         x="434.05515"
         y="316.42487"
         style="font-size:11px;text-align:end;text-anchor:end"
         id="tspan4636">Two more TBMR reads</tspan></text>
    <text
       sodipodi:linespacing="125%"
       id="text4606"
       y="414.47137"
       x="434.05515"
       style="font-size:40px;font-style:normal;font-weight:normal;line-height:125%;letter-spacing:0px;word-spacing:0px;fill:#000000;fill-opacity:1;stroke:none;font-family:Sans"
       xml:space="preserve"><tspan
         style="font-size:11px;text-align:end;text-anchor:end"
         y="414.47137"
         x="434.05515"
         sodipodi:role="line"
         id="tspan4610">One more TBMR read,</tspan><tspan
         style="font-size:11px;text-align:end;text-anchor:end"
         y="428.22137"
         x="434.05515"
         sodipodi:role="line"
         id="tspan4704">emptying the buffer,</tspan><tspan
         style="font-size:11px;text-align:end;text-anchor:end"
         y="441.97137"
         x="434.05515"
         sodipodi:role="line"
         id="tspan4730">any more reads will</tspan><tspan
         style="font-size:11px;text-align:end;text-anchor:end"
         y="455.72137"
         x="434.05515"
         sodipodi:role="line"
         id="tspan4734">not advance the</tspan><tspan
         style="font-size:11px;text-align:end;text-anchor:end"
         y="469.47137"
         x="434.05515"
         sodipodi:role="line"
         id="tspan4738">read pointer</tspan></text>
    <text
       sodipodi:linespacing="125%"
       id="text4612"
       y="71.226364"
       x="-115.15748"
       style="font-size:40px;font-style:normal;font-weight:normal;line-height:125%;letter-spacing:0px;word-spacing:0px;fill:#000000;fill-opacity:1;stroke:none;font-family:Sans"
       xml:space="preserve"><tspan
         style="font-size:18px;font-weight:bold;text-align:center;text-anchor:middle"
         y="71.226364"
         x="-115.15748"
         id="tspan4614"
         sodipodi:role="line">1.</tspan></text>
    <text
       xml:space="preserve"
       style="font-size:40px;font-style:normal;font-weight:normal;line-height:125%;letter-spacing:0px;word-spacing:0px;fill:#000000;fill-opacity:1;stroke:none;font-family:Sans"
       x="-115.15748"
       y="195.36076"
       id="text4616"
       sodipodi:linespacing="125%"><tspan
         sodipodi:role="line"
         id="tspan4618"
         x="-115.15748"
         y="195.36076"
         style="font-size:18px;font-weight:bold;text-align:center;text-anchor:middle">2.</tspan></text>
    <text
       sodipodi:linespacing="125%"
       id="text4620"
       y="319.37653"
       x="-115.15748"
       style="font-size:40px;font-style:normal;font-weight:normal;line-height:125%;letter-spacing:0px;word-spacing:0px;fill:#000000;fill-opacity:1;stroke:none;font-family:Sans"
       xml:space="preserve"><tspan
         style="font-size:18px;font-weight:bold;text-align:center;text-anchor:middle"
         y="319.37653"
         x="-115.15748"
         id="tspan4622"
         sodipodi:role="line">3.</tspan></text>
    <text
       xml:space="preserve"
       style="font-size:40px;font-style:normal;font-weight:normal;line-height:125%;letter-spacing:0px;word-spacing:0px;fill:#000000;fill-opacity:1;stroke:none;font-family:Sans"
       x="-115.15748"
       y="443.27362"
       id="text4624"
       sodipodi:linespacing="125%"><tspan
         sodipodi:role="line"
         id="tspan4626"
         x="-115.15748"
         y="443.27362"
         style="font-size:18px;font-weight:bold;text-align:center;text-anchor:middle">4.</tspan></text>
    <text
       xml:space="preserve"
       style="font-size:40px;font-style:normal;font-weight:normal;line-height:125%;letter-spacing:0px;word-spacing:0px;fill:#000000;fill-opacity:1;stroke:none;font-family:Sans"
       x="283.46457"
       y="71.226364"
       id="text4708"
       sodipodi:linespacing="125%"><tspan
         sodipodi:role="line"
         id="tspan4710"
         x="283.46457"
         y="71.226364"
         style="font-size:18px;font-weight:bold;text-align:center;text-anchor:middle">5.</tspan></text>
    <text
       sodipodi:linespacing="125%"
       id="text4712"
       y="195.36076"
       x="283.46457"
       style="font-size:40px;font-style:normal;font-weight:normal;line-height:125%;letter-spacing:0px;word-spacing:0px;fill:#000000;fill-opacity:1;stroke:none;font-family:Sans"
       xml:space="preserve"><tspan
         style="font-size:18px;font-weight:bold;text-align:center;text-anchor:middle"
         y="195.36076"
         x="283.46457"
         id="tspan4714"
         sodipodi:role="line">6.</tspan></text>
    <text
       xml:space="preserve"
       style="font-size:40px;font-style:normal;font-weight:normal;line-height:125%;letter-spacing:0px;word-spacing:0px;fill:#000000;fill-opacity:1;stroke:none;font-family:Sans"
       x="283.46457"
       y="319.37653"
       id="text4716"
       sodipodi:linespacing="125%"><tspan
         sodipodi:role="line"
         id="tspan4718"
         x="283.46457"
         y="319.37653"
         style="font-size:18px;font-weight:bold;text-align:center;text-anchor:middle">7.</tspan></text>
    <text
       sodipodi:linespacing="125%"
       id="text4720"
       y="443.27362"
       x="283.46457"
       style="font-size:40px;font-style:normal;font-weight:normal;line-height:125%;letter-spacing:0px;word-spacing:0px;fill:#000000;fill-opacity:1;stroke:none;font-family:Sans"
       xml:space="preserve"><tspan
         style="font-size:18px;font-weight:bold;text-align:center;text-anchor:middle"
         y="443.27362"
         x="283.46457"
         id="tspan4722"
         sodipodi:role="line">8.</tspan></text>
  </g>
</svg>
