<?xml version="1.0" encoding="UTF-8" standalone="no"?>
<!-- Created with Inkscape (http://www.inkscape.org/) -->

<svg
   xmlns:dc="http://purl.org/dc/elements/1.1/"
   xmlns:cc="http://creativecommons.org/ns#"
   xmlns:rdf="http://www.w3.org/1999/02/22-rdf-syntax-ns#"
   xmlns:svg="http://www.w3.org/2000/svg"
   xmlns="http://www.w3.org/2000/svg"
   xmlns:sodipodi="http://sodipodi.sourceforge.net/DTD/sodipodi-0.dtd"
   xmlns:inkscape="http://www.inkscape.org/namespaces/inkscape"
   width="196.5"
   height="110.75"
   id="svg3130"
   version="1.1"
   inkscape:version="0.48.3.1 r9886"
   sodipodi:docname="timetag-ring-buf.svg">
  <defs
     id="defs3132">
    <marker
       inkscape:stockid="TriangleOutM"
       orient="auto"
       refY="0"
       refX="0"
       id="TriangleOutM"
       style="overflow:visible">
      <path
         id="path4211"
         d="m 5.77,0 -8.65,5 0,-10 8.65,5 z"
         style="fill-rule:evenodd;stroke:#000000;stroke-width:1pt"
         transform="scale(0.4,0.4)"
         inkscape:connector-curvature="0" />
    </marker>
    <marker
       inkscape:stockid="TriangleOutM"
       orient="auto"
       refY="0"
       refX="0"
       id="marker3080"
       style="overflow:visible">
      <path
         id="path3082"
         d="m 5.77,0 -8.65,5 0,-10 8.65,5 z"
         style="fill-rule:evenodd;stroke:#000000;stroke-width:1pt"
         transform="scale(0.4,0.4)"
         inkscape:connector-curvature="0" />
    </marker>
    <marker
       inkscape:stockid="TriangleOutM"
       orient="auto"
       refY="0"
       refX="0"
       id="marker3084"
       style="overflow:visible">
      <path
         id="path3086"
         d="m 5.77,0 -8.65,5 0,-10 8.65,5 z"
         style="fill-rule:evenodd;stroke:#000000;stroke-width:1pt"
         transform="scale(0.4,0.4)"
         inkscape:connector-curvature="0" />
    </marker>
    <marker
       inkscape:stockid="TriangleOutM"
       orient="auto"
       refY="0"
       refX="0"
       id="marker3088"
       style="overflow:visible">
      <path
         id="path3090"
         d="m 5.77,0 -8.65,5 0,-10 8.65,5 z"
         style="fill-rule:evenodd;stroke:#000000;stroke-width:1pt"
         transform="scale(0.4,0.4)"
         inkscape:connector-curvature="0" />
    </marker>
    <marker
       inkscape:stockid="TriangleOutM"
       orient="auto"
       refY="0"
       refX="0"
       id="marker3092"
       style="overflow:visible">
      <path
         id="path3094"
         d="m 5.77,0 -8.65,5 0,-10 8.65,5 z"
         style="fill-rule:evenodd;stroke:#000000;stroke-width:1pt"
         transform="scale(0.4,0.4)"
         inkscape:connector-curvature="0" />
    </marker>
    <marker
       inkscape:stockid="TriangleOutM"
       orient="auto"
       refY="0"
       refX="0"
       id="marker3096"
       style="overflow:visible">
      <path
         id="path3098"
         d="m 5.77,0 -8.65,5 0,-10 8.65,5 z"
         style="fill-rule:evenodd;stroke:#000000;stroke-width:1pt"
         transform="scale(0.4,0.4)"
         inkscape:connector-curvature="0" />
    </marker>
    <marker
       inkscape:stockid="TriangleOutM"
       orient="auto"
       refY="0"
       refX="0"
       id="marker3100"
       style="overflow:visible">
      <path
         id="path3102"
         d="m 5.77,0 -8.65,5 0,-10 8.65,5 z"
         style="fill-rule:evenodd;stroke:#000000;stroke-width:1pt"
         transform="scale(0.4,0.4)"
         inkscape:connector-curvature="0" />
    </marker>
  </defs>
  <sodipodi:namedview
     id="base"
     pagecolor="#ffffff"
     bordercolor="#666666"
     borderopacity="1.0"
     inkscape:pageopacity="0.0"
     inkscape:pageshadow="2"
     inkscape:zoom="3.959798"
     inkscape:cx="68.025729"
     inkscape:cy="90.277817"
     inkscape:document-units="px"
     inkscape:current-layer="layer1"
     showgrid="true"
     inkscape:window-width="1855"
     inkscape:window-height="1176"
     inkscape:window-x="65"
     inkscape:window-y="24"
     inkscape:window-maximized="1"
     fit-margin-top="0"
     fit-margin-left="0"
     fit-margin-right="0"
     fit-margin-bottom="0">
    <inkscape:grid
       type="xygrid"
       id="grid3138"
       empspacing="5"
       visible="true"
       enabled="true"
       snapvisiblegridlinesonly="true"
       spacingx="0.5px"
       spacingy="0.5px"
       originx="-249px"
       originy="-709.75px" />
  </sodipodi:namedview>
  <metadata
     id="metadata3135">
    <rdf:RDF>
      <cc:Work
         rdf:about="">
        <dc:format>image/svg+xml</dc:format>
        <dc:type
           rdf:resource="http://purl.org/dc/dcmitype/StillImage" />
        <dc:title />
      </cc:Work>
    </rdf:RDF>
  </metadata>
  <g
     inkscape:label="Layer 1"
     inkscape:groupmode="layer"
     id="layer1"
     transform="translate(-249,-231.86218)">
    <rect
       style="fill:none;stroke:#cccccc;stroke-width:1;stroke-miterlimit:4;stroke-opacity:1;stroke-dasharray:6, 6;stroke-dashoffset:0"
       id="rect4119"
       width="40"
       height="75.000031"
       x="327.5"
       y="232.36218" />
    <rect
       y="232.36218"
       x="377.5"
       height="74.999992"
       width="67.5"
       id="rect4129"
       style="fill:none;stroke:#cccccc;stroke-width:1;stroke-miterlimit:4;stroke-opacity:1;stroke-dasharray:6, 6;stroke-dashoffset:0" />
    <path
       style="fill:none;stroke:#cccccc;stroke-width:2;stroke-linecap:butt;stroke-linejoin:miter;stroke-miterlimit:4;stroke-opacity:1;stroke-dasharray:8, 2;stroke-dashoffset:17.2"
       d="m 250,327.36218 97.5,0 0,-85"
       id="path4226"
       inkscape:connector-curvature="0"
       sodipodi:nodetypes="ccc" />
    <rect
       y="249.86218"
       x="400.78735"
       height="53.14962"
       width="13.287388"
       id="rect5794"
       style="fill:none;stroke:#000000;stroke-width:1;stroke-miterlimit:4;stroke-opacity:1;stroke-dasharray:none;stroke-dashoffset:0" />
    <rect
       y="249.86218"
       x="414.07471"
       height="53.14962"
       width="13.287388"
       id="rect5796"
       style="fill:none;stroke:#000000;stroke-width:1;stroke-miterlimit:4;stroke-opacity:1;stroke-dasharray:none;stroke-dashoffset:0" />
    <rect
       style="fill:none;stroke:#000000;stroke-width:1;stroke-miterlimit:4;stroke-opacity:1;stroke-dasharray:none;stroke-dashoffset:0"
       id="rect5798"
       width="13.287388"
       height="53.14962"
       x="427.36212"
       y="249.86218" />
    <rect
       style="fill:none;stroke:#000000;stroke-width:1;stroke-miterlimit:4;stroke-opacity:1;stroke-dasharray:none;stroke-dashoffset:0"
       id="rect6253"
       width="13.287388"
       height="53.14962"
       x="387.5"
       y="249.86218" />
    <text
       xml:space="preserve"
       style="font-size:40px;font-style:normal;font-weight:normal;line-height:125%;letter-spacing:0px;word-spacing:0px;fill:#000000;fill-opacity:1;stroke:none;font-family:Sans"
       x="250"
       y="262.97513"
       id="text5992"
       sodipodi:linespacing="125%"><tspan
         sodipodi:role="line"
         id="tspan5994"
         x="250"
         y="262.97513"
         style="font-size:6px;text-align:start;text-anchor:start">Trigger channel</tspan></text>
    <text
       sodipodi:linespacing="125%"
       id="text6033"
       y="271.8334"
       x="250"
       style="font-size:40px;font-style:normal;font-weight:normal;line-height:125%;letter-spacing:0px;word-spacing:0px;fill:#000000;fill-opacity:1;stroke:none;font-family:Sans"
       xml:space="preserve"
       inkscape:transform-center-x="10.430045"
       inkscape:transform-center-y="5.4426047"><tspan
         style="font-size:6px;text-align:start;text-anchor:start"
         y="271.8334"
         x="250"
         id="tspan6035"
         sodipodi:role="line">TAI time</tspan></text>
    <text
       inkscape:transform-center-y="5.4426046"
       inkscape:transform-center-x="10.430045"
       xml:space="preserve"
       style="font-size:40px;font-style:normal;font-weight:normal;line-height:125%;letter-spacing:0px;word-spacing:0px;fill:#000000;fill-opacity:1;stroke:none;font-family:Sans"
       x="250"
       y="280.69165"
       id="text7512"
       sodipodi:linespacing="125%"><tspan
         sodipodi:role="line"
         id="tspan7514"
         x="250"
         y="280.69165"
         style="font-size:6px;text-align:start;text-anchor:start">Cycles time</tspan></text>
    <path
       style="fill:none;stroke:#000000;stroke-width:0.5;stroke-linecap:butt;stroke-linejoin:miter;stroke-miterlimit:4;stroke-opacity:1;stroke-dasharray:none;marker-start:none;marker-end:url(#TriangleOutM)"
       d="m 250,265.63264 132.5,0"
       id="path4223"
       inkscape:connector-curvature="0"
       sodipodi:nodetypes="cc" />
    <path
       style="fill:none;stroke:#000000;stroke-width:0.5;stroke-linecap:butt;stroke-linejoin:miter;stroke-miterlimit:4;stroke-opacity:1;stroke-dasharray:none;marker-end:url(#TriangleOutM)"
       d="m 250,274.49091 132.5,0"
       id="path5155"
       inkscape:connector-curvature="0"
       sodipodi:nodetypes="cc" />
    <path
       style="fill:none;stroke:#000000;stroke-width:0.5;stroke-linecap:butt;stroke-linejoin:miter;stroke-miterlimit:4;stroke-opacity:1;stroke-dasharray:none;marker-end:url(#TriangleOutM)"
       d="m 250,283.34917 132.5,0"
       id="path5157"
       inkscape:connector-curvature="0"
       sodipodi:nodetypes="cc" />
    <text
       sodipodi:linespacing="125%"
       id="text5159"
       y="289.54993"
       x="250"
       style="font-size:40px;font-style:normal;font-weight:normal;line-height:125%;letter-spacing:0px;word-spacing:0px;fill:#000000;fill-opacity:1;stroke:none;font-family:Sans"
       xml:space="preserve"><tspan
         style="font-size:6px;text-align:start;text-anchor:start"
         y="289.54993"
         x="250"
         id="tspan5161"
         sodipodi:role="line">White Rabbit time valid</tspan></text>
    <path
       style="fill:none;stroke:#000000;stroke-width:0.5;stroke-linecap:butt;stroke-linejoin:miter;stroke-miterlimit:4;stroke-opacity:1;stroke-dasharray:none;marker-end:url(#TriangleOutM)"
       d="m 250,292.20744 132.5,0"
       id="path5163"
       inkscape:connector-curvature="0"
       sodipodi:nodetypes="cc" />
    <text
       sodipodi:linespacing="125%"
       id="text3220"
       y="278.20865"
       x="394.14224"
       style="font-size:40px;font-style:normal;font-weight:normal;line-height:125%;letter-spacing:0px;word-spacing:0px;fill:#000000;fill-opacity:1;stroke:none;font-family:Sans"
       xml:space="preserve"
       inkscape:transform-center-x="10.430045"
       inkscape:transform-center-y="5.4426046"><tspan
         style="font-size:6px;font-weight:normal;text-align:center;text-anchor:middle"
         y="278.20865"
         x="394.14224"
         id="tspan3222"
         sodipodi:role="line">0</tspan></text>
    <text
       inkscape:transform-center-y="5.4426046"
       inkscape:transform-center-x="10.430045"
       xml:space="preserve"
       style="font-size:40px;font-style:normal;font-weight:normal;line-height:125%;letter-spacing:0px;word-spacing:0px;fill:#000000;fill-opacity:1;stroke:none;font-family:Sans"
       x="407.29773"
       y="278.20865"
       id="text3224"
       sodipodi:linespacing="125%"><tspan
         sodipodi:role="line"
         id="tspan3226"
         x="407.29773"
         y="278.20865"
         style="font-size:6px;font-weight:normal;text-align:center;text-anchor:middle">1</tspan></text>
    <text
       sodipodi:linespacing="125%"
       id="text3228"
       y="278.20865"
       x="433.85199"
       style="font-size:40px;font-style:normal;font-weight:normal;line-height:125%;letter-spacing:0px;word-spacing:0px;fill:#000000;fill-opacity:1;stroke:none;font-family:Sans"
       xml:space="preserve"
       inkscape:transform-center-x="10.430051"
       inkscape:transform-center-y="5.4426046"><tspan
         style="font-size:6px;font-weight:normal;text-align:center;text-anchor:middle"
         y="278.20865"
         x="433.85199"
         id="tspan3230"
         sodipodi:role="line">128</tspan></text>
    <text
       sodipodi:linespacing="125%"
       id="text3232"
       y="278.20865"
       x="420.72131"
       style="font-size:40px;font-style:normal;font-weight:normal;line-height:125%;letter-spacing:0px;word-spacing:0px;fill:#000000;fill-opacity:1;stroke:none;font-family:Sans"
       xml:space="preserve"
       inkscape:transform-center-x="10.430045"
       inkscape:transform-center-y="5.4425989"><tspan
         style="font-size:6px;font-weight:normal;text-align:center;text-anchor:middle"
         y="278.20865"
         x="420.72131"
         id="tspan3234"
         sodipodi:role="line">...</tspan></text>
    <g
       id="g4113">
      <rect
         ry="0"
         rx="0"
         style="fill:#fcfcfc;fill-opacity:1;stroke:#000000;stroke-width:1;stroke-miterlimit:4;stroke-opacity:1;stroke-dasharray:none;stroke-dashoffset:0"
         id="rect3293"
         width="20.000011"
         height="53.14962"
         x="337.5"
         y="249.86218" />
      <path
         inkscape:connector-curvature="0"
         id="path4105"
         d="m 342.5,249.86218 0,52.5"
         style="fill:none;stroke:#000000;stroke-width:1px;stroke-linecap:butt;stroke-linejoin:miter;stroke-opacity:1" />
      <path
         style="fill:none;stroke:#000000;stroke-width:1px;stroke-linecap:butt;stroke-linejoin:miter;stroke-opacity:1"
         d="m 347.5,249.86218 0,52.5"
         id="path4107"
         inkscape:connector-curvature="0" />
      <path
         inkscape:connector-curvature="0"
         id="path4109"
         d="m 352.5,249.86218 0,52.5"
         style="fill:none;stroke:#000000;stroke-width:1px;stroke-linecap:butt;stroke-linejoin:miter;stroke-opacity:1" />
    </g>
    <text
       xml:space="preserve"
       style="font-size:40px;font-style:normal;font-weight:normal;line-height:125%;letter-spacing:0px;word-spacing:0px;fill:#000000;fill-opacity:1;stroke:none;font-family:Sans"
       x="347.5"
       y="239.86218"
       id="text4121"
       sodipodi:linespacing="125%"><tspan
         sodipodi:role="line"
         x="347.5"
         y="239.86218"
         id="tspan4125"
         style="font-size:6px;font-weight:bold;text-align:center;text-anchor:middle;fill:#cccccc;fill-opacity:1">Sync. FIFO</tspan></text>
    <text
       sodipodi:linespacing="125%"
       id="text4131"
       y="239.86218"
       x="412.5"
       style="font-size:40px;font-style:normal;font-weight:normal;line-height:125%;letter-spacing:0px;word-spacing:0px;fill:#000000;fill-opacity:1;stroke:none;font-family:Sans"
       xml:space="preserve"><tspan
         style="font-size:6px;font-weight:bold;text-align:center;text-anchor:middle;fill:#cccccc;fill-opacity:1"
         id="tspan4133"
         y="239.86218"
         x="412.5"
         sodipodi:role="line">Buffer RAM</tspan></text>
    <text
       sodipodi:linespacing="125%"
       id="text4240"
       y="342.36218"
       x="327.5"
       style="font-size:40px;font-style:normal;font-weight:normal;line-height:125%;letter-spacing:0px;word-spacing:0px;fill:#000000;fill-opacity:1;stroke:none;font-family:Sans"
       xml:space="preserve"><tspan
         id="tspan4242"
         style="font-size:16px;font-weight:bold;text-align:end;text-anchor:end;fill:#cccccc;fill-opacity:1"
         y="342.36218"
         x="327.5"
         sodipodi:role="line">20 MHz</tspan></text>
    <text
       xml:space="preserve"
       style="font-size:40px;font-style:normal;font-weight:normal;line-height:125%;letter-spacing:0px;word-spacing:0px;fill:#000000;fill-opacity:1;stroke:none;font-family:Sans"
       x="327.5"
       y="322.36218"
       id="text4244"
       sodipodi:linespacing="125%"><tspan
         sodipodi:role="line"
         x="327.5"
         y="322.36218"
         style="font-size:16px;font-weight:bold;text-align:end;text-anchor:end;fill:#cccccc;fill-opacity:1"
         id="tspan4246">125 MHz</tspan></text>
    <rect
       style="fill:#cccccc;fill-opacity:1;fill-rule:evenodd;stroke:#000000;stroke-width:0.5;stroke-linecap:butt;stroke-linejoin:miter;stroke-miterlimit:4;stroke-opacity:1;stroke-dasharray:none"
       id="rect3053"
       width="52.5"
       height="20"
       x="387.5"
       y="322.36218" />
    <text
       xml:space="preserve"
       style="font-size:40px;font-style:normal;font-weight:normal;line-height:125%;letter-spacing:0px;word-spacing:0px;fill:#000000;fill-opacity:1;stroke:none;font-family:Sans"
       x="413.85547"
       y="330.24402"
       id="text3865"
       sodipodi:linespacing="125%"><tspan
         sodipodi:role="line"
         x="413.85547"
         y="330.24402"
         id="tspan3867"
         style="font-size:6px;font-weight:bold;text-align:center;text-anchor:middle;fill:#000000;fill-opacity:1">Control</tspan><tspan
         sodipodi:role="line"
         x="413.85547"
         y="337.74402"
         style="font-size:6px;font-weight:bold;text-align:center;text-anchor:middle;fill:#000000;fill-opacity:1"
         id="tspan3869">logic</tspan></text>
    <text
       xml:space="preserve"
       style="font-size:40px;font-style:normal;font-weight:normal;line-height:125%;letter-spacing:0px;word-spacing:0px;fill:#000000;fill-opacity:1;stroke:none;font-family:Sans"
       x="145.20943"
       y="102.38651"
       id="text4088"
       sodipodi:linespacing="125%"
       transform="translate(240.5,214.36218)"><tspan
         sodipodi:role="line"
         id="tspan4090"
         x="145.20943"
         y="102.38651" /></text>
    <g
       id="g4106"
       transform="translate(1.25,0)">
      <path
         sodipodi:nodetypes="cc"
         inkscape:connector-curvature="0"
         id="path3890"
         d="m 405,322.36218 0,-10"
         style="fill:none;stroke:#000000;stroke-width:1px;stroke-linecap:butt;stroke-linejoin:miter;stroke-opacity:1;marker-end:url(#marker3100)" />
      <path
         style="fill:none;stroke:#000000;stroke-width:1px;stroke-linecap:butt;stroke-linejoin:miter;stroke-opacity:1;marker-end:url(#marker3100)"
         d="m 420,322.36218 0,-10"
         id="path4086"
         inkscape:connector-curvature="0"
         sodipodi:nodetypes="cc" />
      <path
         style="fill:none;stroke:#000000;stroke-width:1px;stroke-linecap:butt;stroke-linejoin:miter;stroke-opacity:1;marker-end:url(#marker3100)"
         d="m 412.5,322.36218 0,-10"
         id="path4104"
         inkscape:connector-curvature="0"
         sodipodi:nodetypes="cc" />
    </g>
  </g>
</svg>
