{
    "allowedLicenses": [
        {
            "moduleLicense": "CC0-1.0"
        },
        {
            "moduleLicense": "GPL-3.0-or-later"
        },
        {
            "moduleLicense": "LGPL-3.0-or-later"
        },
        {
            "moduleLicense": "AGPL-3.0-or-later"
        },
        {
            "moduleLicense": "BSD-2-Clause"
        },
        {
            "moduleLicense": "BSD-4-Clause"
        },
        {
            "moduleLicense": "MPL-2.0"
        },
        {
            "moduleLicense": "Apache-2.0"
        },
        {
            "moduleLicense": "MIT"
        },
        {
            "moduleLicense": "MIT-0"
        },
        {
            "moduleLicense": "EPL-1.0"
        },
        {
            "moduleLicense": "EPL-2.0"
        },
        {
            "moduleLicense": "LGPL-2.1-only"
        },
        {
            "moduleLicense": "Public-Domain"
        }
    ]
}
