{
    "name": "qcbor",
    "description": "",
    "author": "",
    "license": "https://github.com/DaveGamble/cJSON/blob/master/LICENSE",
    "version": "1.17.5-b45f48e",
    "repository": {
        "type": "git",
        "url": ""
    },
    "platforms": [ "*" ],
    "frameworks": [ "*" ],
    "srcDir": "./QCBOR",
    "build": {
        "flags": [
            "-I./QCBOR",
            "-I./QCBOR/inc",
            "-I./QCBOR/inc/qcbor",
            "-I./QCBOR/src"
        ],
        "srcFilter": "+<./QCBOR/src/**/*.c>"
    }
}