{
  "Logging": {
    "LogLevel": {
      "Default": "Trace"
    },
    "ShowTicks": true
  },
  "Display": {
    "Width": 122,
    "Height": 250,
    "FullRefreshIntervalSeconds": 15.0,
    "MinSafeRenderIntervalSeconds": 180.0,
    "SupportsColor": true,
    "SpiFrequencyHz": 375000,
    "PinSpiClock": "SCK",
    "PinSpiMiso": "CIPO",
    "PinSpiMosi": "COPI",
    "PinSpiChipSelect": "D00",
    "PinDataCommand": "D01",
    "PinReset": "D03",
    "PinBusy": "D04",
    "PinDisplaySramChipSelect": "D02"
  },
  "Scene": {
    "BackgroundImagePath": "bitmap.bmp",
    "DebugMode": false
  }
}
