{
  "name": "hagl-lib",
  "version": "0.5.0",
  "keywords": "c, native, hagl, hardware agnostic graphics library",
  "description": "A PlatformIO library wrapper for the tuupola/hagl library.",
  "platforms": "native",
  "frameworks": "*",
  "license": "MIT",
  "authors":
  [
    {
      "name": "HAGL Authors",
      "url": "https://github.com/tuupola/hagl/graphs/contributors"
    }
  ],
  "repository":
  {
    "type": "git",
    "url": "https://github.com/tuupola/hagl.git"
  },
  "build": {
    "srcDir": "./hagl-submodule/src",
    "includeDir": "./hagl-submodule/include"
  },
  "dependencies": {
    "hagl-hal": "0.5.0"
  }
}