{
    "name": "display_colors",
    "version": "1.0.0",
    "srcDir": ".",
    "build": {
        "srcFilter": [
            "+<*.c>"
        ],
        "includeDir": "include"
    },
    "dependencies": {
        "esp-idf-st7789": "^1.0.3",
        "colors": "^1.0.0"
    }
}