(kicad_symbol_lib (version 20211014) (generator SamacSys_ECAD_Model)
  (symbol "TL3340AF160QG" (in_bom yes) (on_board yes)
    (property "Reference" "S" (at 16.51 7.62 0)
      (effects (font (size 1.27 1.27)) (justify left top))
    )
    (property "Value" "TL3340AF160QG" (at 16.51 5.08 0)
      (effects (font (size 1.27 1.27)) (justify left top))
    )
    (property "Footprint" "TL3340" (at 16.51 -94.92 0)
      (effects (font (size 1.27 1.27)) (justify left top) hide)
    )
    (property "Datasheet" "https://datasheet.datasheetarchive.com/originals/distributors/SFDatasheet-1/sf-00021244.pdf" (at 16.51 -194.92 0)
      (effects (font (size 1.27 1.27)) (justify left top) hide)
    )
    (property "ki_description" "E-SWITCH - TL3340AF160QG. - SWITCH, TACTILE SPST 50mA, SMD GULL WING" (at 16.51 -294.92 0)
      (effects (font (size 1.27 1.27)) (justify left top) hide)
    )
    (property "Height" "" (at 16.51 -394.92 0)
      (effects (font (size 1.27 1.27)) (justify left top) hide)
    )
    (property "Mouser Part Number" "612-TL3340AF160QG" (at 16.51 -494.92 0)
      (effects (font (size 1.27 1.27)) (justify left top) hide)
    )
    (property "Mouser Price/Stock" "https://www.mouser.co.uk/ProductDetail/E-Switch/TL3340AF160QG?qs=Cv1v43EOJpo402rrfE5MlQ%3D%3D" (at 16.51 -594.92 0)
      (effects (font (size 1.27 1.27)) (justify left top) hide)
    )
    (property "Manufacturer_Name" "E-Switch" (at 16.51 -694.92 0)
      (effects (font (size 1.27 1.27)) (justify left top) hide)
    )
    (property "Manufacturer_Part_Number" "TL3340AF160QG" (at 16.51 -794.92 0)
      (effects (font (size 1.27 1.27)) (justify left top) hide)
    )
    (rectangle
      (start 5.08 2.54)
      (end 15.24 -5.08)
      (stroke (width 0.254) (type default))
      (fill (type background))
    )
    (pin passive line (at 0 0 0) (length 5.08)
      (name "1" (effects (font (size 1.27 1.27))))
      (number "1" (effects (font (size 1.27 1.27))))
    )
    (pin passive line (at 0 -2.54 0) (length 5.08)
      (name "2" (effects (font (size 1.27 1.27))))
      (number "2" (effects (font (size 1.27 1.27))))
    )
    (pin passive line (at 20.32 0 180) (length 5.08)
      (name "3" (effects (font (size 1.27 1.27))))
      (number "3" (effects (font (size 1.27 1.27))))
    )
  )
)
