(kicad_sch (version 20230121) (generator eeschema)

  (uuid a270ccee-355b-43b5-9094-ac2272b0b590)

  (paper "A4")

  (lib_symbols
    (symbol "Connector_Generic:Conn_01x05" (pin_names (offset 1.016) hide) (in_bom yes) (on_board yes)
      (property "Reference" "J" (at 0 7.62 0)
        (effects (font (size 1.27 1.27)))
      )
      (property "Value" "Conn_01x05" (at 0 -7.62 0)
        (effects (font (size 1.27 1.27)))
      )
      (property "Footprint" "" (at 0 0 0)
        (effects (font (size 1.27 1.27)) hide)
      )
      (property "Datasheet" "~" (at 0 0 0)
        (effects (font (size 1.27 1.27)) hide)
      )
      (property "ki_keywords" "connector" (at 0 0 0)
        (effects (font (size 1.27 1.27)) hide)
      )
      (property "ki_description" "Generic connector, single row, 01x05, script generated (kicad-library-utils/schlib/autogen/connector/)" (at 0 0 0)
        (effects (font (size 1.27 1.27)) hide)
      )
      (property "ki_fp_filters" "Connector*:*_1x??_*" (at 0 0 0)
        (effects (font (size 1.27 1.27)) hide)
      )
      (symbol "Conn_01x05_1_1"
        (rectangle (start -1.27 -4.953) (end 0 -5.207)
          (stroke (width 0.1524) (type default))
          (fill (type none))
        )
        (rectangle (start -1.27 -2.413) (end 0 -2.667)
          (stroke (width 0.1524) (type default))
          (fill (type none))
        )
        (rectangle (start -1.27 0.127) (end 0 -0.127)
          (stroke (width 0.1524) (type default))
          (fill (type none))
        )
        (rectangle (start -1.27 2.667) (end 0 2.413)
          (stroke (width 0.1524) (type default))
          (fill (type none))
        )
        (rectangle (start -1.27 5.207) (end 0 4.953)
          (stroke (width 0.1524) (type default))
          (fill (type none))
        )
        (rectangle (start -1.27 6.35) (end 1.27 -6.35)
          (stroke (width 0.254) (type default))
          (fill (type background))
        )
        (pin passive line (at -5.08 5.08 0) (length 3.81)
          (name "Pin_1" (effects (font (size 1.27 1.27))))
          (number "1" (effects (font (size 1.27 1.27))))
        )
        (pin passive line (at -5.08 2.54 0) (length 3.81)
          (name "Pin_2" (effects (font (size 1.27 1.27))))
          (number "2" (effects (font (size 1.27 1.27))))
        )
        (pin passive line (at -5.08 0 0) (length 3.81)
          (name "Pin_3" (effects (font (size 1.27 1.27))))
          (number "3" (effects (font (size 1.27 1.27))))
        )
        (pin passive line (at -5.08 -2.54 0) (length 3.81)
          (name "Pin_4" (effects (font (size 1.27 1.27))))
          (number "4" (effects (font (size 1.27 1.27))))
        )
        (pin passive line (at -5.08 -5.08 0) (length 3.81)
          (name "Pin_5" (effects (font (size 1.27 1.27))))
          (number "5" (effects (font (size 1.27 1.27))))
        )
      )
    )
    (symbol "Connector_Generic:Conn_02x04_Odd_Even" (pin_names (offset 1.016) hide) (in_bom yes) (on_board yes)
      (property "Reference" "J" (at 1.27 5.08 0)
        (effects (font (size 1.27 1.27)))
      )
      (property "Value" "Conn_02x04_Odd_Even" (at 1.27 -7.62 0)
        (effects (font (size 1.27 1.27)))
      )
      (property "Footprint" "" (at 0 0 0)
        (effects (font (size 1.27 1.27)) hide)
      )
      (property "Datasheet" "~" (at 0 0 0)
        (effects (font (size 1.27 1.27)) hide)
      )
      (property "ki_keywords" "connector" (at 0 0 0)
        (effects (font (size 1.27 1.27)) hide)
      )
      (property "ki_description" "Generic connector, double row, 02x04, odd/even pin numbering scheme (row 1 odd numbers, row 2 even numbers), script generated (kicad-library-utils/schlib/autogen/connector/)" (at 0 0 0)
        (effects (font (size 1.27 1.27)) hide)
      )
      (property "ki_fp_filters" "Connector*:*_2x??_*" (at 0 0 0)
        (effects (font (size 1.27 1.27)) hide)
      )
      (symbol "Conn_02x04_Odd_Even_1_1"
        (rectangle (start -1.27 -4.953) (end 0 -5.207)
          (stroke (width 0.1524) (type default))
          (fill (type none))
        )
        (rectangle (start -1.27 -2.413) (end 0 -2.667)
          (stroke (width 0.1524) (type default))
          (fill (type none))
        )
        (rectangle (start -1.27 0.127) (end 0 -0.127)
          (stroke (width 0.1524) (type default))
          (fill (type none))
        )
        (rectangle (start -1.27 2.667) (end 0 2.413)
          (stroke (width 0.1524) (type default))
          (fill (type none))
        )
        (rectangle (start -1.27 3.81) (end 3.81 -6.35)
          (stroke (width 0.254) (type default))
          (fill (type background))
        )
        (rectangle (start 3.81 -4.953) (end 2.54 -5.207)
          (stroke (width 0.1524) (type default))
          (fill (type none))
        )
        (rectangle (start 3.81 -2.413) (end 2.54 -2.667)
          (stroke (width 0.1524) (type default))
          (fill (type none))
        )
        (rectangle (start 3.81 0.127) (end 2.54 -0.127)
          (stroke (width 0.1524) (type default))
          (fill (type none))
        )
        (rectangle (start 3.81 2.667) (end 2.54 2.413)
          (stroke (width 0.1524) (type default))
          (fill (type none))
        )
        (pin passive line (at -5.08 2.54 0) (length 3.81)
          (name "Pin_1" (effects (font (size 1.27 1.27))))
          (number "1" (effects (font (size 1.27 1.27))))
        )
        (pin passive line (at 7.62 2.54 180) (length 3.81)
          (name "Pin_2" (effects (font (size 1.27 1.27))))
          (number "2" (effects (font (size 1.27 1.27))))
        )
        (pin passive line (at -5.08 0 0) (length 3.81)
          (name "Pin_3" (effects (font (size 1.27 1.27))))
          (number "3" (effects (font (size 1.27 1.27))))
        )
        (pin passive line (at 7.62 0 180) (length 3.81)
          (name "Pin_4" (effects (font (size 1.27 1.27))))
          (number "4" (effects (font (size 1.27 1.27))))
        )
        (pin passive line (at -5.08 -2.54 0) (length 3.81)
          (name "Pin_5" (effects (font (size 1.27 1.27))))
          (number "5" (effects (font (size 1.27 1.27))))
        )
        (pin passive line (at 7.62 -2.54 180) (length 3.81)
          (name "Pin_6" (effects (font (size 1.27 1.27))))
          (number "6" (effects (font (size 1.27 1.27))))
        )
        (pin passive line (at -5.08 -5.08 0) (length 3.81)
          (name "Pin_7" (effects (font (size 1.27 1.27))))
          (number "7" (effects (font (size 1.27 1.27))))
        )
        (pin passive line (at 7.62 -5.08 180) (length 3.81)
          (name "Pin_8" (effects (font (size 1.27 1.27))))
          (number "8" (effects (font (size 1.27 1.27))))
        )
      )
    )
    (symbol "power:+12V" (power) (pin_names (offset 0)) (in_bom yes) (on_board yes)
      (property "Reference" "#PWR" (at 0 -3.81 0)
        (effects (font (size 1.27 1.27)) hide)
      )
      (property "Value" "+12V" (at 0 3.556 0)
        (effects (font (size 1.27 1.27)))
      )
      (property "Footprint" "" (at 0 0 0)
        (effects (font (size 1.27 1.27)) hide)
      )
      (property "Datasheet" "" (at 0 0 0)
        (effects (font (size 1.27 1.27)) hide)
      )
      (property "ki_keywords" "global power" (at 0 0 0)
        (effects (font (size 1.27 1.27)) hide)
      )
      (property "ki_description" "Power symbol creates a global label with name \"+12V\"" (at 0 0 0)
        (effects (font (size 1.27 1.27)) hide)
      )
      (symbol "+12V_0_1"
        (polyline
          (pts
            (xy -0.762 1.27)
            (xy 0 2.54)
          )
          (stroke (width 0) (type default))
          (fill (type none))
        )
        (polyline
          (pts
            (xy 0 0)
            (xy 0 2.54)
          )
          (stroke (width 0) (type default))
          (fill (type none))
        )
        (polyline
          (pts
            (xy 0 2.54)
            (xy 0.762 1.27)
          )
          (stroke (width 0) (type default))
          (fill (type none))
        )
      )
      (symbol "+12V_1_1"
        (pin power_in line (at 0 0 90) (length 0) hide
          (name "+12V" (effects (font (size 1.27 1.27))))
          (number "1" (effects (font (size 1.27 1.27))))
        )
      )
    )
    (symbol "power:GND" (power) (pin_names (offset 0)) (in_bom yes) (on_board yes)
      (property "Reference" "#PWR" (at 0 -6.35 0)
        (effects (font (size 1.27 1.27)) hide)
      )
      (property "Value" "GND" (at 0 -3.81 0)
        (effects (font (size 1.27 1.27)))
      )
      (property "Footprint" "" (at 0 0 0)
        (effects (font (size 1.27 1.27)) hide)
      )
      (property "Datasheet" "" (at 0 0 0)
        (effects (font (size 1.27 1.27)) hide)
      )
      (property "ki_keywords" "global power" (at 0 0 0)
        (effects (font (size 1.27 1.27)) hide)
      )
      (property "ki_description" "Power symbol creates a global label with name \"GND\" , ground" (at 0 0 0)
        (effects (font (size 1.27 1.27)) hide)
      )
      (symbol "GND_0_1"
        (polyline
          (pts
            (xy 0 0)
            (xy 0 -1.27)
            (xy 1.27 -1.27)
            (xy 0 -2.54)
            (xy -1.27 -1.27)
            (xy 0 -1.27)
          )
          (stroke (width 0) (type default))
          (fill (type none))
        )
      )
      (symbol "GND_1_1"
        (pin power_in line (at 0 0 270) (length 0) hide
          (name "GND" (effects (font (size 1.27 1.27))))
          (number "1" (effects (font (size 1.27 1.27))))
        )
      )
    )
  )


  (wire (pts (xy 113.03 137.16) (xy 113.03 138.43))
    (stroke (width 0) (type default))
    (uuid 02908258-0fa1-41bf-adf4-158b970bbc6a)
  )
  (wire (pts (xy 113.03 130.81) (xy 116.84 130.81))
    (stroke (width 0) (type default))
    (uuid 080b2c3b-9eaa-4b13-91e4-8b10151f6add)
  )
  (wire (pts (xy 110.49 137.16) (xy 113.03 137.16))
    (stroke (width 0) (type default))
    (uuid 0f0cdb78-4516-420f-85b0-b5907c586d12)
  )
  (wire (pts (xy 113.03 139.7) (xy 113.03 142.24))
    (stroke (width 0) (type default))
    (uuid 1fd5b697-96c1-4731-837f-84a16b80cc1c)
  )
  (wire (pts (xy 111.76 83.82) (xy 124.46 83.82))
    (stroke (width 0) (type default))
    (uuid 2221f8bc-3cbe-4517-aafb-b4deaf372e46)
  )
  (wire (pts (xy 97.79 91.44) (xy 97.79 92.71))
    (stroke (width 0) (type default))
    (uuid 3105b083-a340-4efb-ab8a-3e3478c20978)
  )
  (wire (pts (xy 111.76 88.9) (xy 125.73 88.9))
    (stroke (width 0) (type default))
    (uuid 418e34d0-0b98-43f5-8fb1-3dacf7759213)
  )
  (wire (pts (xy 113.03 129.54) (xy 113.03 127))
    (stroke (width 0) (type default))
    (uuid 443ff527-ae18-4320-88fe-288f969aac32)
  )
  (wire (pts (xy 113.03 138.43) (xy 116.84 138.43))
    (stroke (width 0) (type default))
    (uuid 4ed86547-e4d8-4850-bc39-a30f4c4cf567)
  )
  (wire (pts (xy 110.49 139.7) (xy 113.03 139.7))
    (stroke (width 0) (type default))
    (uuid 4f025347-d27b-4abe-b7c0-44140db77870)
  )
  (wire (pts (xy 113.03 132.08) (xy 113.03 130.81))
    (stroke (width 0) (type default))
    (uuid 54f61f28-fe1c-4bf7-8ad8-7f4cb61939ec)
  )
  (wire (pts (xy 114.3 91.44) (xy 114.3 92.71))
    (stroke (width 0) (type default))
    (uuid 57a3704d-50c9-4d5e-9e81-84c8f7838f1c)
  )
  (wire (pts (xy 87.63 88.9) (xy 99.06 88.9))
    (stroke (width 0) (type default))
    (uuid 67236c1f-1166-453b-b71c-9a3f4f0467e6)
  )
  (wire (pts (xy 110.49 129.54) (xy 113.03 129.54))
    (stroke (width 0) (type default))
    (uuid 74be9e9b-31a8-4d9e-bc7e-2b1a20ae01fb)
  )
  (wire (pts (xy 113.03 127) (xy 118.11 127))
    (stroke (width 0) (type default))
    (uuid 92d2b289-7f63-4475-b769-3afffee522a4)
  )
  (wire (pts (xy 87.63 86.36) (xy 99.06 86.36))
    (stroke (width 0) (type default))
    (uuid a1fef0c6-25aa-46a1-96ca-9a440edfb33a)
  )
  (wire (pts (xy 110.49 132.08) (xy 113.03 132.08))
    (stroke (width 0) (type default))
    (uuid cad15522-e76d-4d7a-9999-3a1faacbcdfc)
  )
  (wire (pts (xy 111.76 86.36) (xy 124.46 86.36))
    (stroke (width 0) (type default))
    (uuid e0de7a8c-96fd-4a31-a4a9-02541cd66387)
  )
  (wire (pts (xy 99.06 91.44) (xy 97.79 91.44))
    (stroke (width 0) (type default))
    (uuid e265eaa2-1799-4c40-8ffb-6eeb21c47d14)
  )
  (wire (pts (xy 110.49 134.62) (xy 118.11 134.62))
    (stroke (width 0) (type default))
    (uuid e800e34c-1d8d-42d3-990d-8b7cb14e8e07)
  )
  (wire (pts (xy 111.76 91.44) (xy 114.3 91.44))
    (stroke (width 0) (type default))
    (uuid ee4de8f7-c3a2-404f-8914-8cb802266845)
  )
  (wire (pts (xy 113.03 142.24) (xy 116.84 142.24))
    (stroke (width 0) (type default))
    (uuid f27b6db4-4db0-42a2-a191-8a2e7182603b)
  )
  (wire (pts (xy 87.63 83.82) (xy 99.06 83.82))
    (stroke (width 0) (type default))
    (uuid fa75178e-179e-400e-a6b0-5253cf2d47d3)
  )

  (hierarchical_label "DBG_RX" (shape input) (at 124.46 88.9 0) (fields_autoplaced)
    (effects (font (size 1.27 1.27)) (justify left))
    (uuid 0c4ce6b2-212c-467b-a795-d434e00433ff)
  )
  (hierarchical_label "WIFI_PGR_RTS" (shape input) (at 87.63 83.82 180) (fields_autoplaced)
    (effects (font (size 1.27 1.27)) (justify right))
    (uuid 45d20f72-91ea-4546-b7ce-2930c2563a61)
  )
  (hierarchical_label "WIFI_PGR_DTR" (shape input) (at 124.46 83.82 0) (fields_autoplaced)
    (effects (font (size 1.27 1.27)) (justify left))
    (uuid 4c427a3d-85fb-4c6f-9c7d-7f5f2e732e59)
  )
  (hierarchical_label "WIFI_PGR_RX" (shape input) (at 87.63 86.36 180) (fields_autoplaced)
    (effects (font (size 1.27 1.27)) (justify right))
    (uuid 5b6689cc-e4ec-4abd-9399-edac40ac099c)
  )
  (hierarchical_label "WIFI_PGR_TX" (shape output) (at 87.63 88.9 180) (fields_autoplaced)
    (effects (font (size 1.27 1.27)) (justify right))
    (uuid 670c9658-f889-491a-a399-547e1c34a9c9)
  )
  (hierarchical_label "DBG_TX" (shape output) (at 124.46 86.36 0) (fields_autoplaced)
    (effects (font (size 1.27 1.27)) (justify left))
    (uuid 994f3de9-d68e-4c16-99f4-1ec7b0f9bde2)
  )
  (hierarchical_label "IN_1" (shape bidirectional) (at 118.11 134.62 0) (fields_autoplaced)
    (effects (font (size 1.27 1.27)) (justify left))
    (uuid b2a21762-06b6-498f-98dc-a3eef8efac6e)
  )
  (hierarchical_label "IN_2" (shape bidirectional) (at 118.11 127 0) (fields_autoplaced)
    (effects (font (size 1.27 1.27)) (justify left))
    (uuid d3be7ff4-5b15-44a0-b554-f30af656e539)
  )

  (symbol (lib_id "power:GND") (at 114.3 92.71 0) (unit 1)
    (in_bom yes) (on_board yes) (dnp no) (fields_autoplaced)
    (uuid 06c9257e-7ce0-4733-a554-0dd500a0fa93)
    (property "Reference" "#PWR036" (at 114.3 99.06 0)
      (effects (font (size 1.27 1.27)) hide)
    )
    (property "Value" "GND" (at 114.3 97.79 0)
      (effects (font (size 1.27 1.27)))
    )
    (property "Footprint" "" (at 114.3 92.71 0)
      (effects (font (size 1.27 1.27)) hide)
    )
    (property "Datasheet" "" (at 114.3 92.71 0)
      (effects (font (size 1.27 1.27)) hide)
    )
    (pin "1" (uuid 3407e274-2c0b-490c-beb9-85a8d19c1c7a))
    (instances
      (project "S0-logger-controller"
        (path "/8f57aa82-d005-4733-b693-cdf5f3428c92/9d4c20b3-c737-4e9a-9964-c8c2974c7b80"
          (reference "#PWR036") (unit 1)
        )
      )
    )
  )

  (symbol (lib_id "power:GND") (at 97.79 92.71 0) (unit 1)
    (in_bom yes) (on_board yes) (dnp no) (fields_autoplaced)
    (uuid 3c69a6d5-3603-4e88-9d9a-af7f11be2033)
    (property "Reference" "#PWR035" (at 97.79 99.06 0)
      (effects (font (size 1.27 1.27)) hide)
    )
    (property "Value" "GND" (at 97.79 97.79 0)
      (effects (font (size 1.27 1.27)))
    )
    (property "Footprint" "" (at 97.79 92.71 0)
      (effects (font (size 1.27 1.27)) hide)
    )
    (property "Datasheet" "" (at 97.79 92.71 0)
      (effects (font (size 1.27 1.27)) hide)
    )
    (pin "1" (uuid 71ce4c53-cb5e-4208-9c9d-b061202522bf))
    (instances
      (project "S0-logger-controller"
        (path "/8f57aa82-d005-4733-b693-cdf5f3428c92/9d4c20b3-c737-4e9a-9964-c8c2974c7b80"
          (reference "#PWR035") (unit 1)
        )
      )
    )
  )

  (symbol (lib_id "power:GND") (at 116.84 138.43 90) (unit 1)
    (in_bom yes) (on_board yes) (dnp no) (fields_autoplaced)
    (uuid 3cbcae4a-3120-4a43-880a-71df8e6af70b)
    (property "Reference" "#PWR028" (at 123.19 138.43 0)
      (effects (font (size 1.27 1.27)) hide)
    )
    (property "Value" "GND" (at 120.65 138.4299 90)
      (effects (font (size 1.27 1.27)) (justify right))
    )
    (property "Footprint" "" (at 116.84 138.43 0)
      (effects (font (size 1.27 1.27)) hide)
    )
    (property "Datasheet" "" (at 116.84 138.43 0)
      (effects (font (size 1.27 1.27)) hide)
    )
    (pin "1" (uuid 3420eaeb-3f4c-448b-99ae-1bcce999421d))
    (instances
      (project "S0-logger-controller"
        (path "/8f57aa82-d005-4733-b693-cdf5f3428c92/9d4c20b3-c737-4e9a-9964-c8c2974c7b80"
          (reference "#PWR028") (unit 1)
        )
      )
    )
  )

  (symbol (lib_id "Connector_Generic:Conn_02x04_Odd_Even") (at 104.14 86.36 0) (unit 1)
    (in_bom yes) (on_board yes) (dnp no) (fields_autoplaced)
    (uuid 4e532009-d676-4df9-a692-8316242a3e79)
    (property "Reference" "J2" (at 105.41 77.47 0)
      (effects (font (size 1.27 1.27)))
    )
    (property "Value" "DEBUG" (at 105.41 80.01 0)
      (effects (font (size 1.27 1.27)))
    )
    (property "Footprint" "Connector_PinHeader_2.54mm:PinHeader_2x04_P2.54mm_Vertical" (at 104.14 86.36 0)
      (effects (font (size 1.27 1.27)) hide)
    )
    (property "Datasheet" "https://www.mpe-connector.de/de/produkte/stiftleisten/stiftleiste-254-mm-1/087-2#087-2-008-0-F-XS0-1000" (at 104.14 86.36 0)
      (effects (font (size 1.27 1.27)) hide)
    )
    (property "Model" "MPE 087-2-008 " (at 104.14 86.36 0)
      (effects (font (size 1.27 1.27)) hide)
    )
    (property "Sim.Enable" "0" (at 104.14 86.36 0)
      (effects (font (size 1.27 1.27)) hide)
    )
    (pin "1" (uuid 0fc774d1-9703-4c55-ad86-9de762c3de6e))
    (pin "2" (uuid 77a1ca0f-99ed-4056-b81d-6bb41086cf42))
    (pin "3" (uuid 8c4b829f-e002-4449-a151-f126ef885bd9))
    (pin "4" (uuid dcea125b-0ce2-450a-8630-f7bdc9a0a696))
    (pin "5" (uuid ba58fe2c-ff4f-40e8-a9ee-6ad0d89cef75))
    (pin "6" (uuid 882fb62d-2a49-4760-8049-1d798381923e))
    (pin "7" (uuid ac86e27c-c324-4cd8-bab6-0b5d67a70379))
    (pin "8" (uuid cd02bc40-c5df-423f-86b2-1a8fe0eab106))
    (instances
      (project "S0-logger-controller"
        (path "/8f57aa82-d005-4733-b693-cdf5f3428c92/9d4c20b3-c737-4e9a-9964-c8c2974c7b80"
          (reference "J2") (unit 1)
        )
      )
    )
  )

  (symbol (lib_id "Connector_Generic:Conn_01x05") (at 105.41 134.62 0) (mirror y) (unit 1)
    (in_bom no) (on_board yes) (dnp no)
    (uuid 7e28d979-d3e1-4a21-be5f-f76ff4c4731e)
    (property "Reference" "J3" (at 105.41 146.05 0)
      (effects (font (size 1.27 1.27)))
    )
    (property "Value" "Con Base" (at 105.41 143.51 0)
      (effects (font (size 1.27 1.27)))
    )
    (property "Footprint" "Connector_PinHeader_2.00mm:PinHeader_1x05_P2.00mm_Horizontal" (at 105.41 134.62 0)
      (effects (font (size 1.27 1.27)) hide)
    )
    (property "Datasheet" "https://cdn.amphenol-cs.com/media/wysiwyg/files/documentation/datasheet/boardwiretoboard/bwb_econostik_254headers.pdf" (at 105.41 134.62 0)
      (effects (font (size 1.27 1.27)) hide)
    )
    (property "Model" "10129379-905001BLF" (at 105.41 134.62 0)
      (effects (font (size 1.27 1.27)) hide)
    )
    (pin "1" (uuid 33233c9c-55a6-4a57-bf90-dfbe231ae2c4))
    (pin "2" (uuid e6d9227d-7125-4160-9e3b-841834e7f2d2))
    (pin "3" (uuid 9d25240b-2044-4102-b644-7ba3047d36b3))
    (pin "4" (uuid bbe596cd-85ea-48d9-9d1a-72012435c153))
    (pin "5" (uuid 1a5288a3-f361-49d8-8922-bc77162a7aa5))
    (instances
      (project "S0-logger-controller"
        (path "/8f57aa82-d005-4733-b693-cdf5f3428c92/9d4c20b3-c737-4e9a-9964-c8c2974c7b80"
          (reference "J3") (unit 1)
        )
      )
    )
  )

  (symbol (lib_id "power:+12V") (at 116.84 142.24 270) (unit 1)
    (in_bom yes) (on_board yes) (dnp no) (fields_autoplaced)
    (uuid 84b039ec-54f7-41b8-9d1a-965837bb24a1)
    (property "Reference" "#PWR029" (at 113.03 142.24 0)
      (effects (font (size 1.27 1.27)) hide)
    )
    (property "Value" "+12V" (at 120.65 142.2399 90)
      (effects (font (size 1.27 1.27)) (justify left))
    )
    (property "Footprint" "" (at 116.84 142.24 0)
      (effects (font (size 1.27 1.27)) hide)
    )
    (property "Datasheet" "" (at 116.84 142.24 0)
      (effects (font (size 1.27 1.27)) hide)
    )
    (pin "1" (uuid 07020214-6724-467f-8a4f-aacc9d3c81e5))
    (instances
      (project "S0-logger-controller"
        (path "/8f57aa82-d005-4733-b693-cdf5f3428c92/9d4c20b3-c737-4e9a-9964-c8c2974c7b80"
          (reference "#PWR029") (unit 1)
        )
      )
    )
  )

  (symbol (lib_id "power:GND") (at 116.84 130.81 90) (unit 1)
    (in_bom yes) (on_board yes) (dnp no) (fields_autoplaced)
    (uuid e21d8f3f-a928-47cb-8e93-e18711865130)
    (property "Reference" "#PWR027" (at 123.19 130.81 0)
      (effects (font (size 1.27 1.27)) hide)
    )
    (property "Value" "GND" (at 120.65 130.8099 90)
      (effects (font (size 1.27 1.27)) (justify right))
    )
    (property "Footprint" "" (at 116.84 130.81 0)
      (effects (font (size 1.27 1.27)) hide)
    )
    (property "Datasheet" "" (at 116.84 130.81 0)
      (effects (font (size 1.27 1.27)) hide)
    )
    (pin "1" (uuid 9387d7ec-2aae-4800-b915-91137b0344c7))
    (instances
      (project "S0-logger-controller"
        (path "/8f57aa82-d005-4733-b693-cdf5f3428c92/9d4c20b3-c737-4e9a-9964-c8c2974c7b80"
          (reference "#PWR027") (unit 1)
        )
      )
    )
  )
)
