(footprint "Ferrite_NLV25-EF_2.5x2.0mm" (version 20221018) (generator pcbnew)
  (layer "F.Cu")
  (attr smd)
  (fp_text reference "REF**" (at 0.6 -2.1 unlocked) (layer "F.SilkS")
      (effects (font (size 1 1) (thickness 0.15)))
    (tstamp a73aa35a-f56a-4ab0-be94-29aa8aa922d4)
  )
  (fp_text value "Ferrite_NLV25-EF_2.5x2.0mm" (at 0.1 1.8 unlocked) (layer "F.Fab")
      (effects (font (size 1 1) (thickness 0.15)))
    (tstamp af01f14f-2f48-467b-a8bd-b749c14a4f33)
  )
  (fp_text user "${REFERENCE}" (at 0.6 -2.1 unlocked) (layer "F.Fab")
      (effects (font (size 1 1) (thickness 0.15)))
    (tstamp 1d211e57-2d18-45a6-98bc-34aa92b778c8)
  )
  (fp_line (start -1.5 -1) (end -1.5 -1.2)
    (stroke (width 0.12) (type solid)) (layer "F.SilkS") (tstamp 6f560ffe-4661-4161-b1f0-ff310e5166b0))
  (fp_line (start -1.5 1.2) (end -1.5 1)
    (stroke (width 0.12) (type solid)) (layer "F.SilkS") (tstamp 6e2a0956-f92e-4f23-9a75-17b12159c8a0))
  (fp_line (start -1.5 1.2) (end 1.5 1.2)
    (stroke (width 0.12) (type solid)) (layer "F.SilkS") (tstamp 6b6a733f-aa0b-48d8-984b-428c65f863d4))
  (fp_line (start -1.4 -1.2) (end 1.5 -1.2)
    (stroke (width 0.12) (type solid)) (layer "F.SilkS") (tstamp 945a48e1-313a-4e5f-bdbb-085a0fbc7493))
  (fp_line (start 1.5 -1.2) (end 1.5 -1)
    (stroke (width 0.12) (type solid)) (layer "F.SilkS") (tstamp 1945d64e-39ee-4c40-87c0-1dd470ef6cd6))
  (fp_line (start 1.5 1) (end 1.5 1.2)
    (stroke (width 0.12) (type solid)) (layer "F.SilkS") (tstamp 25950f50-5bed-41ff-9669-c0d24efe288b))
  (fp_rect (start -1.75 -1.25) (end 1.75 1.25)
    (stroke (width 0.05) (type solid)) (fill none) (layer "F.CrtYd") (tstamp a345b07a-01aa-4712-80d4-fa03b7d69188))
  (fp_rect (start -1.25 -1) (end 1.25 1)
    (stroke (width 0.1) (type solid)) (fill none) (layer "F.Fab") (tstamp ef998601-0fb0-4f20-a21f-58efd76b85f0))
  (pad "1" smd rect (at -1.25 0) (size 1 1.5) (layers "F.Cu" "F.Paste" "F.Mask") (tstamp c461ef94-3a3e-4c19-9462-e12ca661b5ed))
  (pad "2" smd rect (at 1.25 0) (size 1 1.5) (layers "F.Cu" "F.Paste" "F.Mask") (tstamp 52806842-cddb-4dba-af68-48b0b68ff4ae))
  (model "${KIPRJMOD}/libraries/3d/Ferrite_SMD.3dshapes/NLCV25T-100K-EF003.step"
    (offset (xyz 0 0 0))
    (scale (xyz 1 1 1))
    (rotate (xyz 0 0 0))
  )
)
