(footprint "RTL-00" (version 20211014) (generator pcbnew)
  (layer "F.Cu")
  (tedit 0)
  (attr smd)
  (fp_text reference "REF**" (at -0.1 -1.3 unlocked) (layer "F.SilkS")
    (effects (font (size 1 1) (thickness 0.15)))
    (tstamp 7783df20-15b3-4089-a559-87f11036ec45)
  )
  (fp_text value "RTL-00" (at 8 13.5 unlocked) (layer "F.Fab")
    (effects (font (size 1 1) (thickness 0.15)))
    (tstamp 2fd1d116-5334-4f06-9ec3-8606b0a7c133)
  )
  (fp_text user "Keepout Zone" (at 8 4 unlocked) (layer "Cmts.User")
    (effects (font (size 1.5 1.5) (thickness 0.3)))
    (tstamp a870d4cc-1b71-4c4d-b3d2-f8b239bdd534)
  )
  (fp_text user "Antenna" (at 8 1.5 unlocked) (layer "Cmts.User")
    (effects (font (size 1.5 1.5) (thickness 0.3)))
    (tstamp c07f7fdb-b60b-4e6b-b9ba-803f68eca49c)
  )
  (fp_text user "${REFERENCE}" (at 8.5 11.5 unlocked) (layer "F.Fab")
    (effects (font (size 1 1) (thickness 0.15)))
    (tstamp 3904c9b2-6537-4535-9547-775c2fce333c)
  )
  (fp_line (start -0.4 24.4) (end -0.4 22.7) (layer "F.SilkS") (width 0.12) (tstamp 282a6e9b-1296-4911-b966-8da4a9babdeb))
  (fp_line (start -0.4 -0.4) (end -0.4 6.9) (layer "F.SilkS") (width 0.12) (tstamp 3a75b5da-e24d-4de4-9c88-ecc896788cbc))
  (fp_line (start 16.4 24.4) (end 16.4 22.7) (layer "F.SilkS") (width 0.12) (tstamp 61a9568c-a36f-4590-9f67-80412b2e809e))
  (fp_line (start 16.4 -0.4) (end 0.2 -0.4) (layer "F.SilkS") (width 0.12) (tstamp 7b4182cf-d41e-4574-b53f-888eb47746ab))
  (fp_line (start 16.4 7.1) (end 16.4 -0.4) (layer "F.SilkS") (width 0.12) (tstamp d58812f8-effa-4a4f-a2f2-9abbe5cc23e6))
  (fp_line (start 2.2 24.4) (end -0.4 24.4) (layer "F.SilkS") (width 0.12) (tstamp d5f34f56-ec22-4524-b4ea-a915fa08a33a))
  (fp_line (start 13.8 24.4) (end 16.4 24.4) (layer "F.SilkS") (width 0.12) (tstamp e1651b75-2a6a-4cca-a677-969d936b7bc6))
  (fp_rect (start -0.5 -0.5) (end 16.5 24.5) (layer "F.CrtYd") (width 0.05) (fill none) (tstamp d39a008d-5034-49a6-80c6-8f5f5e260028))
  (fp_rect (start 0 0) (end 16 24) (layer "F.Fab") (width 0.1) (fill none) (tstamp 1be06d2d-cded-464a-8ea0-bf54aaa2abca))
  (pad "1" smd rect (at 0 7.9) (size 2.2 0.9) (layers "F.Cu" "F.Paste" "F.Mask") (tstamp 1804b89e-9024-4772-a6f7-bddf90bdaaaf))
  (pad "2" smd rect (at 0 9.9) (size 2.2 0.9) (layers "F.Cu" "F.Paste" "F.Mask") (tstamp 32e73cb7-68cf-4e15-bdaa-2a7e6ae9eab7))
  (pad "3" smd rect (at 0 11.9) (size 2.2 0.9) (layers "F.Cu" "F.Paste" "F.Mask") (tstamp 2e609e77-a7d9-4b73-acc8-04f54be899cc))
  (pad "4" smd rect (at 0 13.9) (size 2.2 0.9) (layers "F.Cu" "F.Paste" "F.Mask") (tstamp 1836dd91-2051-4db3-aeab-9f8f6f3b689f))
  (pad "5" smd rect (at -0.1 15.9) (size 2.2 0.9) (layers "F.Cu" "F.Paste" "F.Mask") (tstamp 9691d40f-db06-4379-81e2-38f40d161db8))
  (pad "6" smd rect (at 0 17.9) (size 2.2 0.9) (layers "F.Cu" "F.Paste" "F.Mask") (tstamp 6e1fec94-a119-4ce7-8b13-3e7225ed573f))
  (pad "7" smd rect (at 0 19.9) (size 2.2 0.9) (layers "F.Cu" "F.Paste" "F.Mask") (tstamp ba747233-9b51-46ec-a2df-174430f96dda))
  (pad "8" smd rect (at 0 21.9) (size 2.2 0.9) (layers "F.Cu" "F.Paste" "F.Mask") (tstamp be969f10-80ae-4dae-8c35-d4caf4f69995))
  (pad "9" smd rect (at 3 24) (size 0.9 2.2) (layers "F.Cu" "F.Paste" "F.Mask") (tstamp c79f8ff2-3207-4895-9ee9-1244864c3c74))
  (pad "10" smd rect (at 5 24) (size 0.9 2.2) (layers "F.Cu" "F.Paste" "F.Mask") (tstamp 285ab1ed-dfa6-4342-a4d8-412097b6be77))
  (pad "11" smd rect (at 7 24) (size 0.9 2.2) (layers "F.Cu" "F.Paste" "F.Mask") (tstamp 61dd9479-22c2-4db2-967e-cb77aed84c99))
  (pad "12" smd rect (at 9 24) (size 0.9 2.2) (layers "F.Cu" "F.Paste" "F.Mask") (tstamp 8708d701-a61b-4270-9356-b50976239975))
  (pad "13" smd rect (at 11 24) (size 0.9 2.2) (layers "F.Cu" "F.Paste" "F.Mask") (tstamp f555d9e1-3a85-4c8d-a039-caa856483b0e))
  (pad "14" smd rect (at 13 24) (size 0.9 2.2) (layers "F.Cu" "F.Paste" "F.Mask") (tstamp be2130f9-3fc6-4be8-a81e-aef0931556e6))
  (pad "15" smd rect (at 16 21.9) (size 2.2 0.9) (layers "F.Cu" "F.Paste" "F.Mask") (tstamp 5c296e09-cb4e-4512-9992-c1bcbb23d84b))
  (pad "16" smd rect (at 16 19.9) (size 2.2 0.9) (layers "F.Cu" "F.Paste" "F.Mask") (tstamp defe5314-1db5-4c0f-86c2-3707cbf079a4))
  (pad "17" smd rect (at 16 17.9) (size 2.2 0.9) (layers "F.Cu" "F.Paste" "F.Mask") (tstamp a68490b3-c46c-4847-b3b2-996337aaa5ab))
  (pad "18" smd rect (at 16 15.9) (size 2.2 0.9) (layers "F.Cu" "F.Paste" "F.Mask") (tstamp 36b89e56-61fe-4ac6-8c12-27cb19bf8f23))
  (pad "19" smd rect (at 16 13.9) (size 2.2 0.9) (layers "F.Cu" "F.Paste" "F.Mask") (tstamp a30c96e5-f860-4527-9533-08788a61d823))
  (pad "20" smd rect (at 16 11.9) (size 2.2 0.9) (layers "F.Cu" "F.Paste" "F.Mask") (tstamp ba7a4520-51fb-4f46-ae18-1ae374676c42))
  (pad "21" smd rect (at 16 9.9) (size 2.2 0.9) (layers "F.Cu" "F.Paste" "F.Mask") (tstamp 9539c315-72af-4e6a-8cba-d5e581d0de6c))
  (pad "22" smd rect (at 16 7.9) (size 2.2 0.9) (layers "F.Cu" "F.Paste" "F.Mask") (tstamp 8ffb9950-825e-40a8-a84a-97c952a90add))
  (zone (net 0) (net_name "") (layers *.Cu) (tstamp 6abd9b3c-930d-42d1-8922-d90091a7d05e) (name "Antenna Keepout Zone") (hatch full 0.508)
    (connect_pads (clearance 0))
    (min_thickness 0.254)
    (keepout (tracks not_allowed) (vias not_allowed) (pads not_allowed) (copperpour not_allowed) (footprints not_allowed))
    (fill (thermal_gap 0.508) (thermal_bridge_width 0.508))
    (polygon
      (pts
        (xy 16 6.5)
        (xy 0 6.5)
        (xy 0 0)
        (xy 16 0)
      )
    )
  )
)
