(footprint "BOURNS-SRN5040" (version 20221018) (generator pcbnew)
  (layer "F.Cu")
  (attr smd)
  (fp_text reference "REF**" (at -0.15 3.9) (layer "F.SilkS")
      (effects (font (size 0.8 0.8) (thickness 0.15)))
    (tstamp 22338f5d-bf82-4760-bd8e-b9db81f6c54f)
  )
  (fp_text value "BOURNS-SRN5040" (at 0 -3.9) (layer "F.Fab")
      (effects (font (size 0.8 0.8) (thickness 0.15)))
    (tstamp 8fb26156-8ff5-4594-acd0-c8d459a8c5d5)
  )
  (fp_text user "${REFERENCE}" (at 0 0 unlocked) (layer "F.Fab")
      (effects (font (size 1 1) (thickness 0.15)))
    (tstamp a8cfd2ae-b6d4-4536-8baa-9c879ede88b8)
  )
  (fp_line (start -2.8 -2.6) (end -1.6 -2.6)
    (stroke (width 0.12) (type solid)) (layer "F.SilkS") (tstamp bcf69ec2-fe27-435f-8468-11631d5f3121))
  (fp_line (start -2.8 -1.4) (end -2.8 -2.6)
    (stroke (width 0.12) (type solid)) (layer "F.SilkS") (tstamp a28aa58c-4f82-4e60-91a0-d24bb9d03bea))
  (fp_line (start -2.8 2.6) (end -2.8 1.4)
    (stroke (width 0.12) (type solid)) (layer "F.SilkS") (tstamp e12fd95c-8cd5-436a-b77f-affa89420dc7))
  (fp_line (start -2.8 2.6) (end -1.6 2.6)
    (stroke (width 0.12) (type solid)) (layer "F.SilkS") (tstamp 6256b4b2-9b69-4135-967c-38a160747de3))
  (fp_line (start 1.6 -2.6) (end 2.8 -2.6)
    (stroke (width 0.12) (type solid)) (layer "F.SilkS") (tstamp 01516354-202a-456f-a0fc-6ea5f3ecd7f0))
  (fp_line (start 1.6 2.6) (end 2.8 2.6)
    (stroke (width 0.12) (type solid)) (layer "F.SilkS") (tstamp e1df8eec-b226-4e4e-b03e-ef1def2dfc1f))
  (fp_line (start 2.8 -2.6) (end 2.8 -1.4)
    (stroke (width 0.12) (type solid)) (layer "F.SilkS") (tstamp f65227b3-0211-4d2c-a4ad-d1727ac50976))
  (fp_line (start 2.8 2.6) (end 2.8 1.4)
    (stroke (width 0.12) (type solid)) (layer "F.SilkS") (tstamp c3dc8d25-25da-4bfa-bfc8-d336880a8338))
  (fp_line (start -2.5 -2.5) (end 2.5 -2.5)
    (stroke (width 0.05) (type solid)) (layer "F.CrtYd") (tstamp 2c4e2aa2-838b-4243-a192-89cb0b3132c3))
  (fp_line (start -2.5 2.5) (end -2.5 -2.5)
    (stroke (width 0.05) (type solid)) (layer "F.CrtYd") (tstamp baaf117d-7057-4a30-9906-b8b86a7159f4))
  (fp_line (start 2.5 -2.5) (end 2.5 2.5)
    (stroke (width 0.05) (type solid)) (layer "F.CrtYd") (tstamp 2692f72b-840e-44af-ba51-c972bcb218a5))
  (fp_line (start 2.5 2.5) (end -2.5 2.5)
    (stroke (width 0.05) (type solid)) (layer "F.CrtYd") (tstamp 77bf537e-705f-453c-906f-f3be2b7b42da))
  (fp_line (start -2.5 -2.5) (end 2.5 -2.5)
    (stroke (width 0.1) (type solid)) (layer "F.Fab") (tstamp 0edf2bef-3340-4ffc-a907-dca99b7e5d5e))
  (fp_line (start -2.5 2.5) (end -2.5 -2.5)
    (stroke (width 0.1) (type solid)) (layer "F.Fab") (tstamp 0ddd5ee6-10b5-4658-b9b2-7af6a62e560b))
  (fp_line (start 2.5 -2.5) (end 2.5 2.5)
    (stroke (width 0.1) (type solid)) (layer "F.Fab") (tstamp 36decf80-6a64-4309-9382-26fb45533f6a))
  (fp_line (start 2.5 2.5) (end -2.5 2.5)
    (stroke (width 0.1) (type solid)) (layer "F.Fab") (tstamp b015e2af-7487-4517-8d53-8e3c0f1589c8))
  (pad "1" smd rect (at -1.8 0) (size 1.5 4) (layers "F.Cu" "F.Paste" "F.Mask") (tstamp 7317c1c7-d352-455f-a738-c1b7d8f8e918))
  (pad "2" smd rect (at 1.8 0) (size 1.5 4) (layers "F.Cu" "F.Paste" "F.Mask") (tstamp 5ac8a830-3ac3-4285-9bea-04fac425ff3e))
  (model "${KIPRJMOD}/libraries/3d/Inductor_SMD.3dshapes/Bourns_SRN5040.stp"
    (offset (xyz -22.75 -2.5 0))
    (scale (xyz 1 1 1))
    (rotate (xyz -90 0 0))
  )
)
